{"text_format":"1","workbook":"xlsx","n_sheets":9,"sheets":["Orçamento","Resumo ","Somatório","Cronog_90_Dias","Composição BDI","Relatório CENTRAL","Parc Maior Relev","Composições","Cotações"],"not_rendered":{"charts":0,"images":3,"macros":1,"external_links":2,"defined_names":152,"comments":3,"pivot_tables":0},"unopened":[],"bounds":{"document_bytes":16777216,"sheet_cells":100000,"rows_first":2000,"rows_last":500,"rows_between":2000,"halvings":0,"cell_chars":16384,"cell_head_chars":4096},"cells_cut":0,"cells_raw":0,"read":"whole","date_system":"1900"}

{"sheet":"Orçamento","index":0,"n_rows":406,"n_cols":24,"rows_kept":406,"cut":false,"hidden":false,"merged":[[341,16,341,22],[8,12,9,12],[376,18,376,20],[376,21,376,22],[0,14,0,22],[8,14,8,16],[9,14,9,16],[11,14,11,16],[12,14,12,16],[14,14,14,22],[1,14,1,22],[4,14,4,22],[7,14,7,22],[360,18,360,20],[360,21,360,22],[368,21,368,22],[357,15,357,17],[358,15,358,17],[359,15,359,17],[361,21,361,22],[369,18,369,20],[369,21,369,22],[367,18,367,20],[367,21,367,22],[375,18,375,20],[375,21,375,22],[362,18,362,20],[362,21,362,22],[355,18,355,20],[355,21,355,22],[377,18,377,20],[377,21,377,22],[331,20,331,21],[353,18,353,20],[353,21,353,22],[354,18,354,20],[354,21,354,22],[352,18,352,20],[352,21,352,22],[361,18,361,20],[332,20,332,21],[343,18,343,22],[349,18,349,20],[349,21,349,22],[350,18,350,20],[350,21,350,22],[351,18,351,20],[351,21,351,22],[374,18,374,20],[374,21,374,22],[371,21,371,22],[372,18,372,20],[372,21,372,22],[373,18,373,20],[373,21,373,22],[363,18,363,20],[363,21,363,22],[370,18,370,20],[370,21,370,22],[365,21,365,22],[366,18,366,20],[366,21,366,22],[368,18,368,20],[364,18,364,20],[364,21,364,22],[365,18,365,20],[369,15,369,17],[370,15,370,17],[371,15,371,17],[372,15,372,17],[373,15,373,17],[346,14,346,23],[335,20,335,21],[334,20,334,21],[330,17,335,17],[330,20,330,21],[347,18,347,20],[347,21,347,22],[348,18,348,20],[348,21,348,22],[336,20,336,21],[356,18,356,20],[356,21,356,22],[357,18,357,20],[357,21,357,22],[358,18,358,20],[358,21,358,22],[359,18,359,20],[359,21,359,22],[371,18,371,20],[348,15,348,17],[349,15,349,17],[350,15,350,17],[351,15,351,17],[352,15,352,17],[353,15,353,17],[354,15,354,17],[355,15,355,17],[356,15,356,17],[360,15,360,17],[361,15,361,17],[362,15,362,17],[363,15,363,17],[364,15,364,17],[365,15,365,17],[366,15,366,17],[367,15,367,17],[368,15,368,17],[338,16,338,22],[339,16,339,22],[340,16,340,22],[3,21,3,22],[2,21,2,22],[5,21,5,22],[10,14,10,23],[13,14,13,23],[6,21,6,22],[2,14,2,20],[3,14,3,20],[5,18,5,20],[6,18,6,20],[6,14,6,17],[5,14,5,17],[12,21,12,22],[12,18,12,20],[8,18,8,20],[8,21,8,22],[342,16,342,22],[405,18,405,20],[405,21,405,22],[402,14,402,17],[399,15,399,17],[399,18,399,20],[399,21,399,22],[400,15,400,17],[400,18,400,20],[400,21,400,22],[401,15,401,17],[401,18,401,20],[401,21,401,22],[404,18,404,20],[404,21,404,22],[403,18,403,20],[403,21,403,22],[380,14,380,23],[381,18,381,20],[381,21,381,22],[382,15,382,17],[382,18,382,20],[382,21,382,22],[383,15,383,17],[374,14,374,17],[381,15,381,17],[347,15,347,17],[402,18,402,20],[402,21,402,22],[390,15,390,17],[390,18,390,20],[390,21,390,22],[391,15,391,17],[391,18,391,20],[391,21,391,22],[392,15,392,17],[392,18,392,20],[392,21,392,22],[396,15,396,17],[396,18,396,20],[396,21,396,22],[397,15,397,17],[397,18,397,20],[397,21,397,22],[398,15,398,17],[387,15,387,17],[383,18,383,20],[383,21,383,22],[398,18,398,20],[398,21,398,22],[393,15,393,17],[393,18,393,20],[393,21,393,22],[394,15,394,17],[394,18,394,20],[394,21,394,22],[395,15,395,17],[395,18,395,20],[395,21,395,22],[387,18,387,20],[387,21,387,22],[388,15,388,17],[388,18,388,20],[388,21,388,22],[389,15,389,17],[389,18,389,20],[389,21,389,22],[384,15,384,17],[384,18,384,20],[384,21,384,22],[385,15,385,17],[385,18,385,20],[385,21,385,22],[386,15,386,17],[386,18,386,20],[386,21,386,22]]}
[]
[]
[null,null,null,null,null,null,null,null,null,null,null,null,null,null,"UNIDADE ESCOLAR",null,null,null,null,null,null,"CÓDIGO INEP"]
[null,null,null,null,null,null,null,null,null,null,null,null,null,null,"ACERVO DAS ESCOLAS EXTINTAS DE GOIÂNIA"]
[]
["Nmax",null,null,null,null,null,null,null,null,null,null,null,null,null,"OBRA",null,null,null,"DATA",null,null,"CIDADE"]
[{"$f":"MAX($C$18:$C$330)","v":3},null,null,null,null,null,null,null,null,null,null,null,null,null,"AMPLIAÇÃO E REFORMA",null,null,null,"2020-09-02",null,null,"GOIÂNIA"]
[]
[null,null,null,null,null,null,null,null,null,null,null,null,"",null,"CRE",null,null,"ENDEREÇO","REFERÊNCIA AGETOP",null,null,"REFERÊNCIA SINAPI"]
[null,null,null,null,null,null,null,null,null,null,null,null,null,null,"GOIÂNIA",null,null,"AV. HUGO DE CARVALHO RAMOS, VILA IRANY","ABR/19","ONERADA",null,"OUT/19","ONERADA"]
[]
[null,null,null,null,null,null,null,null,null,null,null,null,null,null,"ÁREA EXISTENTE (M²)",null,null,"ÁREA A CONSTRUIR (M²)","ÁREA A DEMOLIR (M²)",null,null,"ÁREA TOTAL CONSTRUÍDA (M²)"]
[null,null,null,null,null,null,null,null,null,null,null,null,null,null,2374.2600000000002,null,null,39.49,null,null,null,2413.75]
[]
[null,null,null,null,null,null,null,null,null,null,null,"FILTRO",null,null,"PLANILHA ORÇAMENTÁRIA"]
["Nível E","Save Nivel","Nível C","Altura","n1","n2","n3","n4","n5","Czero","Cnível","↓","Nível","Nível Corrigido","ITEM","TABELA","CODIGO","DESCRIÇÃO DOS SERVIÇOS","UNID","QUANT","MAT","MO","T.SERVIÇO","OBSERVAÇÕES¹"]
[{"$f":"CHOOSE(1+LOG(1+2*(ORÇAMENTO.Nivel=\"Nível 1\")+4*(ORÇAMENTO.Nivel=\"Nível 2\")+8*(ORÇAMENTO.Nivel=\"Nível 3\")+16*(ORÇAMENTO.Nivel=\"Nível 4\")+32*(ORÇAMENTO.Nivel=\"Serviço\"),2),0,1,2,3,4,\"S\")","v":"S"},{"$f":"IF(OR(C17=\"s\",C17=0),OFFSET(B17,-1,0),C17)","v":"Save Nivel"},{"$f":"IF(OFFSET(C17,-1,0)=\"L\",1,IF(OFFSET(C17,-1,0)=1,2,IF(OR(A17=\"s\",A17=0),\"S\",IF(AND(OFFSET(C17,-1,0)=2,A17=4),3,IF(AND(OR(OFFSET(C17,-1,0)=\"s\",OFFSET(C17,-1,0)=0),A17<>\"s\",A17>OFFSET(B17,-1,0)),OFFSET(B17,-1,0),A17)))))","v":"S"},{"$f":"IF(OR(C17=\"S\",C17=0),0,IF(ISERROR(K17),J17,SMALL(J17:K17,1)))","v":0},{"$f":"IF($C17=1,OFFSET(E17,-1,0)+1,OFFSET(E17,-1,0))","v":"n1"},{"$f":"IF($C17=1,0,IF($C17=2,OFFSET(F17,-1,0)+1,OFFSET(F17,-1,0)))","v":"n2"},{"$f":"IF(AND($C17<=2,$C17<>0),0,IF($C17=3,OFFSET(G17,-1,0)+1,OFFSET(G17,-1,0)))","v":"n3"},{"$f":"IF(AND($C17<=3,$C17<>0),0,IF($C17=4,OFFSET(H17,-1,0)+1,OFFSET(H17,-1,0)))","v":"n4"},{"$f":"IF(AND($C17<=4,$C17<>0),0,IF(AND($C17=\"S\",$W17>0),OFFSET(I17,-1,0)+1,OFFSET(I17,-1,0)))","v":"n5"},{"$f":"IF(OR($C17=\"S\",$C17=0),0,MATCH(0,OFFSET($D17,1,$C17,ROW($C$330)-ROW($C17)),0))","v":0},{"$f":"IF(OR($C17=\"S\",$C17=0),0,MATCH(OFFSET($D17,0,$C17)+1,OFFSET($D17,1,$C17,ROW($C$330)-ROW($C17)),0))","v":0},"","Serviço","Serviço","-","SINAPI",null,"(sem código)","-",null,0,0,0,""]
[0,null,"L",{"$f":"COUNTA(OFFSET(D18,1,0):D$330)","v":311},{"$f":"LEFT(O19,1)-1","v":0},null,null,null,null,null,null,"F","LOTE","LOTE","AMPLIAÇÃO E REFORMA - ACERVO DAS ESCOLAS EXTINTAS DE GOIÂNIA",null,null,null,null,null,null,null,326838.71999999991]
[1,{"$f":"IF(OR(C19=\"s\",C19=0),OFFSET(B19,-1,0),C19)","v":1},{"$f":"IF(OFFSET(C19,-1,0)=\"L\",1,IF(OFFSET(C19,-1,0)=1,2,IF(OR(A19=\"s\",A19=0),\"S\",IF(AND(OFFSET(C19,-1,0)=2,A19=4),3,IF(AND(OR(OFFSET(C19,-1,0)=\"s\",OFFSET(C19,-1,0)=0),A19<>\"s\",A19>OFFSET(B19,-1,0)),OFFSET(B19,-1,0),A19)))))","v":1},{"$f":"IF(OR(C19=\"S\",C19=0),0,IF(ISERROR(K19),J19,SMALL(J19:K19,1)))","v":275},{"$f":"IF($C19=1,OFFSET(E19,-1,0)+1,OFFSET(E19,-1,0))","v":1},{"$f":"IF($C19=1,0,IF($C19=2,OFFSET(F19,-1,0)+1,OFFSET(F19,-1,0)))","v":0},{"$f":"IF(AND($C19<=2,$C19<>0),0,IF($C19=3,OFFSET(G19,-1,0)+1,OFFSET(G19,-1,0)))","v":0},{"$f":"IF(AND($C19<=3,$C19<>0),0,IF($C19=4,OFFSET(H19,-1,0)+1,OFFSET(H19,-1,0)))","v":0},0,{"$f":"IF(OR($C19=\"S\",$C19=0),0,MATCH(0,OFFSET($D19,1,$C19,ROW($C$330)-ROW($C19)),0))","v":311},{"$f":"IF(OR($C19=\"S\",$C19=0),0,MATCH(OFFSET($D19,0,$C19)+1,OFFSET($D19,1,$C19,ROW($C$330)-ROW($C19)),0))","v":275},"F","Nível 1","Nível 1","1.","AGETOP",null,"AMPLIAÇÃO E REFORMA"]
[2,{"$f":"IF(OR(C20=\"s\",C20=0),OFFSET(B20,-1,0),C20)","v":2},{"$f":"IF(OFFSET(C20,-1,0)=\"L\",1,IF(OFFSET(C20,-1,0)=1,2,IF(OR(A20=\"s\",A20=0),\"S\",IF(AND(OFFSET(C20,-1,0)=2,A20=4),3,IF(AND(OR(OFFSET(C20,-1,0)=\"s\",OFFSET(C20,-1,0)=0),A20<>\"s\",A20>OFFSET(B20,-1,0)),OFFSET(B20,-1,0),A20)))))","v":2},{"$f":"IF(OR(C20=\"S\",C20=0),0,IF(ISERROR(K20),J20,SMALL(J20:K20,1)))","v":57},{"$f":"IF($C20=1,OFFSET(E20,-1,0)+1,OFFSET(E20,-1,0))","v":1},{"$f":"IF($C20=1,0,IF($C20=2,OFFSET(F20,-1,0)+1,OFFSET(F20,-1,0)))","v":1},{"$f":"IF(AND($C20<=2,$C20<>0),0,IF($C20=3,OFFSET(G20,-1,0)+1,OFFSET(G20,-1,0)))","v":0},{"$f":"IF(AND($C20<=3,$C20<>0),0,IF($C20=4,OFFSET(H20,-1,0)+1,OFFSET(H20,-1,0)))","v":0},0,274,57,"F","Nível 2","Nível 2","1.1.","AGETOP",null,"SERVIÇOS PRELIMINARES"]
[{"$f":"CHOOSE(1+LOG(1+2*(ORÇAMENTO.Nivel=\"Nível 1\")+4*(ORÇAMENTO.Nivel=\"Nível 2\")+8*(ORÇAMENTO.Nivel=\"Nível 3\")+16*(ORÇAMENTO.Nivel=\"Nível 4\")+32*(ORÇAMENTO.Nivel=\"Serviço\"),2),0,1,2,3,4,\"S\")","v":3},{"$f":"IF(OR(C21=\"s\",C21=0),OFFSET(B21,-1,0),C21)","v":3},{"$f":"IF(OFFSET(C21,-1,0)=\"L\",1,IF(OFFSET(C21,-1,0)=1,2,IF(OR(A21=\"s\",A21=0),\"S\",IF(AND(OFFSET(C21,-1,0)=2,A21=4),3,IF(AND(OR(OFFSET(C21,-1,0)=\"s\",OFFSET(C21,-1,0)=0),A21<>\"s\",A21>OFFSET(B21,-1,0)),OFFSET(B21,-1,0),A21)))))","v":3},{"$f":"IF(OR(C21=\"S\",C21=0),0,IF(ISERROR(K21),J21,SMALL(J21:K21,1)))","v":5},{"$f":"IF($C21=1,OFFSET(E21,-1,0)+1,OFFSET(E21,-1,0))","v":1},{"$f":"IF($C21=1,0,IF($C21=2,OFFSET(F21,-1,0)+1,OFFSET(F21,-1,0)))","v":1},{"$f":"IF(AND($C21<=2,$C21<>0),0,IF($C21=3,OFFSET(G21,-1,0)+1,OFFSET(G21,-1,0)))","v":1},{"$f":"IF(AND($C21<=3,$C21<>0),0,IF($C21=4,OFFSET(H21,-1,0)+1,OFFSET(H21,-1,0)))","v":0},{"$f":"IF(AND($C21<=4,$C21<>0),0,IF(AND($C21=\"S\",$W21>0),OFFSET(I21,-1,0)+1,OFFSET(I21,-1,0)))","v":0},56,5,"F","Nível 3","Nível 3","1.1.1.","SINAPI",null,"COBERTURA BLOCO 06","-",null,null,null,null,""]
["S",3,"S",0,1,1,1,0,0,0,0,"F","Serviço","Serviço","1.1.1.1.","AGETOP",20101,"DEMOLICAO COBERTURA TELHA CERAMICA C/ TRANSP. ATÉ CB. E CARGA","m2    ",156.29,null,null,null,""]
["S",3,"S",0,1,1,1,0,0,0,0,"F","Serviço","Serviço","1.1.1.2.","AGETOP",20103,"DEMOLIÇÃO ESTRUTURA EM MADEIRA TELHADO C/ TRANSP. ATÉ CB. E CARGA","m2    ",156.29,null,null,null,""]
["S",3,"S",0,1,1,1,0,0,0,0,"F","Serviço","Serviço","1.1.1.3.","SINAPI",97640,"REMOÇÃO DE FORROS DE DRYWALL, PVC E FIBROMINERAL, DE FORMA MANUAL, SEM REAPROVEITAMENTO. AF_12/2017","M2",103.86,null,null,null,""]
["S",3,"S",0,1,1,1,0,0,0,0,"F","Serviço","Serviço","1.1.1.4.","SINAPI",97642,"REMOÇÃO DE TRAMA METÁLICA OU DE MADEIRA PARA FORRO, DE FORMA MANUAL, SEM REAPROVEITAMENTO. AF_12/2017","M2",103.86,null,null,null,""]
[3,3,3,5,1,1,2,0,0,51,5,"F","Nível 3","Nível 3","1.1.2.","SINAPI",null,"COBERTURA BLOCO 01","-",null,null,null,null,""]
["S",3,"S",0,1,1,2,0,0,0,0,"F","Serviço","Serviço","1.1.2.1.","AGETOP",20101,"DEMOLICAO COBERTURA TELHA CERAMICA C/ TRANSP. ATÉ CB. E CARGA","m2    ",292.87,null,null,null,""]
["S",3,"S",0,1,1,2,0,0,0,0,"F","Serviço","Serviço","1.1.2.2.","AGETOP",20103,"DEMOLIÇÃO ESTRUTURA EM MADEIRA TELHADO C/ TRANSP. ATÉ CB. E CARGA","m2    ",292.87,null,null,null,""]
["S",3,"S",0,1,1,2,0,0,0,0,"F","Serviço","Serviço","1.1.2.3.","SINAPI",97640,"REMOÇÃO DE FORROS DE DRYWALL, PVC E FIBROMINERAL, DE FORMA MANUAL, SEM REAPROVEITAMENTO. AF_12/2017","M2",205.92,null,null,null,""]
["S",3,"S",0,1,1,2,0,0,0,0,"F","Serviço","Serviço","1.1.2.4.","SINAPI",97642,"REMOÇÃO DE TRAMA METÁLICA OU DE MADEIRA PARA FORRO, DE FORMA MANUAL, SEM REAPROVEITAMENTO. AF_12/2017","M2",205.92,null,null,null,""]
[3,3,3,5,1,1,3,0,0,46,5,"F","Nível 3","Nível 3","1.1.3.","SINAPI",null,"COBERTURA BLOCO 02","-",null,null,null,null,""]
["S",3,"S",0,1,1,3,0,0,0,0,"F","Serviço","Serviço","1.1.3.1.","AGETOP",20102,"DEMOLICAO-COBERTURA TELHA FIBROCIMENTO/FIBRA DE VIDRO/SIMILARES C/ TRANSP. ATÉ CB. E CARGA","m2    ",90.16,null,null,null,""]
["S",3,"S",0,1,1,3,0,0,0,0,"F","Serviço","Serviço","1.1.3.2.","AGETOP",20103,"DEMOLIÇÃO ESTRUTURA EM MADEIRA TELHADO C/ TRANSP. ATÉ CB. E CARGA","m2    ",90.16,null,null,null,""]
["S",3,"S",0,1,1,3,0,0,0,0,"F","Serviço","Serviço","1.1.3.3.","SINAPI",97640,"REMOÇÃO DE FORROS DE DRYWALL, PVC E FIBROMINERAL, DE FORMA MANUAL, SEM REAPROVEITAMENTO. AF_12/2017","M2",43.53,null,null,null,""]
["S",3,"S",0,1,1,3,0,0,0,0,"F","Serviço","Serviço","1.1.3.4.","SINAPI",97642,"REMOÇÃO DE TRAMA METÁLICA OU DE MADEIRA PARA FORRO, DE FORMA MANUAL, SEM REAPROVEITAMENTO. AF_12/2017","M2",43.53,null,null,null,""]
[3,3,3,3,1,1,4,0,0,41,3,"F","Nível 3","Nível 3","1.1.4.","SINAPI",null,"COBERTURA BLOCO 03","-",null,null,null,null,""]
["S",3,"S",0,1,1,4,0,0,0,0,"F","Serviço","Serviço","1.1.4.1.","AGETOP",20102,"DEMOLICAO-COBERTURA TELHA FIBROCIMENTO/FIBRA DE VIDRO/SIMILARES C/ TRANSP. ATÉ CB. E CARGA","m2    ",209.59,null,null,null,""]
["S",3,"S",0,1,1,4,0,0,0,0,"F","Serviço","Serviço","1.1.4.2.","AGETOP",20103,"DEMOLIÇÃO ESTRUTURA EM MADEIRA TELHADO C/ TRANSP. ATÉ CB. E CARGA","m2    ",209.59,null,null,null,""]
[3,3,3,3,1,1,5,0,0,38,3,"F","Nível 3","Nível 3","1.1.5.","SINAPI",null,"HALL","-",null,null,null,null,""]
["S",3,"S",0,1,1,5,0,0,0,0,"F","Serviço","Serviço","1.1.5.1.","SINAPI",97622,"DEMOLIÇÃO DE ALVENARIA DE BLOCO FURADO, DE FORMA MANUAL, SEM REAPROVEITAMENTO. AF_12/2017","M3",1.6920000000000002,null,null,null,"Referência: AGETOP - 20118"]
["S",3,"S",0,1,1,5,0,0,0,0,"F","Serviço","Serviço","1.1.5.2.","SINAPI",97645,"REMOÇÃO DE JANELAS, DE FORMA MANUAL, SEM REAPROVEITAMENTO. AF_12/2017","M2",1.2899999999999998,null,null,null,"Referência: AGETOP - 20106"]
[3,3,3,9,1,1,6,0,0,35,9,"F","Nível 3","Nível 3","1.1.6.","SINAPI",null,"WC FUNCIONÁRIOS / DIRETORIA","-",null,null,null,null,""]
["S",3,"S",0,1,1,6,0,0,0,0,"F","Serviço","Serviço","1.1.6.1.","SINAPI",97622,"DEMOLIÇÃO DE ALVENARIA DE BLOCO FURADO, DE FORMA MANUAL, SEM REAPROVEITAMENTO. AF_12/2017","M3",4.5884999999999998,null,null,null,"Referência: AGETOP - 20118"]
["S",3,"S",0,1,1,6,0,0,0,0,"F","Serviço","Serviço","1.1.6.2.","SINAPI",97644,"REMOÇÃO DE PORTAS, DE FORMA MANUAL, SEM REAPROVEITAMENTO. AF_12/2017","M2",6.6000000000000005,null,null,null,"Referência: AGETOP - 20106"]
["S",3,"S",0,1,1,6,0,0,0,0,"F","Serviço","Serviço","1.1.6.3.","AGETOP",20137,"DEMOLIÇAO BACIA SANITARIA C/ TRANSP. ATÉ CB. E CARGA","Un    ",3,null,null,null,""]
["S",3,"S",0,1,1,6,0,0,0,0,"F","Serviço","Serviço","1.1.6.4.","AGETOP",20140,"DEMOLIÇAO DE VÁLVULA DE DESCARGA C/ TRANSP. ATÉ CB. E CARGA","Un    ",3,null,null,null,""]
["S",3,"S",0,1,1,6,0,0,0,0,"F","Serviço","Serviço","1.1.6.5.","AGETOP",20138,"DEMOLIÇAO DE LAVATÓRIO C/ TRANSP. ATÉ CB. E CARGA","Un    ",1,null,null,null,""]
["S",3,"S",0,1,1,6,0,0,0,0,"F","Serviço","Serviço","1.1.6.6.","AGETOP",20163,"DEMOLIÇÃO DAS INSTALAÇÕES HIDROSANITÁRIAS E AFINS C/ TRANSP. ATÉ CB. E CARGA","H     ",1,null,null,null,""]
["S",3,"S",0,1,1,6,0,0,0,0,"F","Serviço","Serviço","1.1.6.7.","AGETOP",20112,"DEM.PISO CERAM. INCLUS. RETIRADA DE CONTRAPISO SOBRE LASTRO CONC.C/TR.CB.E CARGA","m2    ",32.79,null,null,null,""]
["S",3,"S",0,1,1,6,0,0,0,0,"F","Serviço","Serviço","1.1.6.8.","SINAPI",97633,"DEMOLIÇÃO DE REVESTIMENTO CERÂMICO, DE FORMA MANUAL, SEM REAPROVEITAMENTO. AF_12/2017","M2",15.7,null,null,null,"Referência: AGETOP - 20115"]
[3,3,3,3,1,1,7,0,0,26,3,"F","Nível 3","Nível 3","1.1.7.","SINAPI",null,"ACESSIBILIDADE","-",null,null,null,null,""]
["S",3,"S",0,1,1,7,0,0,0,0,"F","Serviço","Serviço","1.1.7.1.","COMPOSIÇÃO","COMP 010_SEE","DEMOLIÇÃO DE GRADE/GRELHA/CORRIMÃO/GUARDA CORPO - METÁLICO","M2",21.549599999999998,null,null,null,""]
["S",3,"S",0,1,1,7,0,0,0,0,"F","Serviço","Serviço","1.1.7.2.","AGETOP",20121,"DEM. MANUAL EM CONCR.SIMPLES C/TR.ATE CB.E CARGA (O.C.)","m3    ",1.9485000000000001,null,null,null,""]
[3,3,3,3,1,1,8,0,0,23,3,"F","Nível 3","Nível 3","1.1.8.","SINAPI",null,"COBERTURA BLOCO 04","-",null,null,null,null,""]
["S",3,"S",0,1,1,8,0,0,0,0,"F","Serviço","Serviço","1.1.8.1.","AGETOP",20102,"DEMOLICAO-COBERTURA TELHA FIBROCIMENTO/FIBRA DE VIDRO/SIMILARES C/ TRANSP. ATÉ CB. E CARGA","m2    ",236.92,null,null,null,""]
["S",3,"S",0,1,1,8,0,0,0,0,"F","Serviço","Serviço","1.1.8.2.","AGETOP",20103,"DEMOLIÇÃO ESTRUTURA EM MADEIRA TELHADO C/ TRANSP. ATÉ CB. E CARGA","m2    ",236.92,null,null,null,""]
[3,3,3,6,1,1,9,0,0,20,6,"F","Nível 3","Nível 3","1.1.9.","SINAPI",null,"VESTIÁRIO","-",null,null,null,null,""]
["S",3,"S",0,1,1,9,0,0,0,0,"F","Serviço","Serviço","1.1.9.1.","SINAPI",97622,"DEMOLIÇÃO DE ALVENARIA DE BLOCO FURADO, DE FORMA MANUAL, SEM REAPROVEITAMENTO. AF_12/2017","M3",9.6509999999999998,null,null,null,"Referência: AGETOP - 20118"]
["S",3,"S",0,1,1,9,0,0,0,0,"F","Serviço","Serviço","1.1.9.2.","SINAPI",97644,"REMOÇÃO DE PORTAS, DE FORMA MANUAL, SEM REAPROVEITAMENTO. AF_12/2017","M2",14.64,null,null,null,"Referência: AGETOP - 20106"]
["S",3,"S",0,1,1,9,0,0,0,0,"F","Serviço","Serviço","1.1.9.3.","AGETOP",20139,"DEMOLIÇAO DE BANCADAS C/ TRANSP. ATÉ CB. E CARGA","m2    ",0.48,null,null,null,""]
["S",3,"S",0,1,1,9,0,0,0,0,"F","Serviço","Serviço","1.1.9.4.","AGETOP",20112,"DEM.PISO CERAM. INCLUS. RETIRADA DE CONTRAPISO SOBRE LASTRO CONC.C/TR.CB.E CARGA","m2    ",27.72,null,null,null,""]
["S",3,"S",0,1,1,9,0,0,0,0,"F","Serviço","Serviço","1.1.9.5.","SINAPI",97633,"DEMOLIÇÃO DE REVESTIMENTO CERÂMICO, DE FORMA MANUAL, SEM REAPROVEITAMENTO. AF_12/2017","M2",56.94,null,null,null,"Referência: AGETOP - 20115"]
[3,3,3,6,1,1,10,0,0,14,6,"F","Nível 3","Nível 3","1.1.10.","SINAPI",null,"BLOCO 02","-",null,null,null,null,""]
["S",3,"S",0,1,1,10,0,0,0,0,"F","Serviço","Serviço","1.1.10.1.","SINAPI",97622,"DEMOLIÇÃO DE ALVENARIA DE BLOCO FURADO, DE FORMA MANUAL, SEM REAPROVEITAMENTO. AF_12/2017","M3",1.0785,null,null,null,"Referência: AGETOP - 20118"]
["S",3,"S",0,1,1,10,0,0,0,0,"F","Serviço","Serviço","1.1.10.2.","AGETOP",20163,"DEMOLIÇÃO DAS INSTALAÇÕES HIDROSANITÁRIAS E AFINS C/ TRANSP. ATÉ CB. E CARGA","H     ",1,null,null,null,""]
["S",3,"S",0,1,1,10,0,0,0,0,"F","Serviço","Serviço","1.1.10.3.","AGETOP",20139,"DEMOLIÇAO DE BANCADAS C/ TRANSP. ATÉ CB. E CARGA","m2    ",1.77,null,null,null,""]
["S",3,"S",0,1,1,10,0,0,0,0,"F","Serviço","Serviço","1.1.10.4.","SINAPI",97633,"DEMOLIÇÃO DE REVESTIMENTO CERÂMICO, DE FORMA MANUAL, SEM REAPROVEITAMENTO. AF_12/2017","M2",60.75,null,null,null,"Referência: AGETOP - 20115"]
["S",3,"S",0,1,1,10,0,0,0,0,"F","Serviço","Serviço","1.1.10.5.","AGETOP",20112,"DEM.PISO CERAM. INCLUS. RETIRADA DE CONTRAPISO SOBRE LASTRO CONC.C/TR.CB.E CARGA","m2    ",81.17,null,null,null,""]
[3,3,3,2,1,1,11,0,0,8,2,"F","Nível 3","Nível 3","1.1.11.","SINAPI",null,"SECRETARIA","-",null,null,null,null,""]
["S",3,"S",0,1,1,11,0,0,0,0,"F","Serviço","Serviço","1.1.11.1.","AGETOP",20139,"DEMOLIÇAO DE BANCADAS C/ TRANSP. ATÉ CB. E CARGA","m2    ",2,null,null,null,""]
[3,3,3,4,1,1,12,0,0,6,4,"F","Nível 3","Nível 3","1.1.12.","SINAPI",null,"INST. ELÉTRICAS","-",null,null,null,null,""]
["S",3,"S",0,1,1,12,0,0,0,0,"F","Serviço","Serviço","1.1.12.1.","SINAPI",97661,"REMOÇÃO DE CABOS ELÉTRICOS, DE FORMA MANUAL, SEM REAPROVEITAMENTO. AF_12/2017","M",1250,null,null,null,""]
["S",3,"S",0,1,1,12,0,0,0,0,"F","Serviço","Serviço","1.1.12.2.","SINAPI",97660,"REMOÇÃO DE INTERRUPTORES/TOMADAS ELÉTRICAS, DE FORMA MANUAL, SEM REAPROVEITAMENTO. AF_12/2017","UN",60,null,null,null,""]
["S",3,"S",0,1,1,12,0,0,0,0,"F","Serviço","Serviço","1.1.12.3.","SINAPI",97665,"REMOÇÃO DE LUMINÁRIAS, DE FORMA MANUAL, SEM REAPROVEITAMENTO. AF_12/2017","UN",280,null,null,null,""]
[{"$f":"CHOOSE(1+LOG(1+2*(ORÇAMENTO.Nivel=\"Nível 1\")+4*(ORÇAMENTO.Nivel=\"Nível 2\")+8*(ORÇAMENTO.Nivel=\"Nível 3\")+16*(ORÇAMENTO.Nivel=\"Nível 4\")+32*(ORÇAMENTO.Nivel=\"Serviço\"),2),0,1,2,3,4,\"S\")","v":3},{"$f":"IF(OR(C75=\"s\",C75=0),OFFSET(B75,-1,0),C75)","v":3},{"$f":"IF(OFFSET(C75,-1,0)=\"L\",1,IF(OFFSET(C75,-1,0)=1,2,IF(OR(A75=\"s\",A75=0),\"S\",IF(AND(OFFSET(C75,-1,0)=2,A75=4),3,IF(AND(OR(OFFSET(C75,-1,0)=\"s\",OFFSET(C75,-1,0)=0),A75<>\"s\",A75>OFFSET(B75,-1,0)),OFFSET(B75,-1,0),A75)))))","v":3},{"$f":"IF(OR(C75=\"S\",C75=0),0,IF(ISERROR(K75),J75,SMALL(J75:K75,1)))","v":2},{"$f":"IF($C75=1,OFFSET(E75,-1,0)+1,OFFSET(E75,-1,0))","v":1},{"$f":"IF($C75=1,0,IF($C75=2,OFFSET(F75,-1,0)+1,OFFSET(F75,-1,0)))","v":1},{"$f":"IF(AND($C75<=2,$C75<>0),0,IF($C75=3,OFFSET(G75,-1,0)+1,OFFSET(G75,-1,0)))","v":13},{"$f":"IF(AND($C75<=3,$C75<>0),0,IF($C75=4,OFFSET(H75,-1,0)+1,OFFSET(H75,-1,0)))","v":0},{"$f":"IF(AND($C75<=4,$C75<>0),0,IF(AND($C75=\"S\",$W75>0),OFFSET(I75,-1,0)+1,OFFSET(I75,-1,0)))","v":0},2,{"$error":"#N/A"},"F","Nível 3","Nível 3","1.1.13.","SINAPI",null,"OUTROS","-",null,null,null,null,""]
["S",3,"S",0,1,1,13,0,0,0,0,"F","Serviço","Serviço","1.1.13.1.","SINAPI","74209/1","PLACA DE OBRA EM CHAPA DE ACO GALVANIZADO","M2",7.5,null,null,null,"Referência: AGETOP - 21301"]
[2,2,2,3,1,2,0,0,0,217,3,"F","Nível 2","Nível 2","1.2.","AGETOP",null,"TRANSPORTES","-",null,null,null,null,""]
["S",2,"S",0,1,2,0,0,0,0,0,"F","Serviço","Serviço","1.2.0.1.","SINAPI",72900,"TRANSPORTE DE ENTULHO COM CAMINHAO BASCULANTE 6 M3, RODOVIA PAVIMENTADA, DMT 0,5 A 1,0 KM","M3",112.72300000000001,null,null,null,""]
["S",2,"S",0,1,2,0,0,0,0,0,"F","Serviço","Serviço","1.2.0.2.","SINAPI",72897,"CARGA MANUAL DE ENTULHO EM CAMINHAO BASCULANTE 6 M3","M3",112.72300000000001,null,null,null,""]
[2,2,2,13,1,3,0,0,0,214,13,"F","Nível 2","Nível 2","1.3.","AGETOP",null,"SERVIÇO EM TERRA","-",null,null,null,null,""]
[3,3,3,3,1,3,1,0,0,12,3,"F","Nível 3","Nível 3","1.3.1.","SINAPI",null,"HALL","-",null,null,null,null,""]
["S",3,"S",0,1,3,1,0,0,0,0,"F","Serviço","Serviço","1.3.1.1.","AGETOP",41140,"REGULARIZAÇÃO DO TERRENO SEM APILOAMENTO COM TRANSPORTE MANUAL DA TERRA ESCAVADA ","m2    ",23.77,null,null,null,""]
["S",3,"S",0,1,3,1,0,0,{"$f":"IF(OR($C83=\"S\",$C83=0),0,MATCH(0,OFFSET($D83,1,$C83,ROW($C$330)-ROW($C83)),0))","v":0},{"$f":"IF(OR($C83=\"S\",$C83=0),0,MATCH(OFFSET($D83,0,$C83)+1,OFFSET($D83,1,$C83,ROW($C$330)-ROW($C83)),0))","v":0},"F","Serviço","Serviço","1.3.1.2.","AGETOP",41002,"APILOAMENTO","m2    ",23.77,null,null,null,""]
[3,3,3,6,1,3,2,0,0,9,6,"F","Nível 3","Nível 3","1.3.2.","SINAPI",null,"ACESSIBILIDADE","-",null,null,null,null,""]
["S",3,"S",0,1,3,2,0,0,0,0,"F","Serviço","Serviço","1.3.2.1.","SINAPI",79480,"ESCAVACAO MECANICA CAMPO ABERTO EM SOLO EXCETO ROCHA ATE 2,00M PROFUNDIDADE","M3",3.875,null,null,null,"Referência: AGETOP - 41004"]
["S",3,"S",0,1,3,2,0,0,0,0,"F","Serviço","Serviço","1.3.2.2.","SINAPI",72898,"CARGA E DESCARGA MECANIZADAS DE ENTULHO EM CAMINHAO BASCULANTE 6 M3","M3",3.875,null,null,null,"Referência: AGETOP - 41005"]
["S",3,"S",0,1,3,2,0,0,0,0,"F","Serviço","Serviço","1.3.2.3.","AGETOP",41012,"INDENIZAÇÃO DE JAZIDA","m3    ",3.875,null,null,null,""]
["S",3,"S",0,1,3,2,0,0,0,0,"F","Serviço","Serviço","1.3.2.4.","AGETOP",41006,"TRANSPORTE DE MATERIAL ESCAVADO M3.KM","m3km  ",38.75,null,null,null,""]
["S",3,"S",0,1,3,2,0,0,0,0,"F","Serviço","Serviço","1.3.2.5.","SINAPI","74005/2","COMPACTACAO MECANICA C/ CONTROLE DO GC>=95% DO PN (AREAS) (C/MONIVELADORA 140 HP E ROLO COMPRESSOR VIBRATORIO 80 HP)","M3",3.1,null,null,null,"Referência: AGETOP - 41008"]
[3,3,3,3,1,3,3,0,0,3,124,"F","Nível 3","Nível 3","1.3.3.","SINAPI",null,"INST. ELÉTRICAS","-",null,null,null,null,""]
["S",3,"S",0,1,3,3,0,0,0,0,"F","Serviço","Serviço","1.3.3.1.","SINAPI",93358,"ESCAVAÇÃO MANUAL DE VALA COM PROFUNDIDADE MENOR OU IGUAL A 1,30 M. AF_03/2016","M3",4.32,null,null,null,"Referência: AGETOP - 40101"]
["S",3,"S",0,1,3,3,0,0,0,0,"F","Serviço","Serviço","1.3.3.2.","SINAPI",96995,"REATERRO MANUAL APILOADO COM SOQUETE. AF_10/2017","M3",4.32,null,null,null,"Referência: AGETOP - 40902"]
[{"$f":"CHOOSE(1+LOG(1+2*(ORÇAMENTO.Nivel=\"Nível 1\")+4*(ORÇAMENTO.Nivel=\"Nível 2\")+8*(ORÇAMENTO.Nivel=\"Nível 3\")+16*(ORÇAMENTO.Nivel=\"Nível 4\")+32*(ORÇAMENTO.Nivel=\"Serviço\"),2),0,1,2,3,4,\"S\")","v":2},{"$f":"IF(OR(C93=\"s\",C93=0),OFFSET(B93,-1,0),C93)","v":2},{"$f":"IF(OFFSET(C93,-1,0)=\"L\",1,IF(OFFSET(C93,-1,0)=1,2,IF(OR(A93=\"s\",A93=0),\"S\",IF(AND(OFFSET(C93,-1,0)=2,A93=4),3,IF(AND(OR(OFFSET(C93,-1,0)=\"s\",OFFSET(C93,-1,0)=0),A93<>\"s\",A93>OFFSET(B93,-1,0)),OFFSET(B93,-1,0),A93)))))","v":2},{"$f":"IF(OR(C93=\"S\",C93=0),0,IF(ISERROR(K93),J93,SMALL(J93:K93,1)))","v":37},{"$f":"IF($C93=1,OFFSET(E93,-1,0)+1,OFFSET(E93,-1,0))","v":1},{"$f":"IF($C93=1,0,IF($C93=2,OFFSET(F93,-1,0)+1,OFFSET(F93,-1,0)))","v":4},{"$f":"IF(AND($C93<=2,$C93<>0),0,IF($C93=3,OFFSET(G93,-1,0)+1,OFFSET(G93,-1,0)))","v":0},{"$f":"IF(AND($C93<=3,$C93<>0),0,IF($C93=4,OFFSET(H93,-1,0)+1,OFFSET(H93,-1,0)))","v":0},{"$f":"IF(AND($C93<=4,$C93<>0),0,IF(AND($C93=\"S\",$W93>0),OFFSET(I93,-1,0)+1,OFFSET(I93,-1,0)))","v":0},201,37,"F","Nível 2","Nível 2","1.4.",null,null,"INSTALAÇÕES ELÉTRICAS","-",null,null,null,null,""]
["S",2,"S",0,1,4,0,0,0,0,0,"F","Serviço","Serviço","1.4.0.1.","AGETOP",70351,"BRACADEIRA METALICA TIPO \"U\" DIAM. 3/4\"","Un    ",200,null,null,null,""]
["S",2,"S",0,1,4,0,0,0,0,0,"F","Serviço","Serviço","1.4.0.2.","AGETOP",70352,"BRACADEIRA METALICA TIPO \"U\" DIAM. 1\"","Un    ",120,null,null,null,""]
["S",2,"S",0,1,4,0,0,0,0,0,"F","Serviço","Serviço","1.4.0.3.","AGETOP",70353,"BRACADEIRA METALICA TIPO \"U\" DIAM. 1.1/4\"","Un    ",4,null,null,null,""]
[{"$f":"CHOOSE(1+LOG(1+2*(ORÇAMENTO.Nivel=\"Nível 1\")+4*(ORÇAMENTO.Nivel=\"Nível 2\")+8*(ORÇAMENTO.Nivel=\"Nível 3\")+16*(ORÇAMENTO.Nivel=\"Nível 4\")+32*(ORÇAMENTO.Nivel=\"Serviço\"),2),0,1,2,3,4,\"S\")","v":"S"},2,"S",0,1,4,0,0,0,0,0,"F","Serviço","Serviço","1.4.0.4.","AGETOP",70354,"BRACADEIRA METALICA TIPO \"U\" DIAM. 1.1/2\"","Un    ",40,null,null,null,""]
["S",2,"S",0,1,4,0,0,0,0,0,"F","Serviço","Serviço","1.4.0.5.","AGETOP",70421,"BUCHA E ARRUELA METALICA DIAM. 3/4\"","PR    ",30,null,null,null,""]
["S",2,"S",0,1,4,0,0,0,0,0,"F","Serviço","Serviço","1.4.0.6.","AGETOP",70422,"BUCHA E ARRUELA METALICA DIAM. 1\"","PR    ",30,null,null,null,""]
["S",2,"S",0,1,4,0,0,0,0,0,"F","Serviço","Serviço","1.4.0.7.","AGETOP",70424,"BUCHA E ARRUELA METALICA DIAM. 1.1/2\"","PR    ",20,null,null,null,""]
["S",2,"S",0,1,4,0,0,0,0,0,"F","Serviço","Serviço","1.4.0.8.","SINAPI",92980,"CABO DE COBRE FLEXÍVEL ISOLADO, 10 MM², ANTI-CHAMA 0,6/1,0 KV, PARA DISTRIBUIÇÃO - FORNECIMENTO E INSTALAÇÃO. AF_12/2015","M",300,null,null,null,""]
["S",2,"S",0,1,4,0,0,0,0,0,"F","Serviço","Serviço","1.4.0.9.","SINAPI",92982,"CABO DE COBRE FLEXÍVEL ISOLADO, 16 MM², ANTI-CHAMA 0,6/1,0 KV, PARA DISTRIBUIÇÃO - FORNECIMENTO E INSTALAÇÃO. AF_12/2015","M",35,null,null,null,""]
["S",2,"S",0,1,4,0,0,0,0,0,"F","Serviço","Serviço","1.4.0.10.","SINAPI",92984,"CABO DE COBRE FLEXÍVEL ISOLADO, 25 MM², ANTI-CHAMA 0,6/1,0 KV, PARA DISTRIBUIÇÃO - FORNECIMENTO E INSTALAÇÃO. AF_12/2015","M",100,null,null,null,"Referência: AGETOP - 70511"]
["S",2,"S",0,1,4,0,0,0,0,0,"F","Serviço","Serviço","1.4.0.11.","SINAPI",96971,"CORDOALHA DE COBRE NU 16 MM², NÃO ENTERRADA, COM ISOLADOR - FORNECIMENTO E INSTALAÇÃO. AF_12/2017","M",55,null,null,null,"Referência: AGETOP - 70541"]
["S",2,"S",0,1,4,0,0,0,0,0,"F","Serviço","Serviço","1.4.0.12.","SINAPI",91927,"CABO DE COBRE FLEXÍVEL ISOLADO, 2,5 MM², ANTI-CHAMA 0,6/1,0 KV, PARA CIRCUITOS TERMINAIS - FORNECIMENTO E INSTALAÇÃO. AF_12/2015","M",200,null,null,null,"Referência: AGETOP - 70581"]
["S",2,"S",0,1,4,0,0,0,0,0,"F","Serviço","Serviço","1.4.0.13.","SINAPI",91929,"CABO DE COBRE FLEXÍVEL ISOLADO, 4 MM², ANTI-CHAMA 0,6/1,0 KV, PARA CIRCUITOS TERMINAIS - FORNECIMENTO E INSTALAÇÃO. AF_12/2015","M",1050,null,null,null,"Referência: AGETOP - 70582"]
["S",2,"S",0,1,4,0,0,0,0,0,"F","Serviço","Serviço","1.4.0.14.","SINAPI",92868,"CAIXA RETANGULAR 4\" X 2\" MÉDIA (1,30 M DO PISO), METÁLICA, INSTALADA EM PAREDE - FORNECIMENTO E INSTALAÇÃO. AF_12/2015","UN",68,null,null,null,"Referência: AGETOP - 70691"]
["S",2,"S",0,1,4,0,0,0,0,0,"F","Serviço","Serviço","1.4.0.15.","SINAPI",93653,"DISJUNTOR MONOPOLAR TIPO DIN, CORRENTE NOMINAL DE 10A - FORNECIMENTO E INSTALAÇÃO. AF_04/2016","UN",10,null,null,null,""]
["S",2,"S",0,1,4,0,0,0,0,0,"F","Serviço","Serviço","1.4.0.16.","SINAPI",93654,"DISJUNTOR MONOPOLAR TIPO DIN, CORRENTE NOMINAL DE 16A - FORNECIMENTO E INSTALAÇÃO. AF_04/2016","UN",5,null,null,null,""]
["S",2,"S",0,1,4,0,0,0,0,0,"F","Serviço","Serviço","1.4.0.17.","SINAPI",93656,"DISJUNTOR MONOPOLAR TIPO DIN, CORRENTE NOMINAL DE 25A - FORNECIMENTO E INSTALAÇÃO. AF_04/2016","UN",10,null,null,null,""]
["S",2,"S",0,1,4,0,0,{"$f":"IF(AND($C111<=4,$C111<>0),0,IF(AND($C111=\"S\",$W111>0),OFFSET(I111,-1,0)+1,OFFSET(I111,-1,0)))","v":0},0,0,"F","Serviço","Serviço","1.4.0.18.","SINAPI",93673,"DISJUNTOR TRIPOLAR TIPO DIN, CORRENTE NOMINAL DE 50A - FORNECIMENTO E INSTALAÇÃO. AF_04/2016","UN",4,null,null,null,"Referência: AGETOP - 71174"]
["S",2,"S",0,1,4,0,0,0,0,0,"F","Serviço","Serviço","1.4.0.19.","SINAPI","74130/5","DISJUNTOR TERMOMAGNETICO TRIPOLAR PADRAO NEMA (AMERICANO) 60 A 100A 240V, FORNECIMENTO E INSTALACAO","UN",2,null,null,null,""]
["S",2,"S",0,1,4,0,0,0,0,0,"F","Serviço","Serviço","1.4.0.20.","AGETOP",71184,"DISPOSITIVO DE PROTEÇÃO CONTRA SURTOS (D.P.S.) 275V DE 8 A 40KA","Un    ",9,null,null,null,""]
["S",2,"S",0,1,4,0,0,0,0,0,"F","Serviço","Serviço","1.4.0.21.","SINAPI",95749,"ELETRODUTO DE AÇO GALVANIZADO, CLASSE LEVE, DN 20 MM (3/4\u0092\u0092), APARENTE, INSTALADO EM PAREDE - FORNECIMENTO E INSTALAÇÃO. AF_11/2016_P","M",200,null,null,null,"Referência: AGETOP - 71211"]
["S",2,"S",0,1,4,0,0,0,0,0,"F","Serviço","Serviço","1.4.0.22.","SINAPI",95750,"ELETRODUTO DE AÇO GALVANIZADO, CLASSE LEVE, DN 25 MM (1\u0092\u0092), APARENTE, INSTALADO EM PAREDE - FORNECIMENTO E INSTALAÇÃO. AF_11/2016_P","M",50,null,null,null,""]
["S",2,"S",0,1,4,0,0,0,0,0,"F","Serviço","Serviço","1.4.0.23.","SINAPI",95752,"ELETRODUTO DE AÇO GALVANIZADO, CLASSE SEMI PESADO, DN 40 MM (1 1/2  ), APARENTE, INSTALADO EM PAREDE - FORNECIMENTO E INSTALAÇÃO. AF_11/2016_P","M",100,null,null,null,""]
["S",2,"S",0,1,4,0,0,0,0,0,"F","Serviço","Serviço","1.4.0.24.","AGETOP",71321,"FITA DE AUTO FUSAO, ROLO E 10,00 MM","Un    ",5,null,null,null,""]
["S",2,"S",0,1,4,0,0,0,0,0,"F","Serviço","Serviço","1.4.0.25.","AGETOP",71331,"FITA ISOLANTE, ROLO DE 20,00 M","Un    ",20,null,null,null,""]
["S",2,"S",0,1,4,0,0,0,0,0,"F","Serviço","Serviço","1.4.0.26.","AGETOP",71381,"HASTE REV.COBRE(COPPERWELD)  5/8\" X 3,00 M C/CONECTOR","Un    ",4,null,null,null,""]
["S",2,"S",0,1,4,0,0,0,0,0,"F","Serviço","Serviço","1.4.0.27.","SINAPI",91955,"INTERRUPTOR PARALELO (1 MÓDULO), 10A/250V, INCLUINDO SUPORTE E PLACA - FORNECIMENTO E INSTALAÇÃO. AF_12/2015","UN",8,null,null,null,"Referência: AGETOP - 71431"]
["S",2,"S",0,1,4,0,0,0,0,0,"F","Serviço","Serviço","1.4.0.28.","SINAPI",91953,"INTERRUPTOR SIMPLES (1 MÓDULO), 10A/250V, INCLUINDO SUPORTE E PLACA - FORNECIMENTO E INSTALAÇÃO. AF_12/2015","UN",18,null,null,null,"Referência: AGETOP - 71440"]
["S",2,"S",0,1,4,0,0,0,0,0,"F","Serviço","Serviço","1.4.0.29.","COMPOSIÇÃO","COMP 387_SEE","LÂMPADA LED TUBULAR 18W ","UN ",280,null,null,null,""]
["S",2,"S",0,1,4,0,0,0,0,0,"F","Serviço","Serviço","1.4.0.30.","AGETOP",71622,"LUMINÁRIA DE SOBREPOR COM REFLETOR DE ALUMÍNIO E ALETAS 2X28W","un    ",140,null,null,null,""]
["S",2,"S",0,1,4,0,0,0,0,0,"F","Serviço","Serviço","1.4.0.31.","SINAPI",95758,"LUVA DE EMENDA PARA ELETRODUTO, AÇO GALVANIZADO, DN 25 MM (1''), APARENTE, INSTALADA EM PAREDE - FORNECIMENTO E INSTALAÇÃO. AF_11/2016_P","UN",40,null,null,null,"Referência: AGETOP - 71702"]
["S",2,"S",0,1,4,0,0,0,0,0,"F","Serviço","Serviço","1.4.0.32.","SINAPI",95760,"LUVA DE EMENDA PARA ELETRODUTO, AÇO GALVANIZADO, DN 40 MM (1 1/2''), APARENTE, INSTALADA EM PAREDE - FORNECIMENTO E INSTALAÇÃO. AF_11/2016_P","UN",20,null,null,null,"Referência: AGETOP - 71704"]
["S",2,"S",0,1,4,0,0,0,0,0,"F","Serviço","Serviço","1.4.0.33.","AGETOP",71824,"PADRÃO TRIFASICO 35 MM H=7 METROS","Un    ",1,null,null,null,""]
["S",2,"S",0,1,4,0,0,0,0,0,"F","Serviço","Serviço","1.4.0.34.","SINAPI","74131/5","QUADRO DE DISTRIBUICAO DE ENERGIA DE EMBUTIR, EM CHAPA METALICA, PARA 24 DISJUNTORES TERMOMAGNETICOS MONOPOLARES, COM BARRAMENTO TRIFASICO E NEUTRO, FORNECIMENTO E INSTALACAO","UN",2,null,null,null,""]
["S",2,"S",0,1,4,0,0,0,0,0,"F","Serviço","Serviço","1.4.0.35.","SINAPI","74131/6","QUADRO DE DISTRIBUICAO DE ENERGIA DE EMBUTIR, EM CHAPA METALICA, PARA 32 DISJUNTORES TERMOMAGNETICOS MONOPOLARES, COM BARRAMENTO TRIFASICO E NEUTRO, FORNECIMENTO E INSTALACAO","UN",1,null,null,null,"Referência: AGETOP - 72198"]
["S",2,"S",0,1,4,0,0,0,0,0,"F","Serviço","Serviço","1.4.0.36.","SINAPI",92000,"TOMADA BAIXA DE EMBUTIR (1 MÓDULO), 2P+T 10 A, INCLUINDO SUPORTE E PLACA - FORNECIMENTO E INSTALAÇÃO. AF_12/2015","UN",42,null,null,null,"Referência: AGETOP - 72578"]
[{"$f":"CHOOSE(1+LOG(1+2*(ORÇAMENTO.Nivel=\"Nível 1\")+4*(ORÇAMENTO.Nivel=\"Nível 2\")+8*(ORÇAMENTO.Nivel=\"Nível 3\")+16*(ORÇAMENTO.Nivel=\"Nível 4\")+32*(ORÇAMENTO.Nivel=\"Serviço\"),2),0,1,2,3,4,\"S\")","v":2},{"$f":"IF(OR(C130=\"s\",C130=0),OFFSET(B130,-1,0),C130)","v":2},{"$f":"IF(OFFSET(C130,-1,0)=\"L\",1,IF(OFFSET(C130,-1,0)=1,2,IF(OR(A130=\"s\",A130=0),\"S\",IF(AND(OFFSET(C130,-1,0)=2,A130=4),3,IF(AND(OR(OFFSET(C130,-1,0)=\"s\",OFFSET(C130,-1,0)=0),A130<>\"s\",A130>OFFSET(B130,-1,0)),OFFSET(B130,-1,0),A130)))))","v":2},{"$f":"IF(OR(C130=\"S\",C130=0),0,IF(ISERROR(K130),J130,SMALL(J130:K130,1)))","v":37},{"$f":"IF($C130=1,OFFSET(E130,-1,0)+1,OFFSET(E130,-1,0))","v":1},{"$f":"IF($C130=1,0,IF($C130=2,OFFSET(F130,-1,0)+1,OFFSET(F130,-1,0)))","v":5},{"$f":"IF(AND($C130<=2,$C130<>0),0,IF($C130=3,OFFSET(G130,-1,0)+1,OFFSET(G130,-1,0)))","v":0},{"$f":"IF(AND($C130<=3,$C130<>0),0,IF($C130=4,OFFSET(H130,-1,0)+1,OFFSET(H130,-1,0)))","v":0},{"$f":"IF(AND($C130<=4,$C130<>0),0,IF(AND($C130=\"S\",$W130>0),OFFSET(I130,-1,0)+1,OFFSET(I130,-1,0)))","v":0},164,37,"F","Nível 2","Nível 2","1.5.","AGETOP",null,"INSTALAÇÕES HIDROSSANITÁRIAS","-",null,null,null,null,""]
[{"$f":"CHOOSE(1+LOG(1+2*(ORÇAMENTO.Nivel=\"Nível 1\")+4*(ORÇAMENTO.Nivel=\"Nível 2\")+8*(ORÇAMENTO.Nivel=\"Nível 3\")+16*(ORÇAMENTO.Nivel=\"Nível 4\")+32*(ORÇAMENTO.Nivel=\"Serviço\"),2),0,1,2,3,4,\"S\")","v":3},3,3,36,1,5,1,0,{"$f":"IF(AND($C131<=4,$C131<>0),0,IF(AND($C131=\"S\",$W131>0),OFFSET(I131,-1,0)+1,OFFSET(I131,-1,0)))","v":0},36,66,"F","Nível 3","Nível 3","1.5.1.","SINAPI",null,"INSTALAÇÕES DE INCENDIO","-",null,null,null,null,""]
["S",3,"S",0,1,5,1,0,0,0,0,"F","Serviço","Serviço","1.5.1.1.","COMPOSIÇÃO","COMP 040_SEE","CONJUNTO MOTOR-BOMBA ELÉTRICA TRIFÁSICO 380/220 V PARA VZ= 24,33 M³/H, HM= 46,24 M POTÊNCIA= 7,5 CV","UN ",1,null,null,null,""]
["S",3,"S",0,1,5,1,0,0,0,0,"F","Serviço","Serviço","1.5.1.2.","AGETOP",72338,"SIRENE METALICA ALCANCE 500 M","Un    ",2,null,null,null,""]
["S",3,"S",0,1,5,1,0,0,0,0,"F","Serviço","Serviço","1.5.1.3.","AGETOP",81882,"RES.METALICO TAÇA AÇO PATINÁVEL-V=15M3-COL.SEC.H=6M+FUNDAÇÃO+LOGOTIPO","Un    ",1,null,null,null,""]
["S",3,"S",0,1,5,1,0,0,0,0,"F","Serviço","Serviço","1.5.1.4.","AGETOP",80903,"REGISTRO DE GAVETA BRUTO DIAMETRO 1\"","Un    ",1,null,null,null,""]
["S",3,"S",0,1,5,1,0,0,0,0,"F","Serviço","Serviço","1.5.1.5.","AGETOP",80910,"REGISTRO DE GAVETA BRUTO DIAMETRO 2.1/2\"","Un    ",2,null,null,null,""]
["S",3,"S",0,1,5,1,0,0,0,0,"F","Serviço","Serviço","1.5.1.6.","AGETOP",82379,"TUBO FERRO GALVANIZADO DIAM.2.1/2\"","m     ",158,null,null,null,""]
["S",3,"S",0,1,5,1,0,0,0,0,"F","Serviço","Serviço","1.5.1.7.","AGETOP",85003,"EXTINTOR PO QUIMICO SECO (6 KG) - CAPACIDADE EXTINTORA 20 BC","Un    ",2,null,null,null,""]
["S",3,"S",0,1,5,1,0,0,0,0,"F","Serviço","Serviço","1.5.1.8.","AGETOP",85006,"EXTINTOR MULTI USO EM PO A B C (6 KG) - CAPACIDADE EXTINTORA 3A 20BC","un    ",7,null,null,null,""]
["S",3,"S",0,1,5,1,0,0,0,0,"F","Serviço","Serviço","1.5.1.9.","AGETOP",85011,"CAIXA DE INCÊNDIO METÁLICA COM SUPORTE PARA MANGUEIRA, TAMPA E MURETA 17X60X90 CM C/PINTURA","Un    ",5,null,null,null,""]
["S",3,"S",0,1,5,1,0,0,0,0,"F","Serviço","Serviço","1.5.1.10.","AGETOP",85017,"MANGUEIRA DE INCÊNDIO D.I. = 38 MM TIPO 2 COMP. = 15 M","CJ    ",10,null,null,null,""]
["S",3,"S",0,1,5,1,0,0,0,0,"F","Serviço","Serviço","1.5.1.11.","AGETOP",85025,"ESGUICHO REGULÁVEL 1.1/2\"","Un    ",5,null,null,null,""]
["S",3,"S",0,1,5,1,0,0,0,0,"F","Serviço","Serviço","1.5.1.12.","AGETOP",85027,"ADAPTADOR P/ENGATE STORZ 2.1/2\" X 1.1/2\"","Un    ",5,null,null,null,""]
["S",3,"S",0,1,5,1,0,0,0,0,"F","Serviço","Serviço","1.5.1.13.","AGETOP",85031,"REGISTRO GLOBO ANGULAR 2.1/2\"","Un    ",4,null,null,null,""]
["S",3,"S",0,1,5,1,0,0,0,0,"F","Serviço","Serviço","1.5.1.14.","AGETOP",85037,"TANQUE DE PRESSÃO DE 10 L","Un    ",1,null,null,null,""]
["S",3,"S",0,1,5,1,0,0,0,0,"F","Serviço","Serviço","1.5.1.15.","AGETOP",85039,"PRESSOSTATO 50 A 80 PSI","Un    ",1,null,null,null,""]
["S",{"$f":"IF(OR(C147=\"s\",C147=0),OFFSET(B147,-1,0),C147)","v":3},{"$f":"IF(OFFSET(C147,-1,0)=\"L\",1,IF(OFFSET(C147,-1,0)=1,2,IF(OR(A147=\"s\",A147=0),\"S\",IF(AND(OFFSET(C147,-1,0)=2,A147=4),3,IF(AND(OR(OFFSET(C147,-1,0)=\"s\",OFFSET(C147,-1,0)=0),A147<>\"s\",A147>OFFSET(B147,-1,0)),OFFSET(B147,-1,0),A147)))))","v":"S"},{"$f":"IF(OR(C147=\"S\",C147=0),0,IF(ISERROR(K147),J147,SMALL(J147:K147,1)))","v":0},{"$f":"IF($C147=1,OFFSET(E147,-1,0)+1,OFFSET(E147,-1,0))","v":1},{"$f":"IF($C147=1,0,IF($C147=2,OFFSET(F147,-1,0)+1,OFFSET(F147,-1,0)))","v":5},{"$f":"IF(AND($C147<=2,$C147<>0),0,IF($C147=3,OFFSET(G147,-1,0)+1,OFFSET(G147,-1,0)))","v":1},{"$f":"IF(AND($C147<=3,$C147<>0),0,IF($C147=4,OFFSET(H147,-1,0)+1,OFFSET(H147,-1,0)))","v":0},0,{"$f":"IF(OR($C147=\"S\",$C147=0),0,MATCH(0,OFFSET($D147,1,$C147,ROW($C$330)-ROW($C147)),0))","v":0},{"$f":"IF(OR($C147=\"S\",$C147=0),0,MATCH(OFFSET($D147,0,$C147)+1,OFFSET($D147,1,$C147,ROW($C$330)-ROW($C147)),0))","v":0},"F","Serviço","Serviço","1.5.1.16.","AGETOP",85041,"MANOMETRO - 0 A 10 KG/CM2","Un    ",1,null,null,null,""]
["S",3,"S",0,1,5,1,0,0,0,0,"F","Serviço","Serviço","1.5.1.17.","AGETOP",85047,"NIPLE DUPLO FERRO GALVANIZADO 2.1/2\"","Un    ",5,null,null,null,""]
["S",3,"S",0,1,5,1,0,0,0,0,"F","Serviço","Serviço","1.5.1.18.","AGETOP",85077,"VÁLVULA DE RETENÇÃO HORIZONTAL 2.1/2\"","Un    ",2,null,null,null,""]
["S",3,"S",0,1,5,1,0,0,0,0,"F","Serviço","Serviço","1.5.1.19.","COMPOSIÇÃO","COMP 017_SEE","REDUCAO GIRATÓRIA TIPO STORZ LATAO P/ INST. PREDIAL COMBATE A INCENDIO ENGATE RAPIDO 2.1/2\" X 1.1/2\"","UN ",5,null,null,null,""]
["S",3,"S",0,1,5,1,0,0,0,0,"F","Serviço","Serviço","1.5.1.20.","COMPOSIÇÃO","COMP 018_SEE","CHAVE DUPLA P/ CONEXÕES TIPO STORZ EM LATÃO ENGATE RÁPIDO 1 1/2\" X 2 1/2\"","UN ",5,null,null,null,""]
["S",3,"S",0,1,5,1,0,0,0,0,"F","Serviço","Serviço","1.5.1.21.","COMPOSIÇÃO","COMP 087_SEE","REGISTRO DE GAVETA COM HASTE ASCENDENTE DE BRONZE 2 1/2\"","UN ",1,null,null,null,""]
["S",3,"S",0,1,5,1,0,0,0,0,"F","Serviço","Serviço","1.5.1.22.","COMPOSIÇÃO","COMP 019_SEE","TAMPÃO LATAO C/ CORRENTE P/ INSTALAÇÃO PREDIAL COMBATE A INCÊNDIO ENGATE RÁPIDO 1 1/2\"","UN ",5,null,null,null,""]
["S",3,"S",0,1,5,1,0,0,0,0,"F","Serviço","Serviço","1.5.1.23.","COMPOSIÇÃO","COMP 088_SEE","TE DE FERRO GALVANIZADO 90º X 2.1/2\" X 1\"","UN ",1,null,null,null,""]
["S",3,"S",0,1,5,1,0,0,0,0,"F","Serviço","Serviço","1.5.1.24.","AGETOP",85056,"TÊ DE FERRO GALVANIZADO 90º X 2 1/2\"","un    ",5,null,null,null,""]
["S",3,"S",0,1,5,1,0,0,0,0,"F","Serviço","Serviço","1.5.1.25.","COMPOSIÇÃO","COMP 030_SEE","COTOVELO DE FERRO GALV. 90° X 2 1/2\"","UN ",21,null,null,null,""]
["S",3,"S",0,1,5,1,0,0,0,0,"F","Serviço","Serviço","1.5.1.26.","COMPOSIÇÃO","COMP 077_SEE","UNIAO FERRO GALV C/ASSENTO CONICO BRONZE 2 1/2\"","UN ",6,null,null,null,""]
["S",3,"S",0,1,5,1,0,0,0,0,"F","Serviço","Serviço","1.5.1.27.","COMPOSIÇÃO","COMP 022_SEE","TAMPÃO FOFO 40X50CM C/INSCRIÇÃO ","UN ",1,null,null,null,""]
["S",3,"S",0,1,5,1,0,0,0,0,"F","Serviço","Serviço","1.5.1.28.","COMPOSIÇÃO","COMP 024_SEE","SINALIZADOR FOTOLUMINESCENTE PARA EXTINTOR","UN ",9,null,null,null,""]
["S",3,"S",0,1,5,1,0,0,0,0,"F","Serviço","Serviço","1.5.1.29.","COMPOSIÇÃO","COMP 186_SEE","BOTOEIRA BOMBA DE INCÊNDIO C/ MARTELO CONVENCIONAL/ ANALÓGICA","UN ",5,null,null,null,""]
["S",3,"S",0,1,5,1,0,0,0,0,"F","Serviço","Serviço","1.5.1.30.","COMPOSIÇÃO","COMP 188_SEE","ACIONADOR MANUAL DE ALARME","UN ",5,null,null,null,""]
["S",3,"S",0,1,5,1,0,0,0,0,"F","Serviço","Serviço","1.5.1.31.","COMPOSIÇÃO","COMP 190_SEE","CENTRAL DE DETECÇÃO E ALARME DE 40 SETORES COM BATERIA","UN ",1,null,null,null,""]
["S",3,"S",0,1,5,1,0,0,0,0,"F","Serviço","Serviço","1.5.1.32.","COMPOSIÇÃO","COMP 025_SEE","SINALIZADOR FOTOLUMINESCENTE DE EMERGÊNCIA","UN ",18,null,null,null,""]
["S",3,"S",0,1,5,1,0,0,0,0,"F","Serviço","Serviço","1.5.1.33.","COMPOSIÇÃO","COMP 277_SEE","MARCAÇÃO NO PISO - 1X1 M PARA EXTINTOR","M2",9,null,null,null,""]
["S",3,"S",0,1,5,1,0,0,0,0,"F","Serviço","Serviço","1.5.1.34.","COMPOSIÇÃO","COMP 080_SEE","BUCHA REDUCAO FERRO GALV ROSCA REF. 2 1/2\"X1\"","UN ",1,null,null,null,""]
["S",3,"S",0,1,5,1,0,0,0,0,"F","Serviço","Serviço","1.5.1.35.","SINAPI",97599,"LUMINÁRIA DE EMERGÊNCIA - FORNECIMENTO E INSTALAÇÃO. AF_11/2017","UN",20,null,null,null,""]
[2,2,2,27,1,6,0,0,0,127,27,"F","Nível 2","Nível 2","1.6.",null,null,"INSTALAÇÕES ESPECIAIS","-",null,null,null,null,""]
["S",{"$f":"IF(OR(C168=\"s\",C168=0),OFFSET(B168,-1,0),C168)","v":2},{"$f":"IF(OFFSET(C168,-1,0)=\"L\",1,IF(OFFSET(C168,-1,0)=1,2,IF(OR(A168=\"s\",A168=0),\"S\",IF(AND(OFFSET(C168,-1,0)=2,A168=4),3,IF(AND(OR(OFFSET(C168,-1,0)=\"s\",OFFSET(C168,-1,0)=0),A168<>\"s\",A168>OFFSET(B168,-1,0)),OFFSET(B168,-1,0),A168)))))","v":"S"},{"$f":"IF(OR(C168=\"S\",C168=0),0,IF(ISERROR(K168),J168,SMALL(J168:K168,1)))","v":0},{"$f":"IF($C168=1,OFFSET(E168,-1,0)+1,OFFSET(E168,-1,0))","v":1},{"$f":"IF($C168=1,0,IF($C168=2,OFFSET(F168,-1,0)+1,OFFSET(F168,-1,0)))","v":6},{"$f":"IF(AND($C168<=2,$C168<>0),0,IF($C168=3,OFFSET(G168,-1,0)+1,OFFSET(G168,-1,0)))","v":0},{"$f":"IF(AND($C168<=3,$C168<>0),0,IF($C168=4,OFFSET(H168,-1,0)+1,OFFSET(H168,-1,0)))","v":0},{"$f":"IF(AND($C168<=4,$C168<>0),0,IF(AND($C168=\"S\",$W168>0),OFFSET(I168,-1,0)+1,OFFSET(I168,-1,0)))","v":0},0,0,"F","Serviço","Serviço","1.6.0.1.","AGETOP",91007,"CENTRAL DE GÁS PADRÃO GOINFRA SEM INSTALAÇÕES (1+1 CILINDRO 45 KG)","Un    ",1,null,null,null,""]
["S",2,"S",0,1,6,0,0,0,0,0,"F","Serviço","Serviço","1.6.0.2.","AGETOP",91023,"UNIÃO S/BRONZE PRETA 3/4\" NPT 300 LBS","Un    ",3,null,null,null,""]
["S",2,"S",0,1,6,0,0,0,0,0,"F","Serviço","Serviço","1.6.0.3.","COMPOSIÇÃO","COMP 382_SEE","TE DE REDUCAO DE FERRO GALVANIZADO, COM ROSCA BSP, DE 3/4\" X 1/2\"","UN ",1,null,null,null,""]
["S",2,"S",0,1,6,0,0,0,0,0,"F","Serviço","Serviço","1.6.0.4.","COMPOSIÇÃO","COMP 383_SEE","BUCHA DE REDUCAO DE FERRO GALVANIZADO, COM ROSCA BSP, DE 1/2\" X 1/4\"","UN ",3,null,null,null,""]
["S",2,"S",0,1,6,0,0,0,0,0,"F","Serviço","Serviço","1.6.0.5.","AGETOP",91021,"LUVA GALVANIZADO DE REDUÇÃO 3/4\" X 1/2\" (GÁS)","Un    ",2,null,null,null,""]
["S",2,"S",0,1,6,0,0,0,0,0,"F","Serviço","Serviço","1.6.0.6.","SINAPI",92692,"NIPLE, EM FERRO GALVANIZADO, CONEXÃO ROSQUEADA, DN 15 (1/2\"), INSTALADO EM RAMAIS E SUB-RAMAIS DE GÁS - FORNECIMENTO E INSTALAÇÃO. AF_12/2015","UN",6,null,null,null,""]
["S",2,"S",0,1,6,0,0,0,0,0,"F","Serviço","Serviço","1.6.0.7.","AGETOP",91031,"NIPLE DUPLO 300 PSI 3/4\"","Un    ",6,null,null,null,""]
["S",2,"S",0,1,6,0,0,0,0,0,"F","Serviço","Serviço","1.6.0.8.","COMPOSIÇÃO","COMP 212_SEE","NIPLE DE REDUÇÃO 1/2\" X 1/4\" BSP","UN ",4,null,null,null,""]
["S",2,"S",0,1,6,0,0,0,0,0,"F","Serviço","Serviço","1.6.0.9.","COMPOSIÇÃO","COMP 213_SEE","NIPLE DE REDUÇÃO 3/4\" X 1/2\" BSP","UN ",4,null,null,null,""]
["S",2,"S",0,1,6,0,0,0,0,0,"F","Serviço","Serviço","1.6.0.10.","SINAPI",92688,"TUBO DE AÇO GALVANIZADO COM COSTURA, CLASSE MÉDIA, CONEXÃO ROSQUEADA, DN 20 (3/4\"), INSTALADO EM RAMAIS E SUB-RAMAIS DE GÁS - FORNECIMENTO E INSTALAÇÃO. AF_12/2015","M",18,null,null,null,""]
["S",2,"S",0,1,6,0,0,0,0,0,"F","Serviço","Serviço","1.6.0.11.","SINAPI",92701,"JOELHO 90 GRAUS, EM FERRO GALVANIZADO, CONEXÃO ROSQUEADA, DN 20 (3/4\"), INSTALADO EM RAMAIS E SUB-RAMAIS DE GÁS - FORNECIMENTO E INSTALAÇÃO. AF_12/2015","UN",7,null,null,null,""]
["S",2,"S",0,1,6,0,0,0,0,0,"F","Serviço","Serviço","1.6.0.12.","COMPOSIÇÃO","COMP 237_SEE","FITA ANTICORROSIVA","M",3.5,null,null,null,""]
["S",2,"S",0,1,6,0,0,0,0,0,"F","Serviço","Serviço","1.6.0.13.","AGETOP",91025,"VÁLVULA ESFERICA LATÃO 3/4\"","Un    ",3,null,null,null,""]
["S",2,"S",0,1,6,0,0,0,0,0,"F","Serviço","Serviço","1.6.0.14.","COMPOSIÇÃO","COMP 542_SEE","VÁLVULA UGV 3/4\" (S) LATÃO","UN ",1,null,null,null,""]
["S",2,"S",0,1,6,0,0,0,0,0,"F","Serviço","Serviço","1.6.0.15.","COMPOSIÇÃO","COMP 543_SEE","VÁLVULA UGV 1/2\" (S) LATÃO","UN ",1,null,null,null,""]
["S",2,"S",0,1,6,0,0,0,0,0,"F","Serviço","Serviço","1.6.0.16.","AGETOP",91029,"VALVULA DE RETENÇÃO LATÃO 1/2\" X 7/16\" NPT","Un    ",1,null,null,null,""]
["S",2,"S",0,1,6,0,0,0,0,0,"F","Serviço","Serviço","1.6.0.17.","COMPOSIÇÃO","COMP 211_SEE","REGULADOR DE 2º ESTÁGIO 5KG/H","UN ",1,null,null,null,""]
["S",2,"S",0,1,6,0,0,0,0,0,"F","Serviço","Serviço","1.6.0.18.","COMPOSIÇÃO","COMP 210_SEE","REGULADOR DE 1º ESTÁGIO 60KG/H MODELO AP-40  COM MANÔMETRO","UN ",1,null,null,null,""]
["S",2,"S",0,1,6,0,0,0,0,0,"F","Serviço","Serviço","1.6.0.19.","AGETOP",85003,"EXTINTOR PO QUIMICO SECO (6 KG) - CAPACIDADE EXTINTORA 20 BC","Un    ",1,null,null,null,""]
["S",2,"S",0,1,6,0,0,0,0,0,"F","Serviço","Serviço","1.6.0.20.","COMPOSIÇÃO","COMP 235_SEE","PLACA DE SINALIZAÇÃO EM PVC COD 01 - (300X300) PROIBIDO FUMAR","UN ",1,null,null,null,""]
["S",2,"S",0,1,6,0,0,0,0,0,"F","Serviço","Serviço","1.6.0.21.","COMPOSIÇÃO","COMP 236_SEE","PLACA DE SINALIZAÇÃO EM PVC COD 06 - (300X300) PERIGO INFLAMÁVEL","UN ",1,null,null,null,""]
["S",2,"S",0,1,6,0,0,0,0,0,"F","Serviço","Serviço","1.6.0.22.","AGETOP",91043,"BRAÇADEIRA METALICA TIPO \"D\" DIAM. 3/4\"","Un    ",7,null,null,null,""]
["S",2,"S",0,1,6,0,0,0,0,0,"F","Serviço","Serviço","1.6.0.23.","AGETOP",71863,"PARAFUSO P/BUCHA S-10","Un    ",14,null,null,null,""]
["S",2,"S",0,1,6,0,0,0,0,0,"F","Serviço","Serviço","1.6.0.24.","AGETOP",70393,"BUCHA DE NYLON S-10","Un    ",14,null,null,null,""]
["S",2,"S",0,1,6,0,0,0,0,0,"F","Serviço","Serviço","1.6.0.25.","AGETOP",91045,"SUPORTE PARA COLETOR","Un    ",2,null,null,null,""]
["S",2,"S",0,1,6,0,0,0,0,0,"F","Serviço","Serviço","1.6.0.26.","COMPOSIÇÃO","COMP 045_SEE","LAUDO DE ESTANQUEIDADE","UN ",1,null,null,null,""]
[2,2,2,5,1,7,0,0,0,100,5,"F","Nível 2","Nível 2","1.7.","AGETOP",91045,"ALVENARIAS E DIVISÓRIAS","Un    ",null,null,null,null,""]
[{"$f":"CHOOSE(1+LOG(1+2*(ORÇAMENTO.Nivel=\"Nível 1\")+4*(ORÇAMENTO.Nivel=\"Nível 2\")+8*(ORÇAMENTO.Nivel=\"Nível 3\")+16*(ORÇAMENTO.Nivel=\"Nível 4\")+32*(ORÇAMENTO.Nivel=\"Serviço\"),2),0,1,2,3,4,\"S\")","v":3},{"$f":"IF(OR(C195=\"s\",C195=0),OFFSET(B195,-1,0),C195)","v":3},{"$f":"IF(OFFSET(C195,-1,0)=\"L\",1,IF(OFFSET(C195,-1,0)=1,2,IF(OR(A195=\"s\",A195=0),\"S\",IF(AND(OFFSET(C195,-1,0)=2,A195=4),3,IF(AND(OR(OFFSET(C195,-1,0)=\"s\",OFFSET(C195,-1,0)=0),A195<>\"s\",A195>OFFSET(B195,-1,0)),OFFSET(B195,-1,0),A195)))))","v":3},{"$f":"IF(OR(C195=\"S\",C195=0),0,IF(ISERROR(K195),J195,SMALL(J195:K195,1)))","v":2},{"$f":"IF($C195=1,OFFSET(E195,-1,0)+1,OFFSET(E195,-1,0))","v":1},{"$f":"IF($C195=1,0,IF($C195=2,OFFSET(F195,-1,0)+1,OFFSET(F195,-1,0)))","v":7},{"$f":"IF(AND($C195<=2,$C195<>0),0,IF($C195=3,OFFSET(G195,-1,0)+1,OFFSET(G195,-1,0)))","v":1},{"$f":"IF(AND($C195<=3,$C195<>0),0,IF($C195=4,OFFSET(H195,-1,0)+1,OFFSET(H195,-1,0)))","v":0},{"$f":"IF(AND($C195<=4,$C195<>0),0,IF(AND($C195=\"S\",$W195>0),OFFSET(I195,-1,0)+1,OFFSET(I195,-1,0)))","v":0},4,2,"F","Nível 3","Nível 3","1.7.1.","SINAPI",null,"ACESSIBILIDADE","-",null,null,null,null,""]
["S",3,"S",0,1,7,1,0,0,0,0,"F","Serviço","Serviço","1.7.1.1.","SINAPI",87520,"ALVENARIA DE VEDAÇÃO DE BLOCOS CERÂMICOS FURADOS NA HORIZONTAL DE 9X19X19CM (ESPESSURA 9CM) DE PAREDES COM ÁREA LÍQUIDA MAIOR OU IGUAL A 6M² COM VÃOS E ARGAMASSA DE ASSENTAMENTO COM PREPARO MANUAL. AF_06/2014","M2",3.1,null,null,null,"Referência: AGETOP - 100201"]
[3,3,3,2,1,7,2,0,0,2,13,"F","Nível 3","Nível 3","1.7.2.","SINAPI",null,"VESTIÁRIO","-",null,null,null,null,""]
["S",3,"S",0,1,7,2,0,0,0,0,"F","Serviço","Serviço","1.7.2.1.","SINAPI",87520,"ALVENARIA DE VEDAÇÃO DE BLOCOS CERÂMICOS FURADOS NA HORIZONTAL DE 9X19X19CM (ESPESSURA 9CM) DE PAREDES COM ÁREA LÍQUIDA MAIOR OU IGUAL A 6M² COM VÃOS E ARGAMASSA DE ASSENTAMENTO COM PREPARO MANUAL. AF_06/2014","M2",1.82,null,null,null,"Referência: AGETOP - 100201"]
[2,2,2,2,1,8,0,0,0,95,2,"F","Nível 2","Nível 2","1.8.",null,null,"ESTRUTURAS METÁLICAS","-",null,null,null,null,""]
["S",2,"S",0,1,8,0,0,0,0,0,"F","Serviço","Serviço","1.8.0.1.","AGETOP",150204,"ESTRUTURA METÁLICA CONVENCIONAL EM AÇO DO TIPO MR-250 / ASTM A36 COM FUNDO ANTICORROSIVO","Kg    ",8349,null,null,null,""]
[2,2,2,21,1,9,0,0,0,93,21,"F","Nível 2","Nível 2","1.9.",null,null,"COBERTURAS","-",null,null,null,null,""]
[{"$f":"CHOOSE(1+LOG(1+2*(ORÇAMENTO.Nivel=\"Nível 1\")+4*(ORÇAMENTO.Nivel=\"Nível 2\")+8*(ORÇAMENTO.Nivel=\"Nível 3\")+16*(ORÇAMENTO.Nivel=\"Nível 4\")+32*(ORÇAMENTO.Nivel=\"Serviço\"),2),0,1,2,3,4,\"S\")","v":3},{"$f":"IF(OR(C202=\"s\",C202=0),OFFSET(B202,-1,0),C202)","v":3},{"$f":"IF(OFFSET(C202,-1,0)=\"L\",1,IF(OFFSET(C202,-1,0)=1,2,IF(OR(A202=\"s\",A202=0),\"S\",IF(AND(OFFSET(C202,-1,0)=2,A202=4),3,IF(AND(OR(OFFSET(C202,-1,0)=\"s\",OFFSET(C202,-1,0)=0),A202<>\"s\",A202>OFFSET(B202,-1,0)),OFFSET(B202,-1,0),A202)))))","v":3},{"$f":"IF(OR(C202=\"S\",C202=0),0,IF(ISERROR(K202),J202,SMALL(J202:K202,1)))","v":4},{"$f":"IF($C202=1,OFFSET(E202,-1,0)+1,OFFSET(E202,-1,0))","v":1},{"$f":"IF($C202=1,0,IF($C202=2,OFFSET(F202,-1,0)+1,OFFSET(F202,-1,0)))","v":9},{"$f":"IF(AND($C202<=2,$C202<>0),0,IF($C202=3,OFFSET(G202,-1,0)+1,OFFSET(G202,-1,0)))","v":1},{"$f":"IF(AND($C202<=3,$C202<>0),0,IF($C202=4,OFFSET(H202,-1,0)+1,OFFSET(H202,-1,0)))","v":0},{"$f":"IF(AND($C202<=4,$C202<>0),0,IF(AND($C202=\"S\",$W202>0),OFFSET(I202,-1,0)+1,OFFSET(I202,-1,0)))","v":0},20,4,"F","Nível 3","Nível 3","1.9.1.","SINAPI",null,"COBERTURA BLOCO 06","-",null,null,null,null,""]
["S",3,"S",0,1,9,1,0,0,0,0,"F","Serviço","Serviço","1.9.1.1.","AGETOP",160100,"COBERTURA COM TELHA AMERICANA  RESINADA COR VERMELHA","m2    ",156.29,null,null,null,""]
["S",3,"S",0,1,9,1,0,0,0,0,"F","Serviço","Serviço","1.9.1.2.","AGETOP",160101,"CUMEEIRA PARA TELHA AMERICANA RESINADA COR VERMELHA","m     ",17.41,null,null,null,""]
["S",3,"S",0,1,9,1,0,0,0,0,"F","Serviço","Serviço","1.9.1.3.","SINAPI",94224,"EMBOÇAMENTO COM ARGAMASSA TRAÇO 1:2:9 (CIMENTO, CAL E AREIA). AF_07/2019","M",52.760000000000005,null,null,null,"Referência: AGETOP - 160403"]
[3,3,3,4,1,9,2,0,0,16,4,"F","Nível 3","Nível 3","1.9.2.","SINAPI",null,"COBERTURA BLOCO 01","-",null,null,null,null,""]
["S",3,"S",0,1,9,2,0,0,0,0,"F","Serviço","Serviço","1.9.2.1.","AGETOP",160100,"COBERTURA COM TELHA AMERICANA  RESINADA COR VERMELHA","m2    ",292.87,null,null,null,""]
["S",3,"S",0,1,9,2,0,0,0,0,"F","Serviço","Serviço","1.9.2.2.","AGETOP",160101,"CUMEEIRA PARA TELHA AMERICANA RESINADA COR VERMELHA","m     ",29.97,null,null,null,""]
["S",3,"S",0,1,9,2,0,0,0,0,"F","Serviço","Serviço","1.9.2.3.","SINAPI",94224,"EMBOÇAMENTO COM ARGAMASSA TRAÇO 1:2:9 (CIMENTO, CAL E AREIA). AF_07/2019","M",79.7,null,null,null,"Referência: AGETOP - 160403"]
[3,3,3,4,1,9,3,0,0,12,4,"F","Nível 3","Nível 3","1.9.3.","SINAPI",null,"COBERTURA BLOCO 02","-",null,null,null,null,""]
["S",3,"S",0,1,9,3,0,0,{"$f":"IF(OR($C211=\"S\",$C211=0),0,MATCH(0,OFFSET($D211,1,$C211,ROW($C$330)-ROW($C211)),0))","v":0},{"$f":"IF(OR($C211=\"S\",$C211=0),0,MATCH(OFFSET($D211,0,$C211)+1,OFFSET($D211,1,$C211,ROW($C$330)-ROW($C211)),0))","v":0},"F","Serviço","Serviço","1.9.3.1.","AGETOP",160100,"COBERTURA COM TELHA AMERICANA  RESINADA COR VERMELHA","m2    ",90.16,null,null,null,""]
["S",3,"S",0,1,9,3,0,0,0,0,"F","Serviço","Serviço","1.9.3.2.","AGETOP",160101,"CUMEEIRA PARA TELHA AMERICANA RESINADA COR VERMELHA","m     ",13.85,null,null,null,""]
["S",3,"S",0,1,9,3,0,0,0,0,"F","Serviço","Serviço","1.9.3.3.","SINAPI",94224,"EMBOÇAMENTO COM ARGAMASSA TRAÇO 1:2:9 (CIMENTO, CAL E AREIA). AF_07/2019","M",40.72,null,null,null,"Referência: AGETOP - 160403"]
[3,3,3,4,1,9,4,0,0,8,4,"F","Nível 3","Nível 3","1.9.4.","SINAPI",null,"COBERTURA BLOCO 03","-",null,null,null,null,""]
["S",3,"S",0,1,9,4,0,0,0,0,"F","Serviço","Serviço","1.9.4.1.","AGETOP",160100,"COBERTURA COM TELHA AMERICANA  RESINADA COR VERMELHA","m2    ",209.59,null,null,null,""]
["S",3,"S",0,1,9,4,0,0,0,0,"F","Serviço","Serviço","1.9.4.2.","AGETOP",160101,"CUMEEIRA PARA TELHA AMERICANA RESINADA COR VERMELHA","m     ",24.6,null,null,null,""]
["S",3,"S",0,1,9,4,0,0,0,0,"F","Serviço","Serviço","1.9.4.3.","SINAPI",94224,"EMBOÇAMENTO COM ARGAMASSA TRAÇO 1:2:9 (CIMENTO, CAL E AREIA). AF_07/2019","M",66.240000000000009,null,null,null,"Referência: AGETOP - 160403"]
[3,3,3,4,1,9,5,0,0,4,59,"F","Nível 3","Nível 3","1.9.5.","SINAPI",null,"COBERTURA BLOCO 04","-",null,null,null,null,""]
["S",3,"S",0,1,9,5,0,0,0,0,"F","Serviço","Serviço","1.9.5.1.","AGETOP",160100,"COBERTURA COM TELHA AMERICANA  RESINADA COR VERMELHA","m2    ",236.92,null,null,null,""]
["S",3,"S",0,1,9,5,0,0,0,0,"F","Serviço","Serviço","1.9.5.2.","AGETOP",160101,"CUMEEIRA PARA TELHA AMERICANA RESINADA COR VERMELHA","m     ",26.22,null,null,null,""]
["S",3,"S",0,1,9,5,0,0,0,0,"F","Serviço","Serviço","1.9.5.3.","SINAPI",94224,"EMBOÇAMENTO COM ARGAMASSA TRAÇO 1:2:9 (CIMENTO, CAL E AREIA). AF_07/2019","M",75.08,null,null,null,"Referência: AGETOP - 160403"]
[2,2,2,6,1,10,0,0,0,72,6,"F","Nível 2","Nível 2","1.10.",null,null,"ESQUADRIAS METÁLICAS","-",null,null,null,null,""]
[{"$f":"CHOOSE(1+LOG(1+2*(ORÇAMENTO.Nivel=\"Nível 1\")+4*(ORÇAMENTO.Nivel=\"Nível 2\")+8*(ORÇAMENTO.Nivel=\"Nível 3\")+16*(ORÇAMENTO.Nivel=\"Nível 4\")+32*(ORÇAMENTO.Nivel=\"Serviço\"),2),0,1,2,3,4,\"S\")","v":3},{"$f":"IF(OR(C223=\"s\",C223=0),OFFSET(B223,-1,0),C223)","v":3},{"$f":"IF(OFFSET(C223,-1,0)=\"L\",1,IF(OFFSET(C223,-1,0)=1,2,IF(OR(A223=\"s\",A223=0),\"S\",IF(AND(OFFSET(C223,-1,0)=2,A223=4),3,IF(AND(OR(OFFSET(C223,-1,0)=\"s\",OFFSET(C223,-1,0)=0),A223<>\"s\",A223>OFFSET(B223,-1,0)),OFFSET(B223,-1,0),A223)))))","v":3},{"$f":"IF(OR(C223=\"S\",C223=0),0,IF(ISERROR(K223),J223,SMALL(J223:K223,1)))","v":2},{"$f":"IF($C223=1,OFFSET(E223,-1,0)+1,OFFSET(E223,-1,0))","v":1},{"$f":"IF($C223=1,0,IF($C223=2,OFFSET(F223,-1,0)+1,OFFSET(F223,-1,0)))","v":10},{"$f":"IF(AND($C223<=2,$C223<>0),0,IF($C223=3,OFFSET(G223,-1,0)+1,OFFSET(G223,-1,0)))","v":1},{"$f":"IF(AND($C223<=3,$C223<>0),0,IF($C223=4,OFFSET(H223,-1,0)+1,OFFSET(H223,-1,0)))","v":0},{"$f":"IF(AND($C223<=4,$C223<>0),0,IF(AND($C223=\"S\",$W223>0),OFFSET(I223,-1,0)+1,OFFSET(I223,-1,0)))","v":0},5,2,"F","Nível 3","Nível 3","1.10.1.","SINAPI",null,"HALL","-",null,null,null,null,""]
[{"$f":"CHOOSE(1+LOG(1+2*(ORÇAMENTO.Nivel=\"Nível 1\")+4*(ORÇAMENTO.Nivel=\"Nível 2\")+8*(ORÇAMENTO.Nivel=\"Nível 3\")+16*(ORÇAMENTO.Nivel=\"Nível 4\")+32*(ORÇAMENTO.Nivel=\"Serviço\"),2),0,1,2,3,4,\"S\")","v":"S"},{"$f":"IF(OR(C224=\"s\",C224=0),OFFSET(B224,-1,0),C224)","v":3},{"$f":"IF(OFFSET(C224,-1,0)=\"L\",1,IF(OFFSET(C224,-1,0)=1,2,IF(OR(A224=\"s\",A224=0),\"S\",IF(AND(OFFSET(C224,-1,0)=2,A224=4),3,IF(AND(OR(OFFSET(C224,-1,0)=\"s\",OFFSET(C224,-1,0)=0),A224<>\"s\",A224>OFFSET(B224,-1,0)),OFFSET(B224,-1,0),A224)))))","v":"S"},{"$f":"IF(OR(C224=\"S\",C224=0),0,IF(ISERROR(K224),J224,SMALL(J224:K224,1)))","v":0},{"$f":"IF($C224=1,OFFSET(E224,-1,0)+1,OFFSET(E224,-1,0))","v":1},{"$f":"IF($C224=1,0,IF($C224=2,OFFSET(F224,-1,0)+1,OFFSET(F224,-1,0)))","v":10},{"$f":"IF(AND($C224<=2,$C224<>0),0,IF($C224=3,OFFSET(G224,-1,0)+1,OFFSET(G224,-1,0)))","v":1},{"$f":"IF(AND($C224<=3,$C224<>0),0,IF($C224=4,OFFSET(H224,-1,0)+1,OFFSET(H224,-1,0)))","v":0},{"$f":"IF(AND($C224<=4,$C224<>0),0,IF(AND($C224=\"S\",$W224>0),OFFSET(I224,-1,0)+1,OFFSET(I224,-1,0)))","v":0},0,0,"F","Serviço","Serviço","1.10.1.1.","AGETOP",180304,"PORTAO DE ABRIR CHAPA 14  PT-4 C/FERRAGENS","m2    ",3.1500000000000004,null,null,null,""]
[3,3,3,3,1,10,2,0,0,3,15,"F","Nível 3","Nível 3","1.10.2.","SINAPI",null,"ACESSIBILIDADE","-",null,null,null,null,""]
["S",3,"S",0,1,10,2,0,0,0,0,"F","Serviço","Serviço","1.10.2.1.","COMPOSIÇÃO","COMP 083_SEE","CORRIMÃO PISO - SEDUC","M",6.52,null,null,null,""]
["S",3,"S",0,1,10,2,0,0,0,0,"F","Serviço","Serviço","1.10.2.2.","COMPOSIÇÃO","COMP 084_SEE","GUARDA-CORPO COM CORRIMÃO - SEDUC","M",32.11,null,null,null,""]
[2,2,2,7,1,11,0,0,0,66,7,"F","Nível 2","Nível 2","1.11.",null,null,"REVESTIMENTO DE PAREDE","-",null,null,null,null,""]
[{"$f":"CHOOSE(1+LOG(1+2*(ORÇAMENTO.Nivel=\"Nível 1\")+4*(ORÇAMENTO.Nivel=\"Nível 2\")+8*(ORÇAMENTO.Nivel=\"Nível 3\")+16*(ORÇAMENTO.Nivel=\"Nível 4\")+32*(ORÇAMENTO.Nivel=\"Serviço\"),2),0,1,2,3,4,\"S\")","v":3},{"$f":"IF(OR(C229=\"s\",C229=0),OFFSET(B229,-1,0),C229)","v":3},{"$f":"IF(OFFSET(C229,-1,0)=\"L\",1,IF(OFFSET(C229,-1,0)=1,2,IF(OR(A229=\"s\",A229=0),\"S\",IF(AND(OFFSET(C229,-1,0)=2,A229=4),3,IF(AND(OR(OFFSET(C229,-1,0)=\"s\",OFFSET(C229,-1,0)=0),A229<>\"s\",A229>OFFSET(B229,-1,0)),OFFSET(B229,-1,0),A229)))))","v":3},{"$f":"IF(OR(C229=\"S\",C229=0),0,IF(ISERROR(K229),J229,SMALL(J229:K229,1)))","v":3},{"$f":"IF($C229=1,OFFSET(E229,-1,0)+1,OFFSET(E229,-1,0))","v":1},{"$f":"IF($C229=1,0,IF($C229=2,OFFSET(F229,-1,0)+1,OFFSET(F229,-1,0)))","v":11},{"$f":"IF(AND($C229<=2,$C229<>0),0,IF($C229=3,OFFSET(G229,-1,0)+1,OFFSET(G229,-1,0)))","v":1},{"$f":"IF(AND($C229<=3,$C229<>0),0,IF($C229=4,OFFSET(H229,-1,0)+1,OFFSET(H229,-1,0)))","v":0},{"$f":"IF(AND($C229<=4,$C229<>0),0,IF(AND($C229=\"S\",$W229>0),OFFSET(I229,-1,0)+1,OFFSET(I229,-1,0)))","v":0},6,3,"F","Nível 3","Nível 3","1.11.1.","SINAPI",null,"ACESSIBILIDADE","-",null,null,null,null,""]
["S",3,"S",0,1,11,1,0,0,0,0,"F","Serviço","Serviço","1.11.1.1.","SINAPI",87904,"CHAPISCO APLICADO EM ALVENARIA (COM PRESENÇA DE VÃOS) E ESTRUTURAS DE CONCRETO DE FACHADA, COM COLHER DE PEDREIRO.  ARGAMASSA TRAÇO 1:3 COM PREPARO MANUAL. AF_06/2014","M2",3.1,null,null,null,"Referência: AGETOP - 200101"]
["S",3,"S",0,1,11,1,0,0,0,0,"F","Serviço","Serviço","1.11.1.2.","SINAPI",87547,"MASSA ÚNICA, PARA RECEBIMENTO DE PINTURA, EM ARGAMASSA TRAÇO 1:2:8, PREPARO MECÂNICO COM BETONEIRA 400L, APLICADA MANUALMENTE EM FACES INTERNAS DE PAREDES, ESPESSURA DE 10MM, COM EXECUÇÃO DE TALISCAS. AF_06/2014","M2",3.1,null,null,null,""]
[3,3,3,3,1,11,2,0,0,3,8,"F","Nível 3","Nível 3","1.11.2.","SINAPI",null,"VESTIÁRIO","-",null,null,null,null,""]
["S",3,"S",0,1,11,2,0,0,0,0,"F","Serviço","Serviço","1.11.2.1.","SINAPI",87904,"CHAPISCO APLICADO EM ALVENARIA (COM PRESENÇA DE VÃOS) E ESTRUTURAS DE CONCRETO DE FACHADA, COM COLHER DE PEDREIRO.  ARGAMASSA TRAÇO 1:3 COM PREPARO MANUAL. AF_06/2014","M2",3.64,null,null,null,"Referência: AGETOP - 200101"]
["S",3,"S",0,1,11,2,0,0,0,0,"F","Serviço","Serviço","1.11.2.2.","SINAPI",87547,"MASSA ÚNICA, PARA RECEBIMENTO DE PINTURA, EM ARGAMASSA TRAÇO 1:2:8, PREPARO MECÂNICO COM BETONEIRA 400L, APLICADA MANUALMENTE EM FACES INTERNAS DE PAREDES, ESPESSURA DE 10MM, COM EXECUÇÃO DE TALISCAS. AF_06/2014","M2",3.64,null,null,null,""]
[2,2,2,7,1,12,0,0,0,59,7,"F","Nível 2","Nível 2","1.12.",null,null,"FORROS","-",null,null,null,null,""]
[{"$f":"CHOOSE(1+LOG(1+2*(ORÇAMENTO.Nivel=\"Nível 1\")+4*(ORÇAMENTO.Nivel=\"Nível 2\")+8*(ORÇAMENTO.Nivel=\"Nível 3\")+16*(ORÇAMENTO.Nivel=\"Nível 4\")+32*(ORÇAMENTO.Nivel=\"Serviço\"),2),0,1,2,3,4,\"S\")","v":3},{"$f":"IF(OR(C236=\"s\",C236=0),OFFSET(B236,-1,0),C236)","v":3},{"$f":"IF(OFFSET(C236,-1,0)=\"L\",1,IF(OFFSET(C236,-1,0)=1,2,IF(OR(A236=\"s\",A236=0),\"S\",IF(AND(OFFSET(C236,-1,0)=2,A236=4),3,IF(AND(OR(OFFSET(C236,-1,0)=\"s\",OFFSET(C236,-1,0)=0),A236<>\"s\",A236>OFFSET(B236,-1,0)),OFFSET(B236,-1,0),A236)))))","v":3},{"$f":"IF(OR(C236=\"S\",C236=0),0,IF(ISERROR(K236),J236,SMALL(J236:K236,1)))","v":2},{"$f":"IF($C236=1,OFFSET(E236,-1,0)+1,OFFSET(E236,-1,0))","v":1},{"$f":"IF($C236=1,0,IF($C236=2,OFFSET(F236,-1,0)+1,OFFSET(F236,-1,0)))","v":12},{"$f":"IF(AND($C236<=2,$C236<>0),0,IF($C236=3,OFFSET(G236,-1,0)+1,OFFSET(G236,-1,0)))","v":1},{"$f":"IF(AND($C236<=3,$C236<>0),0,IF($C236=4,OFFSET(H236,-1,0)+1,OFFSET(H236,-1,0)))","v":0},{"$f":"IF(AND($C236<=4,$C236<>0),0,IF(AND($C236=\"S\",$W236>0),OFFSET(I236,-1,0)+1,OFFSET(I236,-1,0)))","v":0},6,2,"F","Nível 3","Nível 3","1.12.1.","SINAPI",null,"COBERTURA BLOCO 06","-",null,null,null,null,""]
["S",3,"S",0,1,12,1,0,0,0,0,"F","Serviço","Serviço","1.12.1.1.","SINAPI",96116,"FORRO EM RÉGUAS DE PVC, FRISADO, PARA AMBIENTES COMERCIAIS, INCLUSIVE ESTRUTURA DE FIXAÇÃO. AF_05/2017_P","M2",103.86,null,null,null,"Referência: AGETOP - 210460"]
[3,3,3,2,1,12,2,0,0,4,2,"F","Nível 3","Nível 3","1.12.2.","SINAPI",null,"COBERTURA BLOCO 01","-",null,null,null,null,""]
["S",3,"S",0,1,12,2,0,0,0,0,"F","Serviço","Serviço","1.12.2.1.","SINAPI",96116,"FORRO EM RÉGUAS DE PVC, FRISADO, PARA AMBIENTES COMERCIAIS, INCLUSIVE ESTRUTURA DE FIXAÇÃO. AF_05/2017_P","M2",205.92,null,null,null,"Referência: AGETOP - 210460"]
[3,3,3,2,1,12,3,0,0,2,13,"F","Nível 3","Nível 3","1.12.3.","SINAPI",null,"COBERTURA BLOCO 02","-",null,null,null,null,""]
["S",3,"S",0,1,12,3,0,0,0,0,"F","Serviço","Serviço","1.12.3.1.","SINAPI",96116,"FORRO EM RÉGUAS DE PVC, FRISADO, PARA AMBIENTES COMERCIAIS, INCLUSIVE ESTRUTURA DE FIXAÇÃO. AF_05/2017_P","M2",43.53,null,null,null,"Referência: AGETOP - 210460"]
[2,2,2,14,1,13,0,0,0,52,14,"F","Nível 2","Nível 2","1.13.",null,null,"REVESTIMENTO DE PISO","-",null,null,null,null,""]
[{"$f":"CHOOSE(1+LOG(1+2*(ORÇAMENTO.Nivel=\"Nível 1\")+4*(ORÇAMENTO.Nivel=\"Nível 2\")+8*(ORÇAMENTO.Nivel=\"Nível 3\")+16*(ORÇAMENTO.Nivel=\"Nível 4\")+32*(ORÇAMENTO.Nivel=\"Serviço\"),2),0,1,2,3,4,\"S\")","v":3},{"$f":"IF(OR(C243=\"s\",C243=0),OFFSET(B243,-1,0),C243)","v":3},{"$f":"IF(OFFSET(C243,-1,0)=\"L\",1,IF(OFFSET(C243,-1,0)=1,2,IF(OR(A243=\"s\",A243=0),\"S\",IF(AND(OFFSET(C243,-1,0)=2,A243=4),3,IF(AND(OR(OFFSET(C243,-1,0)=\"s\",OFFSET(C243,-1,0)=0),A243<>\"s\",A243>OFFSET(B243,-1,0)),OFFSET(B243,-1,0),A243)))))","v":3},{"$f":"IF(OR(C243=\"S\",C243=0),0,IF(ISERROR(K243),J243,SMALL(J243:K243,1)))","v":3},{"$f":"IF($C243=1,OFFSET(E243,-1,0)+1,OFFSET(E243,-1,0))","v":1},{"$f":"IF($C243=1,0,IF($C243=2,OFFSET(F243,-1,0)+1,OFFSET(F243,-1,0)))","v":13},{"$f":"IF(AND($C243<=2,$C243<>0),0,IF($C243=3,OFFSET(G243,-1,0)+1,OFFSET(G243,-1,0)))","v":1},{"$f":"IF(AND($C243<=3,$C243<>0),0,IF($C243=4,OFFSET(H243,-1,0)+1,OFFSET(H243,-1,0)))","v":0},{"$f":"IF(AND($C243<=4,$C243<>0),0,IF(AND($C243=\"S\",$W243>0),OFFSET(I243,-1,0)+1,OFFSET(I243,-1,0)))","v":0},13,3,"F","Nível 3","Nível 3","1.13.1.","SINAPI",null,"WC FUNCIONÁRIOS / DIRETORIA","-",null,null,null,null,""]
["S",3,"S",0,1,13,1,0,0,0,0,"F","Serviço","Serviço","1.13.1.1.","SINAPI",84191,"PISO EM GRANILITE, MARMORITE OU GRANITINA ESPESSURA 8 MM, INCLUSO JUNTAS DE DILATACAO PLASTICAS","M2",35.572700000000005,null,null,null,"Referência: AGETOP - 221101"]
["S",3,"S",0,1,13,1,0,0,0,0,"F","Serviço","Serviço","1.13.1.2.","AGETOP",221104,"RASPAGEM E APLICAÇÃO RESINA ACRÍLICA DUAS DEMÃOS","m2    ",35.572700000000005,null,null,null,""]
[3,3,3,4,1,13,2,0,0,10,4,"F","Nível 3","Nível 3","1.13.2.","SINAPI",null,"ACESSIBILIDADE","-",null,null,null,null,""]
["S",3,"S",0,1,13,2,0,0,0,0,"F","Serviço","Serviço","1.13.2.1.","AGETOP",220102,"PISO CONCRETO DESEMPENADO ESPESSURA = 5 CM  1:2,5:3,5","m2    ",12.22,null,null,null,""]
["S",3,"S",0,1,13,2,0,0,0,0,"F","Serviço","Serviço","1.13.2.2.","AGETOP",221120,"PISO DE BORRACHA COLORIDO MODELO TÁTIL ( ALERTA OU DIRECIONAL) INCLUSO CONTRAPISO (1CI:3ARML) C/ E=2CM E NATA DE CIMENTO","m2    ",4.91,null,null,null,""]
["S",3,"S",0,1,13,2,0,0,0,0,"F","Serviço","Serviço","1.13.2.3.","AGETOP",221126,"PISO DE LADRILHO HIDRÁULICO COLORIDO MODELO TÁTIL ( ALERTA OU DIRECIONAL) SEM LASTRO","m2    ",29.369999999999997,null,null,null,""]
[3,3,3,3,1,13,3,0,0,6,3,"F","Nível 3","Nível 3","1.13.3.","SINAPI",null,"VESTIÁRIO","-",null,null,null,null,""]
["S",3,"S",0,1,13,3,0,0,0,0,"F","Serviço","Serviço","1.13.3.1.","SINAPI",84191,"PISO EM GRANILITE, MARMORITE OU GRANITINA ESPESSURA 8 MM, INCLUSO JUNTAS DE DILATACAO PLASTICAS","M2",30.243000000000002,null,null,null,"Referência: AGETOP - 221101"]
["S",3,"S",0,1,13,3,0,0,0,0,"F","Serviço","Serviço","1.13.3.2.","AGETOP",221104,"RASPAGEM E APLICAÇÃO RESINA ACRÍLICA DUAS DEMÃOS","m2    ",30.243000000000002,null,null,null,""]
[3,3,3,3,1,13,4,0,0,3,22,"F","Nível 3","Nível 3","1.13.4.","SINAPI",null,"BLOCO 02","-",null,null,null,null,""]
["S",3,"S",0,1,13,4,0,0,0,0,"F","Serviço","Serviço","1.13.4.1.","SINAPI",84191,"PISO EM GRANILITE, MARMORITE OU GRANITINA ESPESSURA 8 MM, INCLUSO JUNTAS DE DILATACAO PLASTICAS","M2",84.787599999999998,null,null,null,"Referência: AGETOP - 221101"]
["S",3,"S",0,1,13,4,0,0,0,0,"F","Serviço","Serviço","1.13.4.2.","AGETOP",221104,"RASPAGEM E APLICAÇÃO RESINA ACRÍLICA DUAS DEMÃOS","m2    ",84.787599999999998,null,null,null,""]
[2,2,2,3,1,14,0,0,0,38,3,"F","Nível 2","Nível 2","1.14.",null,null,"ADMINISTRAÇÃO","-",null,null,null,null,""]
["S",2,"S",0,1,14,0,0,0,0,0,"F","Serviço","Serviço","1.14.0.1.","SINAPI",90778,"ENGENHEIRO CIVIL DE OBRA PLENO COM ENCARGOS COMPLEMENTARES","H",132,null,null,null,"Referência: AGETOP - 250101"]
["S",2,"S",0,1,14,0,0,0,0,0,"F","Serviço","Serviço","1.14.0.2.","SINAPI",90776,"ENCARREGADO GERAL COM ENCARGOS COMPLEMENTARES","H",660,null,null,null,"Referência: AGETOP - 250103"]
[2,2,2,33,1,15,0,0,0,35,33,"F","Nível 2","Nível 2","1.15.",null,null,"PINTURA","-",null,null,null,null,""]
[{"$f":"CHOOSE(1+LOG(1+2*(ORÇAMENTO.Nivel=\"Nível 1\")+4*(ORÇAMENTO.Nivel=\"Nível 2\")+8*(ORÇAMENTO.Nivel=\"Nível 3\")+16*(ORÇAMENTO.Nivel=\"Nível 4\")+32*(ORÇAMENTO.Nivel=\"Serviço\"),2),0,1,2,3,4,\"S\")","v":3},{"$f":"IF(OR(C260=\"s\",C260=0),OFFSET(B260,-1,0),C260)","v":3},{"$f":"IF(OFFSET(C260,-1,0)=\"L\",1,IF(OFFSET(C260,-1,0)=1,2,IF(OR(A260=\"s\",A260=0),\"S\",IF(AND(OFFSET(C260,-1,0)=2,A260=4),3,IF(AND(OR(OFFSET(C260,-1,0)=\"s\",OFFSET(C260,-1,0)=0),A260<>\"s\",A260>OFFSET(B260,-1,0)),OFFSET(B260,-1,0),A260)))))","v":3},{"$f":"IF(OR(C260=\"S\",C260=0),0,IF(ISERROR(K260),J260,SMALL(J260:K260,1)))","v":4},{"$f":"IF($C260=1,OFFSET(E260,-1,0)+1,OFFSET(E260,-1,0))","v":1},{"$f":"IF($C260=1,0,IF($C260=2,OFFSET(F260,-1,0)+1,OFFSET(F260,-1,0)))","v":15},{"$f":"IF(AND($C260<=2,$C260<>0),0,IF($C260=3,OFFSET(G260,-1,0)+1,OFFSET(G260,-1,0)))","v":1},{"$f":"IF(AND($C260<=3,$C260<>0),0,IF($C260=4,OFFSET(H260,-1,0)+1,OFFSET(H260,-1,0)))","v":0},{"$f":"IF(AND($C260<=4,$C260<>0),0,IF(AND($C260=\"S\",$W260>0),OFFSET(I260,-1,0)+1,OFFSET(I260,-1,0)))","v":0},32,4,"F","Nível 3","Nível 3","1.15.1.","SINAPI",null,"COBERTURA BLOCO 02","-",null,null,null,null,""]
["S",3,"S",0,1,15,1,0,0,0,0,"F","Serviço","Serviço","1.15.1.1.","AGETOP",260104,"REMOCAO DE PINTURA ANTIGA A LATEX","m2    ",37.64,null,null,null,""]
["S",3,"S",0,1,15,1,0,0,0,0,"F","Serviço","Serviço","1.15.1.2.","SINAPI",88496,"APLICAÇÃO E LIXAMENTO DE MASSA LÁTEX EM TETO, DUAS DEMÃOS. AF_06/2014","M2",37.64,null,null,null,"Referência: AGETOP - 261300"]
["S",3,"S",0,1,15,1,0,0,0,0,"F","Serviço","Serviço","1.15.1.3.","SINAPI",88486,"APLICAÇÃO MANUAL DE PINTURA COM TINTA LÁTEX PVA EM TETO, DUAS DEMÃOS. AF_06/2014","M2",37.64,null,null,null,"Referência: AGETOP - 261307"]
[3,3,3,4,1,15,2,0,0,28,4,"F","Nível 3","Nível 3","1.15.2.","SINAPI",null,"COBERTURA BLOCO 03","-",null,null,null,null,""]
["S",3,"S",0,1,15,2,0,0,0,0,"F","Serviço","Serviço","1.15.2.1.","AGETOP",260104,"REMOCAO DE PINTURA ANTIGA A LATEX","m2    ",148.08000000000001,null,null,null,""]
["S",3,"S",0,1,15,2,0,0,0,0,"F","Serviço","Serviço","1.15.2.2.","SINAPI",88496,"APLICAÇÃO E LIXAMENTO DE MASSA LÁTEX EM TETO, DUAS DEMÃOS. AF_06/2014","M2",148.08000000000001,null,null,null,"Referência: AGETOP - 261300"]
["S",3,"S",0,1,15,2,0,0,0,0,"F","Serviço","Serviço","1.15.2.3.","SINAPI",88486,"APLICAÇÃO MANUAL DE PINTURA COM TINTA LÁTEX PVA EM TETO, DUAS DEMÃOS. AF_06/2014","M2",148.08000000000001,null,null,null,"Referência: AGETOP - 261307"]
[3,3,3,2,1,15,3,0,0,24,2,"F","Nível 3","Nível 3","1.15.3.","SINAPI",null,"HALL","-",null,null,null,null,""]
["S",3,"S",0,1,15,3,0,0,0,0,"F","Serviço","Serviço","1.15.3.1.","SINAPI","74145/1","PINTURA ESMALTE FOSCO, DUAS DEMAOS, SOBRE SUPERFICIE METALICA, INCLUSO UMA DEMAO DE FUNDO ANTICORROSIVO. UTILIZACAO DE REVOLVER ( AR-COMPRIMIDO).","M2",9.4499999999999993,null,null,null,"Referência: AGETOP - 261602"]
[3,3,3,5,1,15,4,0,0,22,5,"F","Nível 3","Nível 3","1.15.4.","SINAPI",null,"WC FUNCIONÁRIOS / DIRETORIA","-",null,null,null,null,""]
["S",3,"S",0,1,15,4,0,0,0,0,"F","Serviço","Serviço","1.15.4.1.","AGETOP",260104,"REMOCAO DE PINTURA ANTIGA A LATEX","m2    ",21.21,null,null,null,""]
["S",3,"S",0,1,15,4,0,0,0,0,"F","Serviço","Serviço","1.15.4.2.","SINAPI",88497,"APLICAÇÃO E LIXAMENTO DE MASSA LÁTEX EM PAREDES, DUAS DEMÃOS. AF_06/2014","M2",36.909999999999997,null,null,null,"Referência: AGETOP - 261300"]
["S",3,"S",0,1,15,4,0,0,0,0,"F","Serviço","Serviço","1.15.4.3.","SINAPI",88489,"APLICAÇÃO MANUAL DE PINTURA COM TINTA LÁTEX ACRÍLICA EM PAREDES, DUAS DEMÃOS. AF_06/2014","M2",50.77,null,null,null,"Referência: AGETOP - 261001"]
["S",3,"S",0,1,15,4,0,0,0,0,"F","Serviço","Serviço","1.15.4.4.","AGETOP",261550,"PINT.ESMALTE SINT.PAREDES - 2 DEM.C/SELADOR","m2    ",50.77,null,null,null,""]
[3,3,3,2,1,15,5,0,0,{"$f":"IF(OR($C275=\"S\",$C275=0),0,MATCH(0,OFFSET($D275,1,$C275,ROW($C$330)-ROW($C275)),0))","v":17},{"$f":"IF(OR($C275=\"S\",$C275=0),0,MATCH(OFFSET($D275,0,$C275)+1,OFFSET($D275,1,$C275,ROW($C$330)-ROW($C275)),0))","v":2},"F","Nível 3","Nível 3","1.15.5.","SINAPI",null,"ACESSIBILIDADE","-",null,null,null,null,""]
["S",3,"S",0,1,15,5,0,0,0,0,"F","Serviço","Serviço","1.15.5.1.","SINAPI","74245/1","PINTURA ACRILICA EM PISO CIMENTADO DUAS DEMAOS","M2",3.1,null,null,null,"Referência: AGETOP - 261703"]
[3,3,3,4,1,15,6,0,0,15,4,"F","Nível 3","Nível 3","1.15.6.","SINAPI",null,"COBERTURA BLOCO 04","-",null,null,null,null,""]
["S",3,"S",0,1,15,6,0,0,0,0,"F","Serviço","Serviço","1.15.6.1.","AGETOP",260104,"REMOCAO DE PINTURA ANTIGA A LATEX","m2    ",187.37,null,null,null,""]
["S",3,"S",0,1,15,6,0,0,0,0,"F","Serviço","Serviço","1.15.6.2.","SINAPI",88496,"APLICAÇÃO E LIXAMENTO DE MASSA LÁTEX EM TETO, DUAS DEMÃOS. AF_06/2014","M2",187.37,null,null,null,"Referência: AGETOP - 261300"]
["S",3,"S",0,1,15,6,0,0,0,0,"F","Serviço","Serviço","1.15.6.3.","SINAPI",88486,"APLICAÇÃO MANUAL DE PINTURA COM TINTA LÁTEX PVA EM TETO, DUAS DEMÃOS. AF_06/2014","M2",187.37,null,null,null,"Referência: AGETOP - 261307"]
[3,3,3,4,1,15,7,0,0,11,4,"F","Nível 3","Nível 3","1.15.7.","SINAPI",null,"VESTIÁRIO","-",null,null,null,null,""]
["S",3,"S",0,1,15,7,0,0,0,0,"F","Serviço","Serviço","1.15.7.1.","SINAPI",88497,"APLICAÇÃO E LIXAMENTO DE MASSA LÁTEX EM PAREDES, DUAS DEMÃOS. AF_06/2014","M2",56.94,null,null,null,"Referência: AGETOP - 261300"]
["S",3,"S",0,1,15,7,0,0,0,0,"F","Serviço","Serviço","1.15.7.2.","AGETOP",261550,"PINT.ESMALTE SINT.PAREDES - 2 DEM.C/SELADOR","m2    ",28.47,null,null,null,""]
["S",3,"S",0,1,15,7,0,0,0,0,"F","Serviço","Serviço","1.15.7.3.","SINAPI",88489,"APLICAÇÃO MANUAL DE PINTURA COM TINTA LÁTEX ACRÍLICA EM PAREDES, DUAS DEMÃOS. AF_06/2014","M2",30.29,null,null,null,"Referência: AGETOP - 261001"]
[3,3,3,5,1,15,8,0,0,7,5,"F","Nível 3","Nível 3","1.15.8.","SINAPI",null,"BLOCO 02","-",null,null,null,null,""]
["S",3,"S",0,1,15,8,0,0,0,0,"F","Serviço","Serviço","1.15.8.1.","AGETOP",260104,"REMOCAO DE PINTURA ANTIGA A LATEX","m2    ",20.8,null,null,null,""]
["S",3,"S",0,1,15,8,0,0,0,0,"F","Serviço","Serviço","1.15.8.2.","SINAPI",88497,"APLICAÇÃO E LIXAMENTO DE MASSA LÁTEX EM PAREDES, DUAS DEMÃOS. AF_06/2014","M2",81.540000000000006,null,null,null,"Referência: AGETOP - 261300"]
["S",3,"S",0,1,15,8,0,0,0,0,"F","Serviço","Serviço","1.15.8.3.","SINAPI",88489,"APLICAÇÃO MANUAL DE PINTURA COM TINTA LÁTEX ACRÍLICA EM PAREDES, DUAS DEMÃOS. AF_06/2014","M2",51.17,null,null,null,"Referência: AGETOP - 261001"]
["S",3,"S",0,1,15,8,0,0,0,0,"F","Serviço","Serviço","1.15.8.4.","AGETOP",261550,"PINT.ESMALTE SINT.PAREDES - 2 DEM.C/SELADOR","m2    ",51.17,null,null,null,""]
[3,3,3,2,1,15,9,0,0,2,{"$error":"#N/A"},"F","Nível 3","Nível 3","1.15.9.","SINAPI",null,"ESTRUTURA METÁLICA","-",null,null,null,null,""]
["S",3,"S",0,1,15,9,0,0,0,0,"F","Serviço","Serviço","1.15.9.1.","SINAPI","74145/1","PINTURA ESMALTE FOSCO, DUAS DEMAOS, SOBRE SUPERFICIE METALICA, INCLUSO UMA DEMAO DE FUNDO ANTICORROSIVO. UTILIZACAO DE REVOLVER ( AR-COMPRIMIDO).","M2",985.82999999999993,null,null,null,"Referência: AGETOP - 261602"]
[2,{"$f":"IF(OR(C292=\"s\",C292=0),OFFSET(B292,-1,0),C292)","v":2},{"$f":"IF(OFFSET(C292,-1,0)=\"L\",1,IF(OFFSET(C292,-1,0)=1,2,IF(OR(A292=\"s\",A292=0),\"S\",IF(AND(OFFSET(C292,-1,0)=2,A292=4),3,IF(AND(OR(OFFSET(C292,-1,0)=\"s\",OFFSET(C292,-1,0)=0),A292<>\"s\",A292>OFFSET(B292,-1,0)),OFFSET(B292,-1,0),A292)))))","v":2},{"$f":"IF(OR(C292=\"S\",C292=0),0,IF(ISERROR(K292),J292,SMALL(J292:K292,1)))","v":2},{"$f":"IF($C292=1,OFFSET(E292,-1,0)+1,OFFSET(E292,-1,0))","v":1},{"$f":"IF($C292=1,0,IF($C292=2,OFFSET(F292,-1,0)+1,OFFSET(F292,-1,0)))","v":16},{"$f":"IF(AND($C292<=2,$C292<>0),0,IF($C292=3,OFFSET(G292,-1,0)+1,OFFSET(G292,-1,0)))","v":0},{"$f":"IF(AND($C292<=3,$C292<>0),0,IF($C292=4,OFFSET(H292,-1,0)+1,OFFSET(H292,-1,0)))","v":0},{"$f":"IF(AND($C292<=4,$C292<>0),0,IF(AND($C292=\"S\",$W292>0),OFFSET(I292,-1,0)+1,OFFSET(I292,-1,0)))","v":0},2,{"$error":"#N/A"},"F","Nível 2","Nível 2","1.16.",null,null,"DIVERSOS","-",null,null,null,null,""]
["S",2,"S",0,1,16,0,0,0,0,0,"F","Serviço","Serviço","1.16.0.1.","AGETOP",270501,"LIMPEZA FINAL DE OBRA - (OBRAS CIVIS)","m2    ",300,null,null,null,""]
[1,1,1,36,2,0,0,0,0,36,{"$error":"#N/A"},"F","Nível 1","Nível 1","2.","SINAPI",null,"PASSARELA MODELO 02 - PADRÃO SÉC. XXI 2015","-",null,null,null,null,""]
[2,2,2,2,2,1,0,0,0,35,2,"F","Nível 2","Nível 2","2.1.","SINAPI",null,"SERVIÇOS PRELIMINARES","-",null,null,null,null,""]
["S",2,"S",0,2,1,0,0,0,0,0,"F","Serviço","Serviço","2.1.0.1.","AGETOP",20701,"LOCAÇÃO DA OBRA, EXECUÇÃO DE GABARITO SEM REAPROVEITAMENTO, INCLUSO PINTURA (FACE INTERNA DO RIPÃO 15CM) E PIQUETE COM TESTEMUNHA","m2    ",20.16,null,null,null,""]
[2,2,2,3,2,2,0,0,0,33,3,"F","Nível 2","Nível 2","2.2.","AGETOP",null,"TRANSPORTES","-",null,null,null,null,""]
["S",2,"S",0,2,2,0,0,0,0,0,"F","Serviço","Serviço","2.2.0.1.","SINAPI",72900,"TRANSPORTE DE ENTULHO COM CAMINHAO BASCULANTE 6 M3, RODOVIA PAVIMENTADA, DMT 0,5 A 1,0 KM","M3",6,null,null,null,""]
["S",2,"S",0,2,2,0,0,0,0,0,"F","Serviço","Serviço","2.2.0.2.","SINAPI",72897,"CARGA MANUAL DE ENTULHO EM CAMINHAO BASCULANTE 6 M3","M3",6,null,null,null,""]
[2,2,2,9,2,3,0,0,0,30,9,"F","Nível 2","Nível 2","2.3.","AGETOP",null,"FUNDAÇÕES E SONDAGENS","-",null,null,null,null,""]
["S",2,"S",0,2,3,0,0,0,0,0,"F","Serviço","Serviço","2.3.0.1.","SINAPI",96534,"FABRICAÇÃO, MONTAGEM E DESMONTAGEM DE FÔRMA PARA BLOCO DE COROAMENTO, EM MADEIRA SERRADA, E=25 MM, 4 UTILIZAÇÕES. AF_06/2017","M2",5.28,null,null,null,"Referência: AGETOP - 51009"]
["S",2,"S",0,2,3,0,0,0,0,0,"F","Serviço","Serviço","2.3.0.2.","SINAPI",96523,"ESCAVAÇÃO MANUAL PARA BLOCO DE COROAMENTO OU SAPATA, COM PREVISÃO DE FÔRMA. AF_06/2017","M3",1.0289999999999999,null,null,null,"Referência: AGETOP - 50901"]
["S",2,"S",0,2,3,0,0,0,0,0,"F","Serviço","Serviço","2.3.0.3.","AGETOP",50902,"APILOAMENTO (BLOCOS/SAPATAS)","m2    ",1,null,null,null,""]
["S",2,"S",0,2,3,0,0,0,0,0,"F","Serviço","Serviço","2.3.0.4.","SINAPI",96995,"REATERRO MANUAL APILOADO COM SOQUETE. AF_10/2017","M3",0.44899999999999995,null,null,null,"Referência: AGETOP - 40902"]
["S",2,"S",0,2,3,0,0,0,0,0,"F","Serviço","Serviço","2.3.0.5.","SINAPI",94964,"CONCRETO FCK = 20MPA, TRAÇO 1:2,7:3 (CIMENTO/ AREIA MÉDIA/ BRITA 1)  - PREPARO MECÂNICO COM BETONEIRA 400 L. AF_07/2016","M3",0.57999999999999996,null,null,null,""]
["S",2,"S",0,2,3,0,0,0,0,0,"F","Serviço","Serviço","2.3.0.6.","SINAPI","74157/4","LANCAMENTO/APLICACAO MANUAL DE CONCRETO EM FUNDACOES","M3",0.57999999999999996,null,null,null,"Referência: AGETOP - 51026"]
["S",2,"S",0,2,3,0,0,0,0,0,"F","Serviço","Serviço","2.3.0.7.","SINAPI",96547,"ARMAÇÃO DE BLOCO, VIGA BALDRAME OU SAPATA UTILIZANDO AÇO CA-50 DE 12,5 MM - MONTAGEM. AF_06/2017","KG",13.18181818181818,null,null,null,""]
["S",2,"S",0,2,3,0,0,0,0,0,"F","Serviço","Serviço","2.3.0.8.","SINAPI",96543,"ARMAÇÃO DE BLOCO, VIGA BALDRAME E SAPATA UTILIZANDO AÇO CA-60 DE 5 MM - MONTAGEM. AF_06/2017","KG",8.7272727272727266,null,null,null,"Referência: AGETOP - 52014"]
[2,2,2,6,2,4,0,0,0,{"$f":"IF(OR($C309=\"S\",$C309=0),0,MATCH(0,OFFSET($D309,1,$C309,ROW($C$330)-ROW($C309)),0))","v":21},{"$f":"IF(OR($C309=\"S\",$C309=0),0,MATCH(OFFSET($D309,0,$C309)+1,OFFSET($D309,1,$C309,ROW($C$330)-ROW($C309)),0))","v":6},"F","Nível 2","Nível 2","2.4.","AGETOP",null,"ESTRUTURA","-",null,null,null,null,""]
["S",2,"S",0,2,4,0,0,0,0,0,"F","Serviço","Serviço","2.4.0.1.","SINAPI",92426,"MONTAGEM E DESMONTAGEM DE FÔRMA DE PILARES RETANGULARES E ESTRUTURAS SIMILARES COM ÁREA MÉDIA DAS SEÇÕES MENOR OU IGUAL A 0,25 M², PÉ-DIREITO SIMPLES, EM CHAPA DE MADEIRA COMPENSADA RESINADA, 8 UTILIZAÇÕES. AF_12/2015","M2",1.29,null,null,null,""]
["S",2,"S",0,2,4,0,0,0,0,0,"F","Serviço","Serviço","2.4.0.2.","SINAPI",94964,"CONCRETO FCK = 20MPA, TRAÇO 1:2,7:3 (CIMENTO/ AREIA MÉDIA/ BRITA 1)  - PREPARO MECÂNICO COM BETONEIRA 400 L. AF_07/2016","M3",0.11,null,null,null,""]
["S",2,"S",0,2,4,0,0,0,0,0,"F","Serviço","Serviço","2.4.0.3.","SINAPI",92873,"LANÇAMENTO COM USO DE BALDES, ADENSAMENTO E ACABAMENTO DE CONCRETO EM ESTRUTURAS. AF_12/2015","M3",0.11,null,null,null,"Referência: AGETOP - 60801"]
["S",2,"S",0,2,4,0,0,0,0,0,"F","Serviço","Serviço","2.4.0.4.","SINAPI",92779,"ARMAÇÃO DE PILAR OU VIGA DE UMA ESTRUTURA CONVENCIONAL DE CONCRETO ARMADO EM UMA EDIFICAÇÃO TÉRREA OU SOBRADO UTILIZANDO AÇO CA-50 DE 12,5 MM - MONTAGEM. AF_12/2015","KG",2.8181818181818179,null,null,null,""]
["S",2,"S",0,2,4,0,0,0,0,0,"F","Serviço","Serviço","2.4.0.5.","SINAPI",92775,"ARMAÇÃO DE PILAR OU VIGA DE UMA ESTRUTURA CONVENCIONAL DE CONCRETO ARMADO EM UMA EDIFICAÇÃO TÉRREA OU SOBRADO UTILIZANDO AÇO CA-60 DE 5,0 MM - MONTAGEM. AF_12/2015","KG",1.4545454545454546,null,null,null,"Referência: AGETOP - 60314"]
[2,2,2,2,2,5,0,0,0,15,2,"F","Nível 2","Nível 2","2.5.",null,null,"IMPERMEABILIZAÇÃO","-",null,null,null,null,""]
["S",2,"S",0,2,5,0,0,0,0,0,"F","Serviço","Serviço","2.5.0.1.","SINAPI",98562,"IMPERMEABILIZAÇÃO DE FLOREIRA OU VIGA BALDRAME COM ARGAMASSA DE CIMENTO E AREIA, COM ADITIVO IMPERMEABILIZANTE, E = 2 CM. AF_06/2018","M2",3.6,null,null,null,"Referência: AGETOP - 120902"]
[2,2,2,2,2,6,0,0,0,13,2,"F","Nível 2","Nível 2","2.6.",null,null,"ESTRUTURAS METÁLICAS","-",null,null,null,null,""]
["S",2,"S",0,2,6,0,0,0,0,0,"F","Serviço","Serviço","2.6.0.1.","AGETOP",150103,"ESTRUTURA METÁLICA CONVENCIONAL EM AÇO DO TIPO USI SAC-300 COM FUNDO ANTICORROSIVO","Kg    ",270.56000000000006,null,null,null,""]
[2,2,2,3,2,7,0,0,0,11,3,"F","Nível 2","Nível 2","2.7.",null,null,"COBERTURAS","-",null,null,null,null,""]
["S",2,"S",0,2,7,0,0,0,0,0,"F","Serviço","Serviço","2.7.0.1.","SINAPI",94213,"TELHAMENTO COM TELHA DE AÇO/ALUMÍNIO E = 0,5 MM, COM ATÉ 2 ÁGUAS, INCLUSO IÇAMENTO. AF_07/2019","M2",25.92,null,null,null,"Referência: AGETOP - 160905"]
["S",2,"S",0,2,7,0,0,0,0,0,"F","Serviço","Serviço","2.7.0.2.","SINAPI",94228,"CALHA EM CHAPA DE AÇO GALVANIZADO NÚMERO 24, DESENVOLVIMENTO DE 50 CM, INCLUSO TRANSPORTE VERTICAL. AF_07/2019","M",7.2,null,null,null,"Referência: AGETOP - 160601"]
[2,2,2,4,2,8,0,0,0,8,4,"F","Nível 2","Nível 2","2.8.",null,null,"REVESTIMENTO DE PISO","-",null,null,null,null,""]
["S",2,"S",0,2,8,0,0,0,0,0,"F","Serviço","Serviço","2.8.0.1.","SINAPI",95241,"LASTRO DE CONCRETO MAGRO, APLICADO EM PISOS OU RADIERS, ESPESSURA DE 5 CM. AF_07/2016","M2",20.16,null,null,null,""]
["S",2,"S",0,2,8,0,0,0,0,0,"F","Serviço","Serviço","2.8.0.2.","SINAPI",84191,"PISO EM GRANILITE, MARMORITE OU GRANITINA ESPESSURA 8 MM, INCLUSO JUNTAS DE DILATACAO PLASTICAS","M2",20.16,null,null,null,"Referência: AGETOP - 221101"]
["S",2,"S",0,2,8,0,0,0,0,0,"F","Serviço","Serviço","2.8.0.3.","AGETOP",221104,"RASPAGEM E APLICAÇÃO RESINA ACRÍLICA DUAS DEMÃOS","m2    ",20.72,null,null,null,""]
[2,2,2,2,2,9,0,0,0,4,2,"F","Nível 2","Nível 2","2.9.",null,null,"PINTURA","-",null,null,null,null,""]
["S",2,"S",0,2,9,0,0,0,0,0,"F","Serviço","Serviço","2.9.0.1.","SINAPI","74145/1","PINTURA ESMALTE FOSCO, DUAS DEMAOS, SOBRE SUPERFICIE METALICA, INCLUSO UMA DEMAO DE FUNDO ANTICORROSIVO. UTILIZACAO DE REVOLVER ( AR-COMPRIMIDO).","M2",51.84,null,null,null,"Referência: AGETOP - 261602"]
[2,2,2,2,2,10,0,0,0,2,{"$error":"#N/A"},"F","Nível 2","Nível 2","2.10.","SINAPI",null,"DIVERSOS","-",null,null,null,null,""]
["S",2,"S",0,2,10,0,0,0,0,0,"F","Serviço","Serviço","2.10.0.1.","AGETOP",270501,"LIMPEZA FINAL DE OBRA - (OBRAS CIVIS)","m2    ",20.16,null,null,null,""]
[-1,null,-1,null,0,0,0,0,0,null,null,"F"]
[null,null,null,null,null,null,null,null,null,null,null,"F",null,null,null,null,null,"OBS: OS QUANTITATIVOS DE MATERIAIS  DAS INSTALAÇÕES HIDROSSANITÁRIAS, ELÉTRICAS E ESPECIAIS SÃO FORNECIDOS PELOS PROFISSIONAIS RESPONSÁVEIS PELOS RESPECTIVOS PROJETOS.",null,null,"VALOR TOTAL"]
[null,null,null,null,null,null,null,null,null,null,null,"F",null,null,null,null,null,null,null,null,"VALOR BDI (20,34%)"]
[null,null,null,null,null,null,null,null,null,null,null,"F",null,null,null,null,null,null,null,null,"TOTAL ORÇAMENTO"]
[null,null,null,null,null,null,null,null,null,null,null,"F"]
[null,null,null,null,null,null,null,null,null,null,null,"F",null,null,null,null,null,null,null,null,"CUSTO POR M2 ³"]
[null,null,null,null,null,null,null,null,null,null,null,"F",null,null,null,null,null,null,null,null,"MATERIAL S/ BDI"]
[null,null,null,null,null,null,null,null,null,null,null,"F",null,null,null,null,null,null,null,null,"MÃO DE OBRA S/ BDI"]
[null,null,null,null,null,null,null,null,null,null,null,"F"]
[null,null,null,null,null,null,null,null,null,null,null,"F",null,null,null,null,"(1) Conforme previsto pelo DECRETO Nº 7.983, DE 8 DE ABRIL DE 2013, os preços adotados são aqueles constantes dos sistemas de referência indicados. Justifica-se o uso dos preços destas composições de custos unitários devido ao seu valor ser menor à mediana de seus correspondentes na tabela SINAPI;"]
[null,null,null,null,null,null,null,null,null,null,null,"F",null,null,null,null,"(2) Optou-se pelo uso das composições de custos da AGETOP para itens não presentes na SINAPI;"]
[null,null,null,null,null,null,null,null,null,null,null,"F",null,null,null,null,"(3) Para itens da AGETOP, os vidros não estão inclusos nas esquadrias e já foram considerados os custos de contramarco para as esquadrias de alumínio;"]
[null,null,null,null,null,null,null,null,null,null,null,"F",null,null,null,null,"(4) Nos casos em que houver execução de granitina e omissão do item AGETOP 221102, considerou-se que o quantitativo para o rodapé, de altura igual a 7cm, foi incorporado na área de piso;"]
[null,null,null,null,null,null,null,null,null,null,null,"F",null,null,null,null,"(5) O custo unitário aproximado por metro quadrado é calculado dividindo-se o valor total do orçamento pela área total de construção."]
[null,null,null,null,null,null,null,null,null,null,null,"F"]
[null,null,null,null,null,null,null,null,null,null,null,"F"]
[]
[null,null,null,null,null,null,null,null,null,null,null,null,null,null,"SOMATÓRIO DE SERVIÇOS"]
[null,null,null,null,null,null,null,null,null,null,null,null,null,null,"ITEM","DESCRIÇÃO DOS SERVIÇOS",null,null,"PREÇO SEM BDI",null,null,"PREÇO COM BDI",null,"PARTICIPAÇÃO ( % )"]
[null,null,null,null,null,null,null,null,null,null,null,null,null,null,"a.","SERVIÇOS PRELIMINARES",null,null,{"$f":"SUMIF($R$19:$R$330,$P349,$W$19:$W$330)","v":0},null,null,{"$f":"ROUND(S349*(1+BDI.Taxa),2)","v":0},null,{"$f":"IFERROR(ROUND($V349*100/$W$333,2),0)","v":0}]
[null,null,null,null,null,null,null,null,null,null,null,null,null,null,"b.","TRANSPORTES",null,null,0,null,null,0,null,{"$f":"IFERROR(ROUND($V350*100/$W$333,2),0)","v":0}]
[null,null,null,null,null,null,null,null,null,null,null,null,null,null,"c.","SERVIÇO EM TERRA",null,null,0,null,null,0,null,0]
[null,null,null,null,null,null,null,null,null,null,null,null,null,null,"d.","FUNDAÇÕES E SONDAGENS",null,null,0,null,null,0,null,0]
[null,null,null,null,null,null,null,null,null,null,null,null,null,null,"e.","ESTRUTURA",null,null,0,null,null,0,null,0]
[null,null,null,null,null,null,null,null,null,null,null,null,null,null,"f.","INSTALAÇÕES ELÉTRICAS",null,null,0,null,null,0,null,0]
[null,null,null,null,null,null,null,null,null,null,null,null,null,null,"g.","INSTALAÇÕES HIDROSSANITÁRIAS",null,null,0,null,null,0,null,0]
[null,null,null,null,null,null,null,null,null,null,null,null,null,null,"h","INSTALAÇÕES ESPECIAIS",null,null,0,null,null,0,null,0]
[null,null,null,null,null,null,null,null,null,null,null,null,null,null,"i.","ALVENARIAS E DIVISÓRIAS",null,null,0,null,null,0,null,0]
[null,null,null,null,null,null,null,null,null,null,null,null,null,null,"j.","ALVENARIA AUTO-PORTANTE",null,null,0,null,null,0,null,0]
[null,null,null,null,null,null,null,null,null,null,null,null,null,null,"k.","IMPERMEABILIZAÇÃO",null,null,0,null,null,0,null,0]
[null,null,null,null,null,null,null,null,null,null,null,null,null,null,"l.","ISOLAMENTO TÉRMICO E ACÚSTICO",null,null,0,null,null,0,null,0]
[null,null,null,null,null,null,null,null,null,null,null,null,null,null,"m.","ESTRUTURA DE MADEIRA",null,null,0,null,null,0,null,0]
[null,null,null,null,null,null,null,null,null,null,null,null,null,null,"n.","ESTRUTURAS METÁLICAS",null,null,0,null,null,0,null,0]
[null,null,null,null,null,null,null,null,null,null,null,null,null,null,"o.","COBERTURAS",null,null,0,null,null,0,null,0]
[null,null,null,null,null,null,null,null,null,null,null,null,null,null,"p.","ESQUADRIAS DE MADEIRA",null,null,0,null,null,0,null,0]
[null,null,null,null,null,null,null,null,null,null,null,null,null,null,"q.","ESQUADRIAS METÁLICAS",null,null,0,null,null,{"$f":"ROUND(S365*(1+BDI.Taxa),2)","v":0},null,0]
[null,null,null,null,null,null,null,null,null,null,null,null,null,null,"r.","VIDROS",null,null,0,null,null,0,null,0]
[null,null,null,null,null,null,null,null,null,null,null,null,null,null,"s.","REVESTIMENTO DE PAREDE",null,null,0,null,null,0,null,0]
[null,null,null,null,null,null,null,null,null,null,null,null,null,null,"t.","FORROS",null,null,0,null,null,0,null,0]
[null,null,null,null,null,null,null,null,null,null,null,null,null,null,"u.","REVESTIMENTO DE PISO",null,null,0,null,null,0,null,0]
[null,null,null,null,null,null,null,null,null,null,null,null,null,null,"v.","FERRAGENS",null,null,0,null,null,0,null,0]
[null,null,null,null,null,null,null,null,null,null,null,null,null,null,"w.","MARCENARIA",null,null,0,null,null,0,null,0]
[null,null,null,null,null,null,null,null,null,null,null,null,null,null,"x.","ADMINISTRAÇÃO",null,null,0,null,null,0,null,0]
[null,null,null,null,null,null,null,null,null,null,null,null,null,null,"y.","PINTURA",null,null,0,null,null,{"$f":"ROUND(S373*(1+BDI.Taxa),2)","v":0},null,0]
[null,null,null,null,null,null,null,null,null,null,null,null,null,null,"z.","DIVERSOS",null,null,0,null,null,{"$f":"IF(S374>0,IF((SUM(V349:W373)+ROUND(S374*(1+BDI.Taxa),2))<>V376,V376-SUM(V349:W373),ROUND(S374*(1+BDI.Taxa),2)),0)","v":0},null,{"$f":"IF(S374>0,IF((SUM(X349:X373)+IFERROR(ROUND($V374*100/$W$333,2),0))<>X376,X376-SUM(X349:X373),IFERROR(ROUND($V374*100/$W$333,2),0)),0)","v":0}]
[null,null,null,null,null,null,null,null,null,null,null,null,null,null,"TOTAL GERAL DO ORÇAMENTO (R$)",null,null,null,{"$f":"SUM(S349:U374)","v":0},null,null,{"$f":"SUM(V349:W374)","v":0},null,{"$f":"SUM(X349:X374)","v":0}]
[null,null,null,null,null,null,null,null,null,null,null,null,null,null,null,null,null,null,{"$f":"$W$331","v":0},null,null,{"$f":"$W$333","v":0},null,100]
[null,null,null,null,null,null,null,null,null,null,null,null,null,null,null,null,null,null,"(TOTAL SEM BDI)",null,null,"(TOTAL COM BDI)",null,"(ARRED porcentagem)"]
[null,null,null,null,null,null,null,null,null,null,null,null,null,null,null,null,null,null,{"$f":"IF(AND(S375=S376,S375>0),\"OK\",\"ERRO\")","v":"ERRO"},null,null,{"$f":"IF(AND(V375=V376,V375>0),\"OK\",\"ERRO\")","v":"ERRO"},null,{"$f":"IF(X375=100,\"OK\",\"ERRO\")","v":"ERRO"}]
[]
[]
[null,null,null,null,null,null,null,null,null,null,null,null,null,null,"RESUMO GERAL DO ORÇAMENTO"]
[null,null,null,null,null,null,null,null,null,null,null,null,null,null,"ITEM","DESCRIÇÃO DOS SERVIÇOS",null,null,"PREÇO SEM BDI",null,null,"PREÇO COM BDI",null,"PARTICIPAÇÃO ( % )"]
[null,null,null,null,null,null,null,null,null,null,null,null,null,null,"1.",{"$f":"IFERROR(VLOOKUP(O383,$O$19:$W$330,4,FALSE),\"\")","v":"AMPLIAÇÃO E REFORMA"},null,null,{"$f":"IF(P384=\"\",$S$404-SUM(OFFSET($S$382:S382,0,0,COUNTA($S$382:S382),1)),SUMIF($R$19:$R$330,$P383,$W$19:$W$330))","v":0},null,null,{"$f":"IF(P384=\"\",$V$404-SUM(OFFSET($V$382:V382,0,0,COUNTA($V$382:V382),1)),ROUND(S383*(1+BDI.Taxa),2))","v":0},null,{"$f":"IF(P384=\"\",$X$404-SUM(OFFSET($X$382:X382,0,0,COUNTA($X$382:X382),1)),ROUND(V383*100/ORÇAMENTO.Totalorçamento,2))","v":{"$error":"#DIV/0!"}}]
[null,null,null,null,null,null,null,null,null,null,null,null,null,null,"2.","PASSARELA MODELO 02 - PADRÃO SÉC. XXI 2015",null,null,{"$f":"IF(P385=\"\",$S$404-SUM(OFFSET($S$382:S383,0,0,COUNTA($S$382:S383),1)),SUMIF($R$19:$R$330,$P384,$W$19:$W$330))","v":0},null,null,{"$f":"IF(P385=\"\",$V$404-SUM(OFFSET($V$382:V383,0,0,COUNTA($V$382:V383),1)),ROUND(S384*(1+BDI.Taxa),2))","v":0},null,{"$f":"IF(P385=\"\",$X$404-SUM(OFFSET($X$382:X383,0,0,COUNTA($X$382:X383),1)),ROUND(V384*100/ORÇAMENTO.Totalorçamento,2))","v":{"$error":"#DIV/0!"}}]
[null,null,null,null,null,null,null,null,null,null,null,null,null,null,"3.","",null,null,{"$f":"IF(P386=\"\",$S$404-SUM(OFFSET($S$382:S384,0,0,COUNTA($S$382:S384),1)),SUMIF($R$19:$R$330,$P385,$W$19:$W$330))","v":0},null,null,{"$f":"IF(P386=\"\",$V$404-SUM(OFFSET($V$382:V384,0,0,COUNTA($V$382:V384),1)),ROUND(S385*(1+BDI.Taxa),2))","v":0},null,{"$f":"IF(P386=\"\",$X$404-SUM(OFFSET($X$382:X384,0,0,COUNTA($X$382:X384),1)),ROUND(V385*100/ORÇAMENTO.Totalorçamento,2))","v":{"$error":"#DIV/0!"}}]
[null,null,null,null,null,null,null,null,null,null,null,null,null,null,"4.","",null,null,{"$f":"IF(P387=\"\",$S$404-SUM(OFFSET($S$382:S385,0,0,COUNTA($S$382:S385),1)),SUMIF($R$19:$R$330,$P386,$W$19:$W$330))","v":0},null,null,{"$f":"IF(P387=\"\",$V$404-SUM(OFFSET($V$382:V385,0,0,COUNTA($V$382:V385),1)),ROUND(S386*(1+BDI.Taxa),2))","v":0},null,{"$f":"IF(P387=\"\",$X$404-SUM(OFFSET($X$382:X385,0,0,COUNTA($X$382:X385),1)),ROUND(V386*100/ORÇAMENTO.Totalorçamento,2))","v":{"$error":"#DIV/0!"}}]
[null,null,null,null,null,null,null,null,null,null,null,null,null,null,"5.","",null,null,{"$f":"IF(P388=\"\",$S$404-SUM(OFFSET($S$382:S386,0,0,COUNTA($S$382:S386),1)),SUMIF($R$19:$R$330,$P387,$W$19:$W$330))","v":0},null,null,{"$f":"IF(P388=\"\",$V$404-SUM(OFFSET($V$382:V386,0,0,COUNTA($V$382:V386),1)),ROUND(S387*(1+BDI.Taxa),2))","v":0},null,{"$f":"IF(P388=\"\",$X$404-SUM(OFFSET($X$382:X386,0,0,COUNTA($X$382:X386),1)),ROUND(V387*100/ORÇAMENTO.Totalorçamento,2))","v":{"$error":"#DIV/0!"}}]
[null,null,null,null,null,null,null,null,null,null,null,null,null,null,"6.","",null,null,{"$f":"IF(P389=\"\",$S$404-SUM(OFFSET($S$382:S387,0,0,COUNTA($S$382:S387),1)),SUMIF($R$19:$R$330,$P388,$W$19:$W$330))","v":0},null,null,{"$f":"IF(P389=\"\",$V$404-SUM(OFFSET($V$382:V387,0,0,COUNTA($V$382:V387),1)),ROUND(S388*(1+BDI.Taxa),2))","v":0},null,{"$f":"IF(P389=\"\",$X$404-SUM(OFFSET($X$382:X387,0,0,COUNTA($X$382:X387),1)),ROUND(V388*100/ORÇAMENTO.Totalorçamento,2))","v":{"$error":"#DIV/0!"}}]
[null,null,null,null,null,null,null,null,null,null,null,null,null,null,"7.","",null,null,{"$f":"IF(P390=\"\",$S$404-SUM(OFFSET($S$382:S388,0,0,COUNTA($S$382:S388),1)),SUMIF($R$19:$R$330,$P389,$W$19:$W$330))","v":0},null,null,{"$f":"IF(P390=\"\",$V$404-SUM(OFFSET($V$382:V388,0,0,COUNTA($V$382:V388),1)),ROUND(S389*(1+BDI.Taxa),2))","v":0},null,{"$f":"IF(P390=\"\",$X$404-SUM(OFFSET($X$382:X388,0,0,COUNTA($X$382:X388),1)),ROUND(V389*100/ORÇAMENTO.Totalorçamento,2))","v":{"$error":"#DIV/0!"}}]
[null,null,null,null,null,null,null,null,null,null,null,null,null,null,"8.","",null,null,{"$f":"IF(P391=\"\",$S$404-SUM(OFFSET($S$382:S389,0,0,COUNTA($S$382:S389),1)),SUMIF($R$19:$R$330,$P390,$W$19:$W$330))","v":0},null,null,{"$f":"IF(P391=\"\",$V$404-SUM(OFFSET($V$382:V389,0,0,COUNTA($V$382:V389),1)),ROUND(S390*(1+BDI.Taxa),2))","v":0},null,{"$f":"IF(P391=\"\",$X$404-SUM(OFFSET($X$382:X389,0,0,COUNTA($X$382:X389),1)),ROUND(V390*100/ORÇAMENTO.Totalorçamento,2))","v":{"$error":"#DIV/0!"}}]
[null,null,null,null,null,null,null,null,null,null,null,null,null,null,"9.","",null,null,{"$f":"IF(P392=\"\",$S$404-SUM(OFFSET($S$382:S390,0,0,COUNTA($S$382:S390),1)),SUMIF($R$19:$R$330,$P391,$W$19:$W$330))","v":0},null,null,{"$f":"IF(P392=\"\",$V$404-SUM(OFFSET($V$382:V390,0,0,COUNTA($V$382:V390),1)),ROUND(S391*(1+BDI.Taxa),2))","v":0},null,{"$f":"IF(P392=\"\",$X$404-SUM(OFFSET($X$382:X390,0,0,COUNTA($X$382:X390),1)),ROUND(V391*100/ORÇAMENTO.Totalorçamento,2))","v":{"$error":"#DIV/0!"}}]
[null,null,null,null,null,null,null,null,null,null,null,null,null,null,"10.","",null,null,{"$f":"IF(P393=\"\",$S$404-SUM(OFFSET($S$382:S391,0,0,COUNTA($S$382:S391),1)),SUMIF($R$19:$R$330,$P392,$W$19:$W$330))","v":0},null,null,{"$f":"IF(P393=\"\",$V$404-SUM(OFFSET($V$382:V391,0,0,COUNTA($V$382:V391),1)),ROUND(S392*(1+BDI.Taxa),2))","v":0},null,{"$f":"IF(P393=\"\",$X$404-SUM(OFFSET($X$382:X391,0,0,COUNTA($X$382:X391),1)),ROUND(V392*100/ORÇAMENTO.Totalorçamento,2))","v":{"$error":"#DIV/0!"}}]
[null,null,null,null,null,null,null,null,null,null,null,null,null,null,"11.","",null,null,{"$f":"IF(P394=\"\",$S$404-SUM(OFFSET($S$382:S392,0,0,COUNTA($S$382:S392),1)),SUMIF($R$19:$R$330,$P393,$W$19:$W$330))","v":0},null,null,{"$f":"IF(P394=\"\",$V$404-SUM(OFFSET($V$382:V392,0,0,COUNTA($V$382:V392),1)),ROUND(S393*(1+BDI.Taxa),2))","v":0},null,{"$f":"IF(P394=\"\",$X$404-SUM(OFFSET($X$382:X392,0,0,COUNTA($X$382:X392),1)),ROUND(V393*100/ORÇAMENTO.Totalorçamento,2))","v":{"$error":"#DIV/0!"}}]
[null,null,null,null,null,null,null,null,null,null,null,null,null,null,"12.","",null,null,{"$f":"IF(P395=\"\",$S$404-SUM(OFFSET($S$382:S393,0,0,COUNTA($S$382:S393),1)),SUMIF($R$19:$R$330,$P394,$W$19:$W$330))","v":0},null,null,{"$f":"IF(P395=\"\",$V$404-SUM(OFFSET($V$382:V393,0,0,COUNTA($V$382:V393),1)),ROUND(S394*(1+BDI.Taxa),2))","v":0},null,{"$f":"IF(P395=\"\",$X$404-SUM(OFFSET($X$382:X393,0,0,COUNTA($X$382:X393),1)),ROUND(V394*100/ORÇAMENTO.Totalorçamento,2))","v":{"$error":"#DIV/0!"}}]
[null,null,null,null,null,null,null,null,null,null,null,null,null,null,"13.","",null,null,{"$f":"IF(P396=\"\",$S$404-SUM(OFFSET($S$382:S394,0,0,COUNTA($S$382:S394),1)),SUMIF($R$19:$R$330,$P395,$W$19:$W$330))","v":0},null,null,{"$f":"IF(P396=\"\",$V$404-SUM(OFFSET($V$382:V394,0,0,COUNTA($V$382:V394),1)),ROUND(S395*(1+BDI.Taxa),2))","v":0},null,{"$f":"IF(P396=\"\",$X$404-SUM(OFFSET($X$382:X394,0,0,COUNTA($X$382:X394),1)),ROUND(V395*100/ORÇAMENTO.Totalorçamento,2))","v":{"$error":"#DIV/0!"}}]
[null,null,null,null,null,null,null,null,null,null,null,null,null,null,"14.","",null,null,{"$f":"IF(P397=\"\",$S$404-SUM(OFFSET($S$382:S395,0,0,COUNTA($S$382:S395),1)),SUMIF($R$19:$R$330,$P396,$W$19:$W$330))","v":0},null,null,{"$f":"IF(P397=\"\",$V$404-SUM(OFFSET($V$382:V395,0,0,COUNTA($V$382:V395),1)),ROUND(S396*(1+BDI.Taxa),2))","v":0},null,{"$f":"IF(P397=\"\",$X$404-SUM(OFFSET($X$382:X395,0,0,COUNTA($X$382:X395),1)),ROUND(V396*100/ORÇAMENTO.Totalorçamento,2))","v":{"$error":"#DIV/0!"}}]
[null,null,null,null,null,null,null,null,null,null,null,null,null,null,"15.","",null,null,{"$f":"IF(P398=\"\",$S$404-SUM(OFFSET($S$382:S396,0,0,COUNTA($S$382:S396),1)),SUMIF($R$19:$R$330,$P397,$W$19:$W$330))","v":0},null,null,{"$f":"IF(P398=\"\",$V$404-SUM(OFFSET($V$382:V396,0,0,COUNTA($V$382:V396),1)),ROUND(S397*(1+BDI.Taxa),2))","v":0},null,{"$f":"IF(P398=\"\",$X$404-SUM(OFFSET($X$382:X396,0,0,COUNTA($X$382:X396),1)),ROUND(V397*100/ORÇAMENTO.Totalorçamento,2))","v":{"$error":"#DIV/0!"}}]
[null,null,null,null,null,null,null,null,null,null,null,null,null,null,"16.","",null,null,{"$f":"IF(P399=\"\",$S$404-SUM(OFFSET($S$382:S397,0,0,COUNTA($S$382:S397),1)),SUMIF($R$19:$R$330,$P398,$W$19:$W$330))","v":0},null,null,{"$f":"IF(P399=\"\",$V$404-SUM(OFFSET($V$382:V397,0,0,COUNTA($V$382:V397),1)),ROUND(S398*(1+BDI.Taxa),2))","v":0},null,{"$f":"IF(P399=\"\",$X$404-SUM(OFFSET($X$382:X397,0,0,COUNTA($X$382:X397),1)),ROUND(V398*100/ORÇAMENTO.Totalorçamento,2))","v":{"$error":"#DIV/0!"}}]
[null,null,null,null,null,null,null,null,null,null,null,null,null,null,"17.","",null,null,{"$f":"IF(P400=\"\",$S$404-SUM(OFFSET($S$382:S398,0,0,COUNTA($S$382:S398),1)),SUMIF($R$19:$R$330,$P399,$W$19:$W$330))","v":0},null,null,{"$f":"IF(P400=\"\",$V$404-SUM(OFFSET($V$382:V398,0,0,COUNTA($V$382:V398),1)),ROUND(S399*(1+BDI.Taxa),2))","v":0},null,{"$f":"IF(P400=\"\",$X$404-SUM(OFFSET($X$382:X398,0,0,COUNTA($X$382:X398),1)),ROUND(V399*100/ORÇAMENTO.Totalorçamento,2))","v":{"$error":"#DIV/0!"}}]
[null,null,null,null,null,null,null,null,null,null,null,null,null,null,"18.","",null,null,{"$f":"IF(P401=\"\",$S$404-SUM(OFFSET($S$382:S399,0,0,COUNTA($S$382:S399),1)),SUMIF($R$19:$R$330,$P400,$W$19:$W$330))","v":0},null,null,{"$f":"IF(P401=\"\",$V$404-SUM(OFFSET($V$382:V399,0,0,COUNTA($V$382:V399),1)),ROUND(S400*(1+BDI.Taxa),2))","v":0},null,{"$f":"IF(P401=\"\",$X$404-SUM(OFFSET($X$382:X399,0,0,COUNTA($X$382:X399),1)),ROUND(V400*100/ORÇAMENTO.Totalorçamento,2))","v":{"$error":"#DIV/0!"}}]
[null,null,null,null,null,null,null,null,null,null,null,null,null,null,"19.","",null,null,{"$f":"IF(P402=\"\",$S$404-SUM(OFFSET($S$382:S400,0,0,COUNTA($S$382:S400),1)),SUMIF($R$19:$R$330,$P401,$W$19:$W$330))","v":0},null,null,{"$f":"IF(P402=\"\",$V$404-SUM(OFFSET($V$382:V400,0,0,COUNTA($V$382:V400),1)),ROUND(S401*(1+BDI.Taxa),2))","v":0},null,{"$f":"IF(P402=\"\",$X$404-SUM(OFFSET($X$382:X400,0,0,COUNTA($X$382:X400),1)),ROUND(V401*100/ORÇAMENTO.Totalorçamento,2))","v":{"$error":"#DIV/0!"}}]
[null,null,null,null,null,null,null,null,null,null,null,null,null,null,"20.","",null,null,{"$f":"IF(P403=\"\",$S$404-SUM(OFFSET($S$382:S401,0,0,COUNTA($S$382:S401),1)),SUMIF($R$19:$R$330,$P402,$W$19:$W$330))","v":0},null,null,{"$f":"IF(P403=\"\",$V$404-SUM(OFFSET($V$382:V401,0,0,COUNTA($V$382:V401),1)),ROUND(S402*(1+BDI.Taxa),2))","v":0},null,{"$f":"IF(P403=\"\",$X$404-SUM(OFFSET($X$382:X401,0,0,COUNTA($X$382:X401),1)),ROUND(V402*100/ORÇAMENTO.Totalorçamento,2))","v":{"$error":"#DIV/0!"}}]
[null,null,null,null,null,null,null,null,null,null,null,null,null,null,"TOTAL GERAL DO ORÇAMENTO (R$)",null,null,null,{"$f":"SUM(S383:U402)","v":0},null,null,{"$f":"SUM(V383:W402)","v":0},null,{"$f":"SUM(X383:X402)","v":{"$error":"#DIV/0!"}}]
[null,null,null,null,null,null,null,null,null,null,null,null,null,null,null,null,null,null,{"$f":"$W$331","v":0},null,null,{"$f":"$W$333","v":0},null,100]
[null,null,null,null,null,null,null,null,null,null,null,null,null,null,null,null,null,null,"(TOTAL SEM BDI)",null,null,"(TOTAL COM BDI)",null,"(ARRED porcentagem)"]
[null,null,null,null,null,null,null,null,null,null,null,null,null,null,null,null,null,null,{"$f":"IF(AND(S403=S404,S403>0),\"OK\",\"ERRO\")","v":"ERRO"},null,null,{"$f":"IF(AND(V403=V404,V403>0),\"OK\",\"ERRO\")","v":"ERRO"},null,{"$f":"IF(AND(X403=100,S383<>0),\"OK\",\"ERRO\")","v":{"$error":"#DIV/0!"}}]

{"sheet":"Resumo ","index":1,"n_rows":39,"n_cols":9,"rows_kept":39,"cut":false,"hidden":false,"merged":[[42,3,42,7],[11,1,11,2],[12,1,12,2],[15,2,15,3],[16,2,16,3],[14,1,14,8],[17,2,17,3],[23,2,23,3],[18,2,18,3],[19,2,19,3],[20,2,20,3],[41,3,41,7],[24,2,24,3],[26,2,26,3],[27,2,27,3],[38,1,38,8],[1,1,1,8],[2,6,2,8],[3,6,3,8],[4,1,4,8],[5,6,5,8],[6,6,6,8],[7,1,7,8],[8,6,8,8],[9,6,9,8],[13,1,13,8],[0,1,0,8],[36,1,36,5],[2,1,2,5],[3,1,3,5],[5,1,5,5],[6,1,6,5],[8,1,8,5],[9,1,9,5],[11,3,11,5],[12,3,12,5],[10,1,10,8],[11,6,11,8],[12,6,12,8],[25,2,25,3],[21,2,21,3],[22,2,22,3],[13,0,14,0],[34,2,34,3],[35,2,35,3],[31,2,31,3],[32,2,32,3],[33,2,33,3],[28,2,28,3],[29,2,29,3],[30,2,30,3]]}
[]
[]
[null,"UNIDADE ESCOLAR",null,null,null,null,"CÓDIGO INEP"]
[null,{"$f":"Orçamento!$O$4","v":"ACERVO DAS ESCOLAS EXTINTAS DE GOIÂNIA"},null,null,null,null,{"$f":"Orçamento!V4","v":0}]
[]
[null,"OBRA",null,null,null,null,"CIDADE"]
[null,{"$f":"Orçamento!$O$7","v":"AMPLIAÇÃO E REFORMA"},null,null,null,null,{"$f":"Orçamento!$V$7","v":"GOIÂNIA"}]
[]
[null,"ENDEREÇO",null,null,null,null,"CRE"]
[null,{"$f":"Orçamento!$R$10","v":"AV. HUGO DE CARVALHO RAMOS, VILA IRANY"},null,null,null,null,{"$f":"Orçamento!$O$10","v":"GOIÂNIA"}]
[]
[null,"REFERÊNCIA",null,"DATA",null,null,"ÁREA TOTAL CONSTRUÍDA (M²)"]
[null,{"$f":"CONCATENATE(\"AGETOP E SINAPI - \",Orçamento!$T$10)","v":"AGETOP E SINAPI - ONERADA"},null,{"$f":"Orçamento!$S$7","v":"2020-09-02"},null,null,{"$f":"Orçamento!$V$13","v":2413.75}]
["FILTRO"]
[null,"RESUMO GERAL DO ORÇAMENTO"]
["↓","ITEM","DESCRIÇÃO DOS SERVIÇOS",null,"UNID","QUANT","PREÇO SEM BDI","PREÇO COM BDI","PARTICIP. (%)"]
[{"$f":"IF(E17>0,\"F\",\"\")","v":"F"},"1.",{"$f":"Orçamento!$P383","v":"AMPLIAÇÃO E REFORMA"},null,"UN ",1,{"$f":"IFERROR(Orçamento!S383,\"-\")","v":0},{"$f":"IFERROR(Orçamento!V383,\"\")","v":0},{"$f":"Orçamento!X383","v":{"$error":"#DIV/0!"}}]
[{"$f":"IF(E18>0,\"F\",\"\")","v":"F"},"2.",{"$f":"Orçamento!$P384","v":"PASSARELA MODELO 02 - PADRÃO SÉC. XXI 2015"},null,"UN ",1,{"$f":"IFERROR(Orçamento!S384,\"-\")","v":0},{"$f":"IFERROR(Orçamento!V384,\"\")","v":0},{"$f":"Orçamento!X384","v":{"$error":"#DIV/0!"}}]
["","3.",{"$f":"Orçamento!$P385","v":""},null,null,null,{"$f":"IFERROR(Orçamento!S385,\"-\")","v":0},{"$f":"IFERROR(Orçamento!V385,\"\")","v":0},{"$f":"Orçamento!X385","v":{"$error":"#DIV/0!"}}]
["","4.",{"$f":"Orçamento!$P386","v":""},null,null,null,{"$f":"IFERROR(Orçamento!S386,\"-\")","v":0},{"$f":"IFERROR(Orçamento!V386,\"\")","v":0},{"$f":"Orçamento!X386","v":{"$error":"#DIV/0!"}}]
["","5.",{"$f":"Orçamento!$P387","v":""},null,null,null,{"$f":"IFERROR(Orçamento!S387,\"-\")","v":0},{"$f":"IFERROR(Orçamento!V387,\"\")","v":0},{"$f":"Orçamento!X387","v":{"$error":"#DIV/0!"}}]
["","6.",{"$f":"Orçamento!$P388","v":""},null,null,null,{"$f":"IFERROR(Orçamento!S388,\"-\")","v":0},{"$f":"IFERROR(Orçamento!V388,\"\")","v":0},{"$f":"Orçamento!X388","v":{"$error":"#DIV/0!"}}]
["","7.",{"$f":"Orçamento!$P389","v":""},null,null,null,{"$f":"IFERROR(Orçamento!S389,\"-\")","v":0},{"$f":"IFERROR(Orçamento!V389,\"\")","v":0},{"$f":"Orçamento!X389","v":{"$error":"#DIV/0!"}}]
["","8.",{"$f":"Orçamento!$P390","v":""},null,null,null,{"$f":"IFERROR(Orçamento!S390,\"-\")","v":0},{"$f":"IFERROR(Orçamento!V390,\"\")","v":0},{"$f":"Orçamento!X390","v":{"$error":"#DIV/0!"}}]
["","9.",{"$f":"Orçamento!$P391","v":""},null,null,null,{"$f":"IFERROR(Orçamento!S391,\"-\")","v":0},{"$f":"IFERROR(Orçamento!V391,\"\")","v":0},{"$f":"Orçamento!X391","v":{"$error":"#DIV/0!"}}]
["","10.",{"$f":"Orçamento!$P392","v":""},null,null,null,{"$f":"IFERROR(Orçamento!S392,\"-\")","v":0},{"$f":"IFERROR(Orçamento!V392,\"\")","v":0},{"$f":"Orçamento!X392","v":{"$error":"#DIV/0!"}}]
["","11.",{"$f":"Orçamento!$P393","v":""},null,null,null,{"$f":"IFERROR(Orçamento!S393,\"-\")","v":0},{"$f":"IFERROR(Orçamento!V393,\"\")","v":0},{"$f":"Orçamento!X393","v":{"$error":"#DIV/0!"}}]
["","12.",{"$f":"Orçamento!$P394","v":""},null,null,null,{"$f":"IFERROR(Orçamento!S394,\"-\")","v":0},{"$f":"IFERROR(Orçamento!V394,\"\")","v":0},{"$f":"Orçamento!X394","v":{"$error":"#DIV/0!"}}]
["","13.",{"$f":"Orçamento!$P395","v":""},null,null,null,{"$f":"IFERROR(Orçamento!S395,\"-\")","v":0},{"$f":"IFERROR(Orçamento!V395,\"\")","v":0},{"$f":"Orçamento!X395","v":{"$error":"#DIV/0!"}}]
["","14.",{"$f":"Orçamento!$P396","v":""},null,null,null,{"$f":"IFERROR(Orçamento!S396,\"-\")","v":0},{"$f":"IFERROR(Orçamento!V396,\"\")","v":0},{"$f":"Orçamento!X396","v":{"$error":"#DIV/0!"}}]
["","15.",{"$f":"Orçamento!$P397","v":""},null,null,null,{"$f":"IFERROR(Orçamento!S397,\"-\")","v":0},{"$f":"IFERROR(Orçamento!V397,\"\")","v":0},{"$f":"Orçamento!X397","v":{"$error":"#DIV/0!"}}]
["","16.",{"$f":"Orçamento!$P398","v":""},null,null,null,{"$f":"IFERROR(Orçamento!S398,\"-\")","v":0},{"$f":"IFERROR(Orçamento!V398,\"\")","v":0},{"$f":"Orçamento!X398","v":{"$error":"#DIV/0!"}}]
["","17.",{"$f":"Orçamento!$P399","v":""},null,null,null,{"$f":"IFERROR(Orçamento!S399,\"-\")","v":0},{"$f":"IFERROR(Orçamento!V399,\"\")","v":0},{"$f":"Orçamento!X399","v":{"$error":"#DIV/0!"}}]
["","18.",{"$f":"Orçamento!$P400","v":""},null,null,null,{"$f":"IFERROR(Orçamento!S400,\"-\")","v":0},{"$f":"IFERROR(Orçamento!V400,\"\")","v":0},{"$f":"Orçamento!X400","v":{"$error":"#DIV/0!"}}]
["","19.",{"$f":"Orçamento!$P401","v":""},null,null,null,{"$f":"IFERROR(Orçamento!S401,\"-\")","v":0},{"$f":"IFERROR(Orçamento!V401,\"\")","v":0},{"$f":"Orçamento!X401","v":{"$error":"#DIV/0!"}}]
["","20.",{"$f":"Orçamento!$P402","v":""},null,null,null,{"$f":"IFERROR(Orçamento!S402,\"-\")","v":0},{"$f":"IFERROR(Orçamento!V402,\"\")","v":0},{"$f":"Orçamento!X402","v":{"$error":"#DIV/0!"}}]
["F","TOTAL GERAL DO ORÇAMENTO (R$)",null,null,null,null,{"$f":"SUM(G17:G36)","v":0},0,{"$f":"SUM(I17:I36)","v":{"$error":"#DIV/0!"}}]
["F"]
["F"]

{"sheet":"Somatório","index":2,"n_rows":45,"n_cols":6,"rows_kept":45,"cut":false,"hidden":false,"merged":[[0,1,0,5],[14,1,14,5],[2,1,2,3],[2,4,2,5],[3,1,3,3],[3,4,3,5],[5,1,5,3],[5,4,5,5],[6,1,6,3],[6,4,6,5],[8,1,8,3],[8,4,8,5],[1,1,1,5],[4,1,4,5],[7,1,7,5],[10,1,10,5],[9,1,9,3],[9,4,9,5],[11,1,11,2],[11,4,11,5],[12,1,12,2],[12,4,12,5],[13,0,14,0],[42,1,42,2],[44,1,44,5],[47,3,47,5],[48,3,48,5],[13,1,13,5]]}
[]
[]
[null,"UNIDADE ESCOLAR",null,null,"CÓDIGO INEP"]
[null,{"$f":"Orçamento!$O$4","v":"ACERVO DAS ESCOLAS EXTINTAS DE GOIÂNIA"},null,null,{"$f":"Orçamento!V4","v":0}]
[]
[null,"OBRA",null,null,"CIDADE"]
[null,{"$f":"Orçamento!$O$7","v":"AMPLIAÇÃO E REFORMA"},null,null,{"$f":"Orçamento!$V$7","v":"GOIÂNIA"}]
[]
[null,"ENDEREÇO",null,null,"CRE"]
[null,{"$f":"Orçamento!$R$10","v":"AV. HUGO DE CARVALHO RAMOS, VILA IRANY"},null,null,{"$f":"Orçamento!$O$10","v":"GOIÂNIA"}]
[]
[null,"REFERÊNCIA",null,"DATA","ÁREA TOTAL CONSTRUÍDA (M²)"]
[null,{"$f":"CONCATENATE(\"AGETOP E SINAPI - \",Orçamento!$T$10)","v":"AGETOP E SINAPI - ONERADA"},null,{"$f":"Orçamento!$S$7","v":"2020-09-02"},{"$f":"Orçamento!$V$13","v":2413.75}]
["FILTRO"]
[null,"SOMATÓRIO DE SERVIÇOS"]
["↓","ITEM","DESCRIÇÃO DOS SERVIÇOS","PREÇO SEM BDI (R$)","PREÇO COM BDI (R$)","PARTIC.  ( % )"]
[{"$f":"IF(D17>0,\"F\",\"\")","v":""},"a.",{"$f":"Orçamento!P349","v":"SERVIÇOS PRELIMINARES"},{"$f":"Orçamento!S349","v":0},{"$f":"Orçamento!V349","v":0},{"$f":"Orçamento!X349","v":0}]
[{"$f":"IF(D18>0,\"F\",\"\")","v":""},"b.",{"$f":"Orçamento!P350","v":"TRANSPORTES"},{"$f":"Orçamento!S350","v":0},{"$f":"Orçamento!V350","v":0},{"$f":"Orçamento!X350","v":0}]
["","c.",{"$f":"Orçamento!P351","v":"SERVIÇO EM TERRA"},{"$f":"Orçamento!S351","v":0},{"$f":"Orçamento!V351","v":0},{"$f":"Orçamento!X351","v":0}]
["","d.",{"$f":"Orçamento!P352","v":"FUNDAÇÕES E SONDAGENS"},{"$f":"Orçamento!S352","v":0},{"$f":"Orçamento!V352","v":0},{"$f":"Orçamento!X352","v":0}]
["","e.",{"$f":"Orçamento!P353","v":"ESTRUTURA"},{"$f":"Orçamento!S353","v":0},{"$f":"Orçamento!V353","v":0},{"$f":"Orçamento!X353","v":0}]
["","f.",{"$f":"Orçamento!P354","v":"INSTALAÇÕES ELÉTRICAS"},{"$f":"Orçamento!S354","v":0},{"$f":"Orçamento!V354","v":0},{"$f":"Orçamento!X354","v":0}]
["","g.",{"$f":"Orçamento!P355","v":"INSTALAÇÕES HIDROSSANITÁRIAS"},{"$f":"Orçamento!S355","v":0},{"$f":"Orçamento!V355","v":0},{"$f":"Orçamento!X355","v":0}]
["","h.",{"$f":"Orçamento!P356","v":"INSTALAÇÕES ESPECIAIS"},{"$f":"Orçamento!S356","v":0},{"$f":"Orçamento!V356","v":0},{"$f":"Orçamento!X356","v":0}]
["","i.",{"$f":"Orçamento!P357","v":"ALVENARIAS E DIVISÓRIAS"},{"$f":"Orçamento!S357","v":0},{"$f":"Orçamento!V357","v":0},{"$f":"Orçamento!X357","v":0}]
["","j.",{"$f":"Orçamento!P358","v":"ALVENARIA AUTO-PORTANTE"},{"$f":"Orçamento!S358","v":0},{"$f":"Orçamento!V358","v":0},{"$f":"Orçamento!X358","v":0}]
["","k.",{"$f":"Orçamento!P359","v":"IMPERMEABILIZAÇÃO"},{"$f":"Orçamento!S359","v":0},{"$f":"Orçamento!V359","v":0},{"$f":"Orçamento!X359","v":0}]
["","l.",{"$f":"Orçamento!P360","v":"ISOLAMENTO TÉRMICO E ACÚSTICO"},{"$f":"Orçamento!S360","v":0},{"$f":"Orçamento!V360","v":0},{"$f":"Orçamento!X360","v":0}]
["","m.",{"$f":"Orçamento!P361","v":"ESTRUTURA DE MADEIRA"},{"$f":"Orçamento!S361","v":0},{"$f":"Orçamento!V361","v":0},{"$f":"Orçamento!X361","v":0}]
["","n.",{"$f":"Orçamento!P362","v":"ESTRUTURAS METÁLICAS"},{"$f":"Orçamento!S362","v":0},{"$f":"Orçamento!V362","v":0},{"$f":"Orçamento!X362","v":0}]
["","o.",{"$f":"Orçamento!P363","v":"COBERTURAS"},{"$f":"Orçamento!S363","v":0},{"$f":"Orçamento!V363","v":0},{"$f":"Orçamento!X363","v":0}]
["","p.",{"$f":"Orçamento!P364","v":"ESQUADRIAS DE MADEIRA"},{"$f":"Orçamento!S364","v":0},{"$f":"Orçamento!V364","v":0},{"$f":"Orçamento!X364","v":0}]
["","q.",{"$f":"Orçamento!P365","v":"ESQUADRIAS METÁLICAS"},{"$f":"Orçamento!S365","v":0},{"$f":"Orçamento!V365","v":0},{"$f":"Orçamento!X365","v":0}]
["","r.",{"$f":"Orçamento!P366","v":"VIDROS"},{"$f":"Orçamento!S366","v":0},{"$f":"Orçamento!V366","v":0},{"$f":"Orçamento!X366","v":0}]
["","s.",{"$f":"Orçamento!P367","v":"REVESTIMENTO DE PAREDE"},{"$f":"Orçamento!S367","v":0},{"$f":"Orçamento!V367","v":0},{"$f":"Orçamento!X367","v":0}]
["","t.",{"$f":"Orçamento!P368","v":"FORROS"},{"$f":"Orçamento!S368","v":0},{"$f":"Orçamento!V368","v":0},{"$f":"Orçamento!X368","v":0}]
["","u.",{"$f":"Orçamento!P369","v":"REVESTIMENTO DE PISO"},{"$f":"Orçamento!S369","v":0},{"$f":"Orçamento!V369","v":0},{"$f":"Orçamento!X369","v":0}]
["","v.",{"$f":"Orçamento!P370","v":"FERRAGENS"},{"$f":"Orçamento!S370","v":0},{"$f":"Orçamento!V370","v":0},{"$f":"Orçamento!X370","v":0}]
["","w.",{"$f":"Orçamento!P371","v":"MARCENARIA"},{"$f":"Orçamento!S371","v":0},{"$f":"Orçamento!V371","v":0},{"$f":"Orçamento!X371","v":0}]
["","x.",{"$f":"Orçamento!P372","v":"ADMINISTRAÇÃO"},{"$f":"Orçamento!S372","v":0},{"$f":"Orçamento!V372","v":0},{"$f":"Orçamento!X372","v":0}]
["","y.",{"$f":"Orçamento!P373","v":"PINTURA"},{"$f":"Orçamento!S373","v":0},{"$f":"Orçamento!V373","v":0},{"$f":"Orçamento!X373","v":0}]
["","z.",{"$f":"Orçamento!P374","v":"DIVERSOS"},{"$f":"Orçamento!S374","v":0},{"$f":"Orçamento!V374","v":0},{"$f":"Orçamento!X374","v":0}]
["F","TOTAL GERAL DO ORÇAMENTO",null,{"$f":"SUM(D17:D42)","v":0},{"$f":"SUM(E17:E42)","v":0},{"$f":"SUM(F17:F42)","v":0}]
[]
[null,"(*) Para itens da AGETOP, os vidros não estão inclusos nas esquadrias e já foram considerados os custos de contramarco para as esquadrias de alumínio;"]

{"sheet":"Cronog_90_Dias","index":3,"n_rows":99,"n_cols":20,"rows_kept":99,"cut":false,"hidden":false,"merged":[[97,1,97,4],[98,1,98,17],[94,1,94,2],[94,5,94,8],[94,9,94,12],[94,13,94,16],[95,1,95,2],[95,5,95,8],[95,9,95,12],[95,13,95,16],[92,1,92,2],[92,5,92,8],[92,9,92,12],[92,13,92,16],[93,1,93,2],[93,5,93,8],[93,9,93,12],[93,13,93,16],[89,1,91,2],[89,3,91,3],[89,4,91,4],[89,5,89,8],[89,9,89,12],[89,13,89,16],[91,5,91,8],[91,9,91,12],[91,13,91,16],[86,1,88,2],[86,3,88,3],[86,4,88,4],[86,5,86,8],[86,9,86,12],[86,13,86,16],[88,5,88,8],[88,9,88,12],[88,13,88,16],[83,1,85,2],[83,3,85,3],[83,4,85,4],[83,5,83,8],[83,9,83,12],[83,13,83,16],[85,5,85,8],[85,9,85,12],[85,13,85,16],[80,1,82,2],[80,3,82,3],[80,4,82,4],[80,5,80,8],[80,9,80,12],[80,13,80,16],[82,5,82,8],[82,9,82,12],[82,13,82,16],[77,1,79,2],[77,3,79,3],[77,4,79,4],[77,5,77,8],[77,9,77,12],[77,13,77,16],[79,5,79,8],[79,9,79,12],[79,13,79,16],[74,1,76,2],[74,3,76,3],[74,4,76,4],[74,5,74,8],[74,9,74,12],[74,13,74,16],[76,5,76,8],[76,9,76,12],[76,13,76,16],[71,1,73,2],[71,3,73,3],[71,4,73,4],[71,5,71,8],[71,9,71,12],[71,13,71,16],[73,5,73,8],[73,9,73,12],[73,13,73,16],[68,1,70,2],[68,3,70,3],[68,4,70,4],[68,5,68,8],[68,9,68,12],[68,13,68,16],[70,5,70,8],[70,9,70,12],[70,13,70,16],[65,1,67,2],[65,3,67,3],[65,4,67,4],[65,5,65,8],[65,9,65,12],[65,13,65,16],[67,5,67,8],[67,9,67,12],[67,13,67,16],[62,1,64,2],[62,3,64,3],[62,4,64,4],[62,5,62,8],[62,9,62,12],[62,13,62,16],[64,5,64,8],[64,9,64,12],[64,13,64,16],[59,1,61,2],[59,3,61,3],[59,4,61,4],[59,5,59,8],[59,9,59,12],[59,13,59,16],[61,5,61,8],[61,9,61,12],[61,13,61,16],[56,1,58,2],[56,3,58,3],[56,4,58,4],[56,5,56,8],[56,9,56,12],[56,13,56,16],[58,5,58,8],[58,9,58,12],[58,13,58,16],[53,1,55,2],[53,3,55,3],[53,4,55,4],[53,5,53,8],[53,9,53,12],[53,13,53,16],[55,5,55,8],[55,9,55,12],[55,13,55,16],[50,1,52,2],[50,3,52,3],[50,4,52,4],[50,5,50,8],[50,9,50,12],[50,13,50,16],[52,5,52,8],[52,9,52,12],[52,13,52,16],[47,1,49,2],[47,3,49,3],[47,4,49,4],[47,5,47,8],[47,9,47,12],[47,13,47,16],[49,5,49,8],[49,9,49,12],[49,13,49,16],[44,1,46,2],[44,3,46,3],[44,4,46,4],[44,5,44,8],[44,9,44,12],[44,13,44,16],[46,5,46,8],[46,9,46,12],[46,13,46,16],[41,1,43,2],[41,3,43,3],[41,4,43,4],[41,5,41,8],[41,9,41,12],[41,13,41,16],[43,5,43,8],[43,9,43,12],[43,13,43,16],[38,1,40,2],[38,3,40,3],[38,4,40,4],[38,5,38,8],[38,9,38,12],[38,13,38,16],[40,5,40,8],[40,9,40,12],[40,13,40,16],[35,1,37,2],[35,3,37,3],[35,4,37,4],[35,5,35,8],[35,9,35,12],[35,13,35,16],[37,5,37,8],[37,9,37,12],[37,13,37,16],[32,1,34,2],[32,3,34,3],[32,4,34,4],[32,5,32,8],[32,9,32,12],[32,13,32,16],[34,5,34,8],[34,9,34,12],[34,13,34,16],[29,1,31,2],[29,3,31,3],[29,4,31,4],[29,5,29,8],[29,9,29,12],[29,13,29,16],[31,5,31,8],[31,9,31,12],[31,13,31,16],[26,1,28,2],[26,3,28,3],[26,4,28,4],[26,5,26,8],[26,9,26,12],[26,13,26,16],[28,5,28,8],[28,9,28,12],[28,13,28,16],[23,1,25,2],[23,3,25,3],[23,4,25,4],[23,5,23,8],[23,9,23,12],[23,13,23,16],[25,5,25,8],[25,9,25,12],[25,13,25,16],[20,1,22,2],[20,3,22,3],[20,4,22,4],[20,5,20,8],[20,9,20,12],[20,13,20,16],[22,5,22,8],[22,9,22,12],[22,13,22,16],[17,1,19,2],[17,3,19,3],[17,4,19,4],[17,5,17,8],[17,9,17,12],[17,13,17,16],[19,5,19,8],[19,9,19,12],[19,13,19,16],[14,1,16,2],[14,3,16,3],[14,4,16,4],[14,5,14,8],[14,9,14,12],[14,13,14,16],[16,5,16,8],[16,9,16,12],[16,13,16,16],[12,0,13,0],[12,3,13,3],[12,5,12,8],[12,9,12,12],[12,13,12,16],[12,17,13,17],[13,1,13,2],[13,5,13,8],[13,9,13,12],[13,13,13,16],[0,1,0,17],[1,1,1,17],[2,1,2,7],[2,8,2,17],[3,1,3,7],[3,8,3,17],[8,1,8,7],[8,8,8,17],[9,0,11,0],[9,1,9,7],[9,8,9,17],[10,1,10,17],[11,1,11,17],[4,1,4,17],[5,1,5,7],[5,8,5,17],[6,1,6,7],[6,8,6,17],[7,1,7,17]]}
[]
[]
[null,"UNIDADE ESCOLAR",null,null,null,null,null,null,"PRAZO"]
[null,{"$f":"Orçamento!O4","v":"ACERVO DAS ESCOLAS EXTINTAS DE GOIÂNIA"},null,null,null,null,null,null,"90 DIAS CORRIDOS"]
[]
[null,"OBRA",null,null,null,null,null,null,"DATA"]
[null,{"$f":"Orçamento!O7","v":"AMPLIAÇÃO E REFORMA"},null,null,null,null,null,null,{"$f":"Orçamento!S7","v":"2020-09-02"}]
[]
[null,"LOCAL",null,null,null,null,null,null,"ÁREA TOTAL CONSTRUÍDA (M²)"]
["FILTRO",{"$f":"Orçamento!V7","v":"GOIÂNIA"},null,null,null,null,null,null,{"$f":"Orçamento!V13","v":2413.75}]
[]
[null,"CRONOGRAMA - FÍSICO FINANCEIRO"]
["↓","CUSTO TOTAL:",{"$f":"D93","v":0},"VALOR","Dias:",30,null,null,null,60,null,null,null,90,null,null,null,"TOTAL"]
[null,"DESCRIÇÃO DOS SERVIÇOS",null,null,"%","1ª PARCELA",null,null,null,"2ª PARCELA",null,null,null,"3ª PARCELA"]
[{"$f":"IF(D15>0,\"F\",\"\")","v":""},"SERVIÇOS PRELIMINARES",null,{"$f":"Orçamento!V349","v":0},{"$f":"Orçamento!X349","v":0},{"$f":"ROUND(F17*$D$15,2)","v":0},null,null,null,{"$f":"ROUND(J17*$D$15,2)","v":0},null,null,null,{"$f":"ROUND(N17*$D$15,2)","v":0},null,null,null,{"$f":"SUM(F15:Q15)","v":0},null,{"$f":"IF(D15=R15,\"OK\",\"ERRO\")","v":"OK"}]
[{"$f":"IF(A15=\"F\",A15,\"\")","v":""}]
[{"$f":"IF(A16=\"F\",A16,\"\")","v":""},null,null,null,null,1,null,null,null,0,null,null,null,{"$f":"1-F17-J17","v":0},null,null,null,{"$f":"IFERROR(E15/100,\"\")","v":0},null,{"$f":"IF(E15=R17*100,\"OK\",\"ERRO\")","v":"OK"}]
[{"$f":"IF(D18>0,\"F\",\"\")","v":""},"TRANSPORTES",null,{"$f":"Orçamento!V350","v":0},{"$f":"Orçamento!X350","v":0},{"$f":"ROUND(F20*$D$18,2)","v":0},null,null,null,{"$f":"ROUND(J20*$D$18,2)","v":0},null,null,null,{"$f":"ROUND(N20*$D$18,2)","v":0},null,null,null,{"$f":"SUM(F18:Q18)","v":0},null,{"$f":"IF(D18=R18,\"OK\",\"ERRO\")","v":"OK"}]
[{"$f":"IF(A18=\"F\",A18,\"\")","v":""}]
[{"$f":"IF(A19=\"F\",A19,\"\")","v":""},null,null,null,null,0.33500000000000002,null,null,null,0.33,null,null,null,{"$f":"1-F20-J20","v":0.33500000000000002},null,null,null,{"$f":"IFERROR(E18/100,\"\")","v":0},null,{"$f":"IF(E18=R20*100,\"OK\",\"ERRO\")","v":"OK"}]
[{"$f":"IF(D21>0,\"F\",\"\")","v":""},"SERVIÇO EM TERRA",null,{"$f":"Orçamento!V351","v":0},{"$f":"Orçamento!X351","v":0},{"$f":"ROUND(F23*$D$21,2)","v":0},null,null,null,{"$f":"ROUND(J23*$D$21,2)","v":0},null,null,null,{"$f":"ROUND(N23*$D$21,2)","v":0},null,null,null,{"$f":"SUM(F21:Q21)","v":0},null,{"$f":"IF(D21=R21,\"OK\",\"ERRO\")","v":"OK"}]
[{"$f":"IF(A21=\"F\",A21,\"\")","v":""}]
[{"$f":"IF(A22=\"F\",A22,\"\")","v":""},null,null,null,null,1,null,null,null,0,null,null,null,{"$f":"1-F23-J23","v":0},null,null,null,{"$f":"IFERROR(E21/100,\"\")","v":0},null,{"$f":"IF(E21=R23*100,\"OK\",\"ERRO\")","v":"OK"}]
[{"$f":"IF(D24>0,\"F\",\"\")","v":""},"FUNDAÇÕES E SONDAGENS",null,{"$f":"Orçamento!V352","v":0},{"$f":"Orçamento!X352","v":0},{"$f":"ROUND(F26*$D$24,2)","v":0},null,null,null,{"$f":"ROUND(J26*$D$24,2)","v":0},null,null,null,{"$f":"ROUND(N26*$D$24,2)","v":0},null,null,null,{"$f":"SUM(F24:Q24)","v":0},null,{"$f":"IF(D24=R24,\"OK\",\"ERRO\")","v":"OK"}]
[{"$f":"IF(A24=\"F\",A24,\"\")","v":""}]
[{"$f":"IF(A25=\"F\",A25,\"\")","v":""},null,null,null,null,1,null,null,null,0,null,null,null,{"$f":"1-F26-J26","v":0},null,null,null,{"$f":"IFERROR(E24/100,\"\")","v":0},null,{"$f":"IF(E24=R26*100,\"OK\",\"ERRO\")","v":"OK"}]
[{"$f":"IF(D27>0,\"F\",\"\")","v":""},"ESTRUTURA",null,{"$f":"Orçamento!V353","v":0},{"$f":"Orçamento!X353","v":0},{"$f":"ROUND(F29*$D$27,2)","v":0},null,null,null,{"$f":"ROUND(J29*$D$27,2)","v":0},null,null,null,{"$f":"ROUND(N29*$D$27,2)","v":0},null,null,null,{"$f":"SUM(F27:Q27)","v":0},null,{"$f":"IF(D27=R27,\"OK\",\"ERRO\")","v":"OK"}]
[{"$f":"IF(A27=\"F\",A27,\"\")","v":""}]
[{"$f":"IF(A28=\"F\",A28,\"\")","v":""},null,null,null,null,0.54,null,null,null,0.46,null,null,null,{"$f":"1-F29-J29","v":0},null,null,null,{"$f":"IFERROR(E27/100,\"\")","v":0},null,{"$f":"IF(E27=R29*100,\"OK\",\"ERRO\")","v":"OK"}]
[{"$f":"IF(D30>0,\"F\",\"\")","v":""},"INST.ELET/TELEFÔNICA/CABEAMENTO ESTRUTURADO",null,{"$f":"Orçamento!V354","v":0},{"$f":"Orçamento!X354","v":0},{"$f":"ROUND(F32*$D$30,2)","v":0},null,null,null,{"$f":"ROUND(J32*$D$30,2)","v":0},null,null,null,{"$f":"ROUND(N32*$D$30,2)","v":0},null,null,null,{"$f":"SUM(F30:Q30)","v":0},null,{"$f":"IF(D30=R30,\"OK\",\"ERRO\")","v":"OK"}]
[{"$f":"IF(A30=\"F\",A30,\"\")","v":""}]
[{"$f":"IF(A31=\"F\",A31,\"\")","v":""},null,null,null,null,0.26,null,null,null,0.74,null,null,null,{"$f":"1-F32-J32","v":0},null,null,null,{"$f":"IFERROR(E30/100,\"\")","v":0},null,{"$f":"IF(E30=R32*100,\"OK\",\"ERRO\")","v":"OK"}]
[{"$f":"IF(D33>0,\"F\",\"\")","v":""},"INSTALAÇÕES HIDROSSANITÁRIAS",null,{"$f":"Orçamento!V355","v":0},{"$f":"Orçamento!X355","v":0},{"$f":"ROUND(F35*$D$33,2)","v":0},null,null,null,{"$f":"ROUND(J35*$D$33,2)","v":0},null,null,null,{"$f":"ROUND(N35*$D$33,2)","v":0},null,null,null,{"$f":"SUM(F33:Q33)","v":0},null,{"$f":"IF(D33=R33,\"OK\",\"ERRO\")","v":"OK"}]
[{"$f":"IF(A33=\"F\",A33,\"\")","v":""}]
[{"$f":"IF(A34=\"F\",A34,\"\")","v":""},null,null,null,null,0.26,null,null,null,0.74,null,null,null,{"$f":"1-F35-J35","v":0},null,null,null,{"$f":"IFERROR(E33/100,\"\")","v":0},null,{"$f":"IF(E33=R35*100,\"OK\",\"ERRO\")","v":"OK"}]
[{"$f":"IF(D36>0,\"F\",\"\")","v":""},"INSTALAÇÕES ESPECIAIS",null,{"$f":"Orçamento!V356","v":0},{"$f":"Orçamento!X356","v":0},{"$f":"ROUND(F38*$D$36,2)","v":0},null,null,null,{"$f":"ROUND(J38*$D$36,2)","v":0},null,null,null,{"$f":"ROUND(N38*$D$36,2)","v":0},null,null,null,{"$f":"SUM(F36:Q36)","v":0},null,{"$f":"IF(D36=R36,\"OK\",\"ERRO\")","v":"OK"}]
[{"$f":"IF(A36=\"F\",A36,\"\")","v":""}]
[{"$f":"IF(A37=\"F\",A37,\"\")","v":""},null,null,null,null,0.26,null,null,null,0.74,null,null,null,{"$f":"1-F38-J38","v":0},null,null,null,{"$f":"IFERROR(E36/100,\"\")","v":0},null,{"$f":"IF(E36=R38*100,\"OK\",\"ERRO\")","v":"OK"}]
[{"$f":"IF(D39>0,\"F\",\"\")","v":""},"ALVENARIA E DIVISÓRIAS",null,{"$f":"Orçamento!V357","v":0},{"$f":"Orçamento!X357","v":0},{"$f":"ROUND(F41*$D$39,2)","v":0},null,null,null,{"$f":"ROUND(J41*$D$39,2)","v":0},null,null,null,{"$f":"ROUND(N41*$D$39,2)","v":0},null,null,null,{"$f":"SUM(F39:Q39)","v":0},null,{"$f":"IF(D39=R39,\"OK\",\"ERRO\")","v":"OK"}]
[{"$f":"IF(A39=\"F\",A39,\"\")","v":""}]
[{"$f":"IF(A40=\"F\",A40,\"\")","v":""},null,null,null,null,0.26,null,null,null,0.74,null,null,null,{"$f":"1-F41-J41","v":0},null,null,null,{"$f":"IFERROR(E39/100,\"\")","v":0},null,{"$f":"IF(E39=R41*100,\"OK\",\"ERRO\")","v":"OK"}]
[{"$f":"IF(D42>0,\"F\",\"\")","v":""},"ALVENARIA AUTO-PORTANTE",null,{"$f":"Orçamento!V358","v":0},{"$f":"Orçamento!X358","v":0},{"$f":"ROUND(F44*$D$42,2)","v":0},null,null,null,{"$f":"ROUND(J44*$D$42,2)","v":0},null,null,null,{"$f":"ROUND(N44*$D$42,2)","v":0},null,null,null,{"$f":"SUM(F42:Q42)","v":0},null,{"$f":"IF(D42=R42,\"OK\",\"ERRO\")","v":"OK"}]
[{"$f":"IF(A42=\"F\",A42,\"\")","v":""}]
[{"$f":"IF(A43=\"F\",A43,\"\")","v":""},null,null,null,null,0,null,null,null,{"$f":"1-B44","v":1},null,null,null,{"$f":"1-F44-J44","v":0},null,null,null,{"$f":"IFERROR(E42/100,\"\")","v":0},null,{"$f":"IF(E42=R44*100,\"OK\",\"ERRO\")","v":"OK"}]
[{"$f":"IF(D45>0,\"F\",\"\")","v":""},"IMPERMEABILIZAÇÃO",null,{"$f":"Orçamento!V359","v":0},{"$f":"Orçamento!X359","v":0},{"$f":"ROUND(F47*$D$45,2)","v":0},null,null,null,{"$f":"ROUND(J47*$D$45,2)","v":0},null,null,null,{"$f":"ROUND(N47*$D$45,2)","v":0},null,null,null,{"$f":"SUM(F45:Q45)","v":0},null,{"$f":"IF(D45=R45,\"OK\",\"ERRO\")","v":"OK"}]
[{"$f":"IF(A45=\"F\",A45,\"\")","v":""}]
[{"$f":"IF(A46=\"F\",A46,\"\")","v":""},null,null,null,null,0.85,null,null,null,0.15,null,null,null,{"$f":"1-F47-J47","v":0},null,null,null,{"$f":"IFERROR(E45/100,\"\")","v":0},null,{"$f":"IF(E45=R47*100,\"OK\",\"ERRO\")","v":"OK"}]
[{"$f":"IF(D48>0,\"F\",\"\")","v":""},"ISOLAMENTO TÉRMICO E ACÚSTICO",null,{"$f":"Orçamento!V360","v":0},{"$f":"Orçamento!X360","v":0},{"$f":"ROUND(F50*$D$48,2)","v":0},null,null,null,{"$f":"ROUND(J50*$D$48,2)","v":0},null,null,null,{"$f":"ROUND(N50*$D$48,2)","v":0},null,null,null,{"$f":"SUM(F48:Q48)","v":0},null,{"$f":"IF(D48=R48,\"OK\",\"ERRO\")","v":"OK"}]
[{"$f":"IF(A48=\"F\",A48,\"\")","v":""}]
[{"$f":"IF(A49=\"F\",A49,\"\")","v":""},null,null,null,null,0,null,null,null,{"$f":"1-B50","v":1},null,null,null,{"$f":"1-F50-J50","v":0},null,null,null,{"$f":"IFERROR(E48/100,\"\")","v":0},null,{"$f":"IF(E48=R50*100,\"OK\",\"ERRO\")","v":"OK"}]
[{"$f":"IF(D51>0,\"F\",\"\")","v":""},"ESTRUTURA DE MADEIRA",null,{"$f":"Orçamento!V361","v":0},{"$f":"Orçamento!X361","v":0},{"$f":"ROUND(F53*$D$51,2)","v":0},null,null,null,{"$f":"ROUND(J53*$D$51,2)","v":0},null,null,null,{"$f":"ROUND(N53*$D$51,2)","v":0},null,null,null,{"$f":"SUM(F51:Q51)","v":0},null,{"$f":"IF(D51=R51,\"OK\",\"ERRO\")","v":"OK"}]
[{"$f":"IF(A51=\"F\",A51,\"\")","v":""}]
[{"$f":"IF(A52=\"F\",A52,\"\")","v":""},null,null,null,null,0,null,null,null,0.57999999999999996,null,null,null,{"$f":"1-F53-J53","v":0.42000000000000004},null,null,null,{"$f":"IFERROR(E51/100,\"\")","v":0},null,{"$f":"IF(E51=R53*100,\"OK\",\"ERRO\")","v":"OK"}]
[{"$f":"IF(D54>0,\"F\",\"\")","v":""},"ESTRUTURA METÁLICA",null,{"$f":"Orçamento!V362","v":0},{"$f":"Orçamento!X362","v":0},{"$f":"ROUND(F56*$D$54,2)","v":0},null,null,null,{"$f":"ROUND(J56*$D$54,2)","v":0},null,null,null,{"$f":"ROUND(N56*$D$54,2)","v":0},null,null,null,{"$f":"SUM(F54:Q54)","v":0},null,{"$f":"IF(D54=R54,\"OK\",\"ERRO\")","v":"OK"}]
[{"$f":"IF(A54=\"F\",A54,\"\")","v":""}]
[{"$f":"IF(A55=\"F\",A55,\"\")","v":""},null,null,null,null,0,null,null,null,0.57999999999999996,null,null,null,{"$f":"1-F56-J56","v":0.42000000000000004},null,null,null,{"$f":"IFERROR(E54/100,\"\")","v":0},null,{"$f":"IF(E54=R56*100,\"OK\",\"ERRO\")","v":"OK"}]
[{"$f":"IF(D57>0,\"F\",\"\")","v":""},"COBERTURAS",null,{"$f":"Orçamento!V363","v":0},{"$f":"Orçamento!X363","v":0},{"$f":"ROUND(F59*$D$57,2)","v":0},null,null,null,{"$f":"ROUND(J59*$D$57,2)","v":0},null,null,null,{"$f":"ROUND(N59*$D$57,2)","v":0},null,null,null,{"$f":"SUM(F57:Q57)","v":0},null,{"$f":"IF(D57=R57,\"OK\",\"ERRO\")","v":"OK"}]
[{"$f":"IF(A57=\"F\",A57,\"\")","v":""}]
[{"$f":"IF(A58=\"F\",A58,\"\")","v":""},null,null,null,null,0,null,null,null,0,null,null,null,{"$f":"1-F59-J59","v":1},null,null,null,{"$f":"IFERROR(E57/100,\"\")","v":0},null,{"$f":"IF(E57=R59*100,\"OK\",\"ERRO\")","v":"OK"}]
[{"$f":"IF(D60>0,\"F\",\"\")","v":""},"ESQUADRIAS DE MADEIRA",null,{"$f":"Orçamento!V364","v":0},{"$f":"Orçamento!X364","v":0},{"$f":"ROUND(F62*$D$60,2)","v":0},null,null,null,{"$f":"ROUND(J62*$D$60,2)","v":0},null,null,null,{"$f":"ROUND(N62*$D$60,2)","v":0},null,null,null,{"$f":"SUM(F60:Q60)","v":0},null,{"$f":"IF(D60=R60,\"OK\",\"ERRO\")","v":"OK"}]
[{"$f":"IF(A60=\"F\",A60,\"\")","v":""}]
[{"$f":"IF(A61=\"F\",A61,\"\")","v":""},null,null,null,null,0,null,null,null,0.4,null,null,null,{"$f":"1-F62-J62","v":0.6},null,null,null,{"$f":"IFERROR(E60/100,\"\")","v":0},null,{"$f":"IF(E60=R62*100,\"OK\",\"ERRO\")","v":"OK"}]
[{"$f":"IF(D63>0,\"F\",\"\")","v":""},"ESQUADRIAS METÁLICAS",null,{"$f":"Orçamento!V365","v":0},{"$f":"Orçamento!X365","v":0},{"$f":"ROUND(F65*$D$63,2)","v":0},null,null,null,{"$f":"ROUND(J65*$D$63,2)","v":0},null,null,null,{"$f":"ROUND(N65*$D$63,2)","v":0},null,null,null,{"$f":"SUM(F63:Q63)","v":0},null,{"$f":"IF(D63=R63,\"OK\",\"ERRO\")","v":"OK"}]
[{"$f":"IF(A63=\"F\",A63,\"\")","v":""}]
[{"$f":"IF(A64=\"F\",A64,\"\")","v":""},null,null,null,null,0,null,null,null,0.45,null,null,null,{"$f":"1-F65-J65","v":0.55000000000000004},null,null,null,{"$f":"IFERROR(E63/100,\"\")","v":0},null,{"$f":"IF(E63=R65*100,\"OK\",\"ERRO\")","v":"OK"}]
[{"$f":"IF(D66>0,\"F\",\"\")","v":""},"VIDROS",null,{"$f":"Orçamento!V366","v":0},{"$f":"Orçamento!X366","v":0},{"$f":"ROUND(F68*$D$66,2)","v":0},null,null,null,{"$f":"ROUND(J68*$D$66,2)","v":0},null,null,null,{"$f":"ROUND(N68*$D$66,2)","v":0},null,null,null,{"$f":"SUM(F66:Q66)","v":0},null,{"$f":"IF(D66=R66,\"OK\",\"ERRO\")","v":"OK"}]
[{"$f":"IF(A66=\"F\",A66,\"\")","v":""}]
[{"$f":"IF(A67=\"F\",A67,\"\")","v":""},null,null,null,null,0,null,null,null,0,null,null,null,{"$f":"1-F68-J68","v":1},null,null,null,{"$f":"IFERROR(E66/100,\"\")","v":0},null,{"$f":"IF(E66=R68*100,\"OK\",\"ERRO\")","v":"OK"}]
[{"$f":"IF(D69>0,\"F\",\"\")","v":""},"REVESTIMENTO DE PAREDE",null,{"$f":"Orçamento!V367","v":0},{"$f":"Orçamento!X367","v":0},{"$f":"ROUND(F71*$D$69,2)","v":0},null,null,null,{"$f":"ROUND(J71*$D$69,2)","v":0},null,null,null,{"$f":"ROUND(N71*$D$69,2)","v":0},null,null,null,{"$f":"SUM(F69:Q69)","v":0},null,{"$f":"IF(D69=R69,\"OK\",\"ERRO\")","v":"OK"}]
[{"$f":"IF(A69=\"F\",A69,\"\")","v":""}]
[{"$f":"IF(A70=\"F\",A70,\"\")","v":""},null,null,null,null,0,null,null,null,0.4,null,null,null,{"$f":"1-F71-J71","v":0.6},null,null,null,{"$f":"IFERROR(E69/100,\"\")","v":0},null,{"$f":"IF(E69=R71*100,\"OK\",\"ERRO\")","v":"OK"}]
[{"$f":"IF(D72>0,\"F\",\"\")","v":""},"FORROS",null,{"$f":"Orçamento!V368","v":0},{"$f":"Orçamento!X368","v":0},{"$f":"ROUND(F74*$D$72,2)","v":0},null,null,null,{"$f":"ROUND(J74*$D$72,2)","v":0},null,null,null,{"$f":"ROUND(N74*$D$72,2)","v":0},null,null,null,{"$f":"SUM(F72:Q72)","v":0},null,{"$f":"IF(D72=R72,\"OK\",\"ERRO\")","v":"OK"}]
[{"$f":"IF(A72=\"F\",A72,\"\")","v":""}]
[{"$f":"IF(A73=\"F\",A73,\"\")","v":""},null,null,null,null,0,null,null,null,0.4,null,null,null,{"$f":"1-F74-J74","v":0.6},null,null,null,{"$f":"IFERROR(E72/100,\"\")","v":0},null,{"$f":"IF(E72=R74*100,\"OK\",\"ERRO\")","v":"OK"}]
[{"$f":"IF(D75>0,\"F\",\"\")","v":""},"REVESTIMENTO DE PISO",null,{"$f":"Orçamento!V369","v":0},{"$f":"Orçamento!X369","v":0},{"$f":"ROUND(F77*$D$75,2)","v":0},null,null,null,{"$f":"ROUND(J77*$D$75,2)","v":0},null,null,null,{"$f":"ROUND(N77*$D$75,2)","v":0},null,null,null,{"$f":"SUM(F75:Q75)","v":0},null,{"$f":"IF(D75=R75,\"OK\",\"ERRO\")","v":"OK"}]
[{"$f":"IF(A75=\"F\",A75,\"\")","v":""}]
[{"$f":"IF(A76=\"F\",A76,\"\")","v":""},null,null,null,null,0,null,null,null,0.4,null,null,null,{"$f":"1-F77-J77","v":0.6},null,null,null,{"$f":"IFERROR(E75/100,\"\")","v":0},null,{"$f":"IF(E75=R77*100,\"OK\",\"ERRO\")","v":"OK"}]
[{"$f":"IF(D78>0,\"F\",\"\")","v":""},"FERRAGENS",null,{"$f":"Orçamento!V370","v":0},{"$f":"Orçamento!X370","v":0},{"$f":"ROUND(F80*$D$78,2)","v":0},null,null,null,{"$f":"ROUND(J80*$D$78,2)","v":0},null,null,null,{"$f":"ROUND(N80*$D$78,2)","v":0},null,null,null,{"$f":"SUM(F78:Q78)","v":0},null,{"$f":"IF(D78=R78,\"OK\",\"ERRO\")","v":"OK"}]
[{"$f":"IF(A78=\"F\",A78,\"\")","v":""}]
[{"$f":"IF(A79=\"F\",A79,\"\")","v":""},null,null,null,null,0,null,null,null,0,null,null,null,{"$f":"1-F80-J80","v":1},null,null,null,{"$f":"IFERROR(E78/100,\"\")","v":0},null,{"$f":"IF(E78=R80*100,\"OK\",\"ERRO\")","v":"OK"}]
[{"$f":"IF(D81>0,\"F\",\"\")","v":""},"MARCENARIA",null,{"$f":"Orçamento!V371","v":0},{"$f":"Orçamento!X371","v":0},{"$f":"ROUND(F83*$D$81,2)","v":0},null,null,null,{"$f":"ROUND(J83*$D$81,2)","v":0},null,null,null,{"$f":"ROUND(N83*$D$81,2)","v":0},null,null,null,{"$f":"SUM(F81:Q81)","v":0},null,{"$f":"IF(D81=R81,\"OK\",\"ERRO\")","v":"OK"}]
[{"$f":"IF(A81=\"F\",A81,\"\")","v":""}]
[{"$f":"IF(A82=\"F\",A82,\"\")","v":""},null,null,null,null,0,null,null,null,0,null,null,null,{"$f":"1-F83-J83","v":1},null,null,null,{"$f":"IFERROR(E81/100,\"\")","v":0},null,{"$f":"IF(E81=R83*100,\"OK\",\"ERRO\")","v":"OK"}]
[{"$f":"IF(D84>0,\"F\",\"\")","v":""},"ADMINISTRAÇÃO - MENSALISTAS",null,{"$f":"Orçamento!V372","v":0},{"$f":"Orçamento!X372","v":0},{"$f":"ROUND(F86*$D$84,2)","v":0},null,null,null,{"$f":"ROUND(J86*$D$84,2)","v":0},null,null,null,{"$f":"ROUND(N86*$D$84,2)","v":0},null,null,null,{"$f":"SUM(F84:Q84)","v":0},null,{"$f":"IF(D84=R84,\"OK\",\"ERRO\")","v":"OK"}]
[{"$f":"IF(A84=\"F\",A84,\"\")","v":""}]
[{"$f":"IF(A85=\"F\",A85,\"\")","v":""},null,null,null,null,0.35,null,null,null,0.31,null,null,null,{"$f":"1-F86-J86","v":0.34},null,null,null,{"$f":"IFERROR(E84/100,\"\")","v":0},null,{"$f":"IF(E84=R86*100,\"OK\",\"ERRO\")","v":"OK"}]
[{"$f":"IF(D87>0,\"F\",\"\")","v":""},"PINTURA",null,{"$f":"Orçamento!V373","v":0},{"$f":"Orçamento!X373","v":0},{"$f":"ROUND(F89*$D$87,2)","v":0},null,null,null,{"$f":"ROUND(J89*$D$87,2)","v":0},null,null,null,{"$f":"ROUND(N89*$D$87,2)","v":0},null,null,null,{"$f":"SUM(F87:Q87)","v":0},null,{"$f":"IF(D87=R87,\"OK\",\"ERRO\")","v":"OK"}]
[{"$f":"IF(A87=\"F\",A87,\"\")","v":""}]
[{"$f":"IF(A88=\"F\",A88,\"\")","v":""},null,null,null,null,0,null,null,null,0,null,null,null,{"$f":"1-F89-J89","v":1},null,null,null,{"$f":"IFERROR(E87/100,\"\")","v":0},null,{"$f":"IF(E87=R89*100,\"OK\",\"ERRO\")","v":"OK"}]
[{"$f":"IF(D90>0,\"F\",\"\")","v":""},"DIVERSOS",null,{"$f":"Orçamento!V374","v":0},{"$f":"Orçamento!X374","v":0},{"$f":"ROUND(F92*$D$90,2)","v":0},null,null,null,{"$f":"ROUND(J92*$D$90,2)","v":0},null,null,null,{"$f":"ROUND(N92*$D$90,2)","v":0},null,null,null,{"$f":"SUM(F90:Q90)","v":0},null,{"$f":"IF(D90=R90,\"OK\",\"ERRO\")","v":"OK"}]
[{"$f":"IF(A90=\"F\",A90,\"\")","v":""}]
[{"$f":"IF(A91=\"F\",A91,\"\")","v":""},null,null,null,null,0,null,null,null,0,null,null,null,{"$f":"1-F92-J92","v":1},null,null,null,{"$f":"IFERROR(E90/100,\"\")","v":0},null,{"$f":"IF(E90=R92*100,\"OK\",\"ERRO\")","v":"OK"}]
["F","CUSTO DO ORÇAMENTO",null,{"$f":"SUM(D15:D92)","v":0},{"$f":"SUM(E15:E92)","v":0},{"$f":"F15+F18+F21+F24+F27+F30+F33+F36+F39+F42+F45+F48+F51+F54+F57+F60+F63+F66+F69+F72+F75+F78+F81+F84+F87+F90","v":0},null,null,null,{"$f":"J15+J18+J21+J24+J27+J30+J33+J36+J39+J42+J45+J48+J51+J54+J57+J60+J63+J66+J69+J72+J75+J78+J81+J84+J87+J90","v":0},null,null,null,{"$f":"N15+N18+N21+N24+N27+N30+N33+N36+N39+N42+N45+N48+N51+N54+N57+N60+N63+N66+N69+N72+N75+N78+N81+N84+N87+N90","v":0},null,null,null,{"$f":"R15+R18+R21+R24+R27+R30+R33+R36+R39+R42+R45+R48+R51+R54+R57+R60+R63+R66+R69+R72+R75+R78+R81+R84+R87+R90","v":0}]
["F","PERCENTUAIS:",null,null,null,{"$f":"IFERROR(F93/D93,\"\")","v":""},null,null,null,{"$f":"IFERROR(J93/D93,\"\")","v":""},null,null,null,{"$f":"IFERROR(N93/D93,\"\")","v":""},null,null,null,{"$f":"SUM(F94:Q94)","v":0}]
["F","TOTAIS ACUMULADOS:",null,null,null,{"$f":"F93","v":0},null,null,null,{"$f":"F95+J93","v":0},null,null,null,{"$f":"J95+N93","v":0}]
["F","PERCENTUAIS  ACUMULADOS:",null,null,null,{"$f":"F94","v":""},null,null,null,{"$f":"J94+F96","v":{"$error":"#VALUE!"}},null,null,null,{"$f":"IFERROR(J96+N94,\"\")","v":""}]
["F"]
["F","OBSERVAÇÕES:"]
["F","Os pagamentos somente poderão ser efetuados mediante medição e atesto pelos técnicos da Secretaria da Educação. "]

{"sheet":"Composição BDI","index":4,"n_rows":45,"n_cols":9,"rows_kept":45,"cut":false,"hidden":false,"merged":[[18,5,18,8],[17,0,17,3],[16,0,16,3],[44,0,44,3],[42,0,42,3],[43,0,43,3],[18,0,18,3],[36,0,36,3],[39,0,39,3],[38,0,38,3],[40,0,40,3],[29,0,29,2],[32,0,32,3],[33,0,33,3],[34,0,34,3],[35,0,35,3],[0,0,0,3],[1,0,1,3],[4,0,4,3],[7,0,7,3],[10,0,10,3],[2,0,2,3],[3,0,3,3],[5,0,5,3],[6,0,6,3],[8,0,8,3],[9,0,9,3],[11,0,11,3],[12,0,12,3],[14,0,14,3],[15,0,15,3],[13,0,13,3]]}
[]
[]
["UNIDADE ESCOLAR"]
[{"$f":"Orçamento!$O$4","v":"ACERVO DAS ESCOLAS EXTINTAS DE GOIÂNIA"}]
[]
["OBRA"]
[{"$f":"Orçamento!$O$7","v":"AMPLIAÇÃO E REFORMA"}]
[]
["ENDEREÇO"]
[{"$f":"Orçamento!$R$10","v":"AV. HUGO DE CARVALHO RAMOS, VILA IRANY"}]
[]
["CIDADE"]
[{"$f":"Orçamento!$V$7","v":"GOIÂNIA"}]
[]
["CRE"]
[{"$f":"Orçamento!$O$10","v":"GOIÂNIA"}]
[]
["DETALHAMENTO DA COMPOSIÇÃO DE BDI"]
["COMPOSIÇÃO BDI PARA OBRAS CIVIS",null,null,null,null,"BDI CONSTRUÇÃO E REFORMA"]
["DESCRIÇÃO","COEF.","TAXA % (a.m)","% no preço de venda",null,"Situação","1º Quartil","Médio","3º Quartil"]
["1) COFINS",1,0.03,{"$f":"C21","v":0.03},null,{"$f":"IF(OR(C21<G21,C21>I21),\"FORA DO INTERVALO\",\"OK\")","v":"OK"},0.03,0.03,0.03]
["2) PIS",1,6.4999999999999997E-3,{"$f":"C22","v":6.4999999999999997E-3},null,{"$f":"IF(OR(C22<G22,C22>I22),\"FORA DO INTERVALO\",\"OK\")","v":"OK"},6.4999999999999997E-3,6.4999999999999997E-3,6.4999999999999997E-3]
["3) ISSQN",1,0.03,{"$f":"C23*B23","v":0.03},null,"OK",0.02,3.5000000000000003E-2,0.05]
["4) CPRB",1,0,{"$f":"C24","v":0},null,"FORA DO INTERVALO",4.4999999999999998E-2,4.4999999999999998E-2,4.4999999999999998E-2]
["5) Administração Central",1,3.1199999999999999E-2,3.1199999999999999E-2,null,"OK",0.03,0.04,5.5E-2]
["6) Despesas Financeiras",1,5.5999999999999999E-3,5.5999999999999999E-3,null,"FORA DO INTERVALO",5.8999999999999999E-3,1.23E-2,1.3899999999999999E-2]
["7) Seguros + Garantias",1,1.1999999999999999E-3,1.1999999999999999E-3,null,"FORA DO INTERVALO",8.0000000000000002E-3,8.0000000000000002E-3,0.01]
["8) Risco",1,9.7000000000000003E-3,9.7000000000000003E-3,null,"OK",9.7000000000000003E-3,1.2699999999999999E-2,1.2699999999999999E-2]
["9) Lucro",1,7.1999999999999995E-2,7.1999999999999995E-2,null,"OK",6.1600000000000002E-2,7.3999999999999996E-2,8.9599999999999999E-2]
["BDI - FINAL",null,null,{"$f":"(((1+D25+D27+D28)*(1+D26)*(1+D29))/(1-(D21+D22+D23+D24))-1)","v":0.20341417752544211},null,{"$f":"IF(OR(D30<G30,D30>I30),\"FORA DO INTERVALO\",\"OK\")","v":"OK"},0.2034,0.22120000000000001,0.25]
[]
["Notas:"]
["(1) e (2) Alíquota definida por lei."]
["(3) Alíquota e base de cálculo definidas pela legislação municipal."]
["(4) Alíquota definida pelas leis 12.546/11, 12844/13 e 13.161/15 (CPRB – contribuição previdenciária sobre a receita bruta)."]
["(5) Valores definidos a partir dos limites no Acórdão nº 2.622/2013 - TCU – Plenário. Valores entre o 1º e 3º quartis."]
["(6) Valor calculado pela expressão matemática do acórdão 2.369/2011 – TCU – Plenário e disponibilizado pela AGETOP em dezembro de 2018. (Foi utilizado para o cálculo a média da Taxa SELIC no período de 11/2017 a 10/2018)"]
[]
["(7) Valores definidos pela AGETOP a partir dos limites no Acórdão nº 2.622/2013 - TCU – Plenário. Valores médios. \n\nObservação da AGETOP: (Seguros contra erros de execução, incêndio e explosão, danos da natureza (vendaval, destelhamento, alagamento, inundação, desmoronamento, geadas etc.), emprego de material defeituoso ou inadequado, roubo e/ou furto qualificado, quebra de equipamentos, desmoronamento de estrutura, nas modalidades de Obras Civis em Construção (OCC); Instalação e Montagem (IM); e Obras Civis em Construção e Instalação e Montagem (OCC/IM). Bem como coberturas adicionais para ampliação dessas coberturas básicas, como: cobertura de responsabilidade civil geral, cobertura de responsabilidade civil cruzada, cobertura de despesas extraordinárias, cobertura de tumultos, cobertura de desentulho do local, cobertura de riscos do fabricante, dentre outras, incluindo o seguro de vida em grupo regido pela convenção coletiva dos trabalhadores na indústria da construção civil). A partir de 24/02/2015 por intermédio da Portaria 449/2015 a Presidência da AGETOP, na pessoa do Senhor Jayme Eduardo Rincon, determinou a exclusão dos valores referentes aos Seguros de Risco de Engenharia e Responsabilidade Civil do Profissional na composição do cálculo do B.D.I.."]
["(8) Valores definidos a partir dos limites no Acórdão nº 2.622/2013 - TCU – Plenário. Valores entre 1º e 3° quartis."]
["(9) Valores definidos a partir dos limites definidos no Acórdão nº 2.622/2013 - TCU – Plenário. Valores adotados e praticados no mercado ( “ ex ante ” ) ou aqueles entre os 1º e 3º quartis."]
[]
["(*) A fórmula para estipulação da taxa de BDI estimado adotado é a mesma que foi aplicada para a obtenção das tabelas contidas no Acórdão n. 2.622/2013 – TCUPlenário"]
[]
["Obs.: Para obras com valores superiores a R$ 20.000.000,00 sugere-se recalcular o BDI, dimensionando as taxas de administração central e lucro para patamares inferiores ao estipulado acima."]

{"sheet":"Relatório CENTRAL","index":5,"n_rows":40,"n_cols":5,"rows_kept":40,"cut":false,"hidden":false,"merged":[[7,1,7,4],[8,1,8,2],[8,3,8,4],[9,1,9,2],[10,1,10,4],[11,1,11,4],[39,1,39,2],[9,0,11,0],[0,1,0,4],[6,3,6,4],[9,3,9,4],[1,1,1,4],[2,1,2,2],[2,3,2,4],[3,1,3,2],[3,3,3,4],[4,1,4,4],[5,1,5,2],[5,3,5,4],[6,1,6,2]]}
[]
[]
[null,"UNIDADE ESCOLAR",null,"CIDADE"]
[null,{"$f":"Orçamento!$O$4","v":"ACERVO DAS ESCOLAS EXTINTAS DE GOIÂNIA"},null,{"$f":"Orçamento!$V$7","v":"GOIÂNIA"}]
[]
[null,"OBRA",null,"CRE"]
[null,{"$f":"Orçamento!$O$7","v":"AMPLIAÇÃO E REFORMA"},null,{"$f":"Orçamento!$O$10","v":"GOIÂNIA"}]
[]
[null,"ENDEREÇO",null,"DATA"]
["FILTRO",{"$f":"Orçamento!$R$10","v":"AV. HUGO DE CARVALHO RAMOS, VILA IRANY"},null,{"$f":"Orçamento!$S$7","v":"2020-09-02"}]
[]
[null,"RELATÓRIO CENTRAL"]
["↓","CÓDIGO","ETAPA","PREÇO  (R$) C/ BDI","PARTIC  ( % )"]
[{"$f":"IF(D14>0,\"F\",\"\")","v":""},{"$f":"Orçamento!O349","v":"a."},{"$f":"Orçamento!P349","v":"SERVIÇOS PRELIMINARES"},{"$f":"Orçamento!V349","v":0},{"$f":"Orçamento!X349","v":0}]
[{"$f":"IF(D15>0,\"F\",\"\")","v":""},{"$f":"Orçamento!O350","v":"b."},{"$f":"Orçamento!P350","v":"TRANSPORTES"},{"$f":"Orçamento!V350","v":0},{"$f":"Orçamento!X350","v":0}]
["",{"$f":"Orçamento!O351","v":"c."},{"$f":"Orçamento!P351","v":"SERVIÇO EM TERRA"},{"$f":"Orçamento!V351","v":0},{"$f":"Orçamento!X351","v":0}]
["",{"$f":"Orçamento!O352","v":"d."},{"$f":"Orçamento!P352","v":"FUNDAÇÕES E SONDAGENS"},{"$f":"Orçamento!V352","v":0},{"$f":"Orçamento!X352","v":0}]
["",{"$f":"Orçamento!O353","v":"e."},{"$f":"Orçamento!P353","v":"ESTRUTURA"},{"$f":"Orçamento!V353","v":0},{"$f":"Orçamento!X353","v":0}]
["",{"$f":"Orçamento!O354","v":"f."},{"$f":"Orçamento!P354","v":"INSTALAÇÕES ELÉTRICAS"},{"$f":"Orçamento!V354","v":0},{"$f":"Orçamento!X354","v":0}]
["",{"$f":"Orçamento!O355","v":"g."},{"$f":"Orçamento!P355","v":"INSTALAÇÕES HIDROSSANITÁRIAS"},{"$f":"Orçamento!V355","v":0},{"$f":"Orçamento!X355","v":0}]
["",{"$f":"Orçamento!O356","v":"h"},{"$f":"Orçamento!P356","v":"INSTALAÇÕES ESPECIAIS"},{"$f":"Orçamento!V356","v":0},{"$f":"Orçamento!X356","v":0}]
["",{"$f":"Orçamento!O357","v":"i."},{"$f":"Orçamento!P357","v":"ALVENARIAS E DIVISÓRIAS"},{"$f":"Orçamento!V357","v":0},{"$f":"Orçamento!X357","v":0}]
["",{"$f":"Orçamento!O358","v":"j."},{"$f":"Orçamento!P358","v":"ALVENARIA AUTO-PORTANTE"},{"$f":"Orçamento!V358","v":0},{"$f":"Orçamento!X358","v":0}]
["",{"$f":"Orçamento!O359","v":"k."},{"$f":"Orçamento!P359","v":"IMPERMEABILIZAÇÃO"},{"$f":"Orçamento!V359","v":0},{"$f":"Orçamento!X359","v":0}]
["",{"$f":"Orçamento!O360","v":"l."},{"$f":"Orçamento!P360","v":"ISOLAMENTO TÉRMICO E ACÚSTICO"},{"$f":"Orçamento!V360","v":0},{"$f":"Orçamento!X360","v":0}]
["",{"$f":"Orçamento!O361","v":"m."},{"$f":"Orçamento!P361","v":"ESTRUTURA DE MADEIRA"},{"$f":"Orçamento!V361","v":0},{"$f":"Orçamento!X361","v":0}]
["",{"$f":"Orçamento!O362","v":"n."},{"$f":"Orçamento!P362","v":"ESTRUTURAS METÁLICAS"},{"$f":"Orçamento!V362","v":0},{"$f":"Orçamento!X362","v":0}]
["",{"$f":"Orçamento!O363","v":"o."},{"$f":"Orçamento!P363","v":"COBERTURAS"},{"$f":"Orçamento!V363","v":0},{"$f":"Orçamento!X363","v":0}]
["",{"$f":"Orçamento!O364","v":"p."},{"$f":"Orçamento!P364","v":"ESQUADRIAS DE MADEIRA"},{"$f":"Orçamento!V364","v":0},{"$f":"Orçamento!X364","v":0}]
["",{"$f":"Orçamento!O365","v":"q."},{"$f":"Orçamento!P365","v":"ESQUADRIAS METÁLICAS"},{"$f":"Orçamento!V365","v":0},{"$f":"Orçamento!X365","v":0}]
["",{"$f":"Orçamento!O366","v":"r."},{"$f":"Orçamento!P366","v":"VIDROS"},{"$f":"Orçamento!V366","v":0},{"$f":"Orçamento!X366","v":0}]
["",{"$f":"Orçamento!O367","v":"s."},{"$f":"Orçamento!P367","v":"REVESTIMENTO DE PAREDE"},{"$f":"Orçamento!V367","v":0},{"$f":"Orçamento!X367","v":0}]
["",{"$f":"Orçamento!O368","v":"t."},{"$f":"Orçamento!P368","v":"FORROS"},{"$f":"Orçamento!V368","v":0},{"$f":"Orçamento!X368","v":0}]
["",{"$f":"Orçamento!O369","v":"u."},{"$f":"Orçamento!P369","v":"REVESTIMENTO DE PISO"},{"$f":"Orçamento!V369","v":0},{"$f":"Orçamento!X369","v":0}]
["",{"$f":"Orçamento!O370","v":"v."},{"$f":"Orçamento!P370","v":"FERRAGENS"},{"$f":"Orçamento!V370","v":0},{"$f":"Orçamento!X370","v":0}]
["",{"$f":"Orçamento!O371","v":"w."},{"$f":"Orçamento!P371","v":"MARCENARIA"},{"$f":"Orçamento!V371","v":0},{"$f":"Orçamento!X371","v":0}]
["",{"$f":"Orçamento!O372","v":"x."},{"$f":"Orçamento!P372","v":"ADMINISTRAÇÃO"},{"$f":"Orçamento!V372","v":0},{"$f":"Orçamento!X372","v":0}]
["",{"$f":"Orçamento!O373","v":"y."},{"$f":"Orçamento!P373","v":"PINTURA"},{"$f":"Orçamento!V373","v":0},{"$f":"Orçamento!X373","v":0}]
["",{"$f":"Orçamento!O374","v":"z."},{"$f":"Orçamento!P374","v":"DIVERSOS"},{"$f":"Orçamento!V374","v":0},{"$f":"Orçamento!X374","v":0}]
["F","TOTAL GERAL DO ORÇAMENTO (R$) C/BDI",null,{"$f":"SUM(D14:D39)","v":0},{"$f":"SUM(E14:E39)","v":0}]

{"sheet":"Parc Maior Relev","index":6,"n_rows":32,"n_cols":7,"rows_kept":32,"cut":false,"hidden":false,"merged":[[10,0,12,0],[8,1,8,3],[8,4,8,6],[32,3,32,7],[30,1,30,6],[0,1,0,6],[11,1,11,6],[1,1,1,6],[2,1,2,3],[2,4,2,6],[3,1,3,3],[3,4,3,6],[4,1,4,6],[5,1,5,3],[5,4,5,6],[9,1,9,3],[9,4,9,6],[10,1,10,6],[6,1,6,3],[6,4,6,6],[7,1,7,6]]}
[]
[]
[null,"UNIDADE ESCOLAR",null,null,"CÓDIGO INEP"]
[null,{"$f":"Orçamento!$O$4","v":"ACERVO DAS ESCOLAS EXTINTAS DE GOIÂNIA"},null,null,{"$f":"Orçamento!$V$4","v":0}]
[]
[null,"OBRA",null,null,"CIDADE"]
[null,{"$f":"Orçamento!$O$7","v":"AMPLIAÇÃO E REFORMA"},null,null,{"$f":"Orçamento!$V$7","v":"GOIÂNIA"}]
[]
[null,"CRE",null,null,"ÁREA TOTAL CONSTRUÍDA (M²)"]
[null,{"$f":"Orçamento!$O$10","v":"GOIÂNIA"},null,null,{"$f":"Orçamento!$V$13","v":2413.75}]
["FILTRO"]
[null,"PARCELA DE MAIOR RELEVÂNCIA"]
[null,"CÓDIGO","SERVIÇO","DESCRIÇÃO","UNID","QUANT","PARC. MAIOR RELEV (100%)"]
[null,70000,"INSTALAÇÕES ELÉTRICAS","SUBESTAÇÃO","KVA",{"$f":"SUMIF(Orçamento!$R$20:$R$330,'Parc Maior Relev'!D14,Orçamento!$T$20:$T$330)","v":0},{"$f":"F14","v":0}]
[null,"CÓDIGO","SERVIÇO","DESCRIÇÃO","UNID","QUANT","PARC. MAIOR RELEV (50%)"]
[null,70000,"INSTALAÇÕES ELÉTRICAS","INSTALAÇÕES ELÉTRICAS","KVA",47.96,{"$f":"F16*0.5","v":23.98}]
[null,160000,"COBERTURAS","TELHA AMERICANA","M2",{"$f":"Orçamento!T203+Orçamento!T207+Orçamento!T211+Orçamento!T215+Orçamento!T219","v":985.82999999999993},{"$f":"F17*0.5","v":492.91499999999996}]
[null,160000,"COBERTURAS","TELHA FIBROCIMENTO","M2",{"$f":"SUMIF(Orçamento!$R$20:$R$330,'Parc Maior Relev'!D18,Orçamento!$T$20:$T$330)","v":0},0]
[null,160000,"COBERTURAS","TELHA METÁLICA","M2",{"$f":"SUMIF(Orçamento!$R$20:$R$330,'Parc Maior Relev'!D19,Orçamento!$T$20:$T$330)","v":0},0]
[null,200000,"REVESTIMENTO DE PAREDE","REBOCO","M2",{"$f":"SUMIF(Orçamento!$R$20:$R$330,'Parc Maior Relev'!D20,Orçamento!$T$20:$T$330)","v":0},{"$f":"F20*0.5","v":0}]
[null,200000,"REVESTIMENTO DE PAREDE","REVESTIMENTO CERÂMICO","M2",{"$f":"SUMIF(Orçamento!$R$20:$R$330,'Parc Maior Relev'!D21,Orçamento!$T$20:$T$330)","v":0},0]
[null,210000,"FORROS","FORRO DE GESSO","M2",{"$f":"SUMIF(Orçamento!$R$20:$R$330,'Parc Maior Relev'!D22,Orçamento!$T$20:$T$330)","v":0},{"$f":"F22*0.5","v":0}]
[null,210000,"FORROS","FORRO PVC","M2",{"$f":"SUMIF(Orçamento!$R$20:$R$330,'Parc Maior Relev'!D23,Orçamento!$T$20:$T$330)","v":0},0]
[null,210000,"FORROS","FORRO ACARTONADO","M2",{"$f":"SUMIF(Orçamento!$R$20:$R$330,'Parc Maior Relev'!D24,Orçamento!$T$20:$T$330)","v":0},0]
[null,220000,"REVESTIMENTO DE PISO","PISO GRANITINA","M2",{"$f":"SUMIF(Orçamento!$R$20:$R$330,'Parc Maior Relev'!D25,Orçamento!$T$20:$T$330)","v":0},0]
[null,220000,"REVESTIMENTO DE PISO","PISO LAMINADO","M2",{"$f":"SUMIF(Orçamento!$R$20:$R$330,'Parc Maior Relev'!D26,Orçamento!$T$20:$T$330)","v":0},0]
[null,220000,"REVESTIMENTO DE PISO","PISO CONCRETO DESEMPENADO","M2",{"$f":"SUMIF(Orçamento!$R$20:$R$330,'Parc Maior Relev'!D27,Orçamento!$T$20:$T$330)","v":0},0]
[null,220000,"REVESTIMENTO DE PISO","PISO CERÂMICO","M2",{"$f":"SUMIF(Orçamento!$R$20:$R$330,'Parc Maior Relev'!D28,Orçamento!$T$20:$T$330)","v":0},{"$f":"F28*0.5","v":0}]
[null,260000,"PINTURA","PINTURA","M2",{"$f":"SUMIF(Orçamento!$R$20:$R$330,'Parc Maior Relev'!D29,Orçamento!$T$20:$T$330)","v":0},0]
["F"]
["F","(*) Para os fins do inciso I dp § 1º do Art. 30 da Lei Federal 8.666/93, são consideradas parcelas de maior relevância técnica as execuções apresentadas"]
["F"]

{"sheet":"Composições","index":7,"n_rows":343,"n_cols":10,"rows_kept":343,"cut":false,"hidden":false,"merged":[[322,5,323,5],[322,6,322,7],[322,8,322,9],[327,1,327,7],[342,1,342,7],[322,0,323,0],[322,1,323,1],[322,2,323,2],[322,3,323,3],[322,4,323,4],[302,5,303,5],[302,6,302,7],[302,8,302,9],[307,1,307,7],[320,1,320,7],[302,0,303,0],[302,1,303,1],[302,2,303,2],[302,3,303,3],[302,4,303,4],[295,5,296,5],[295,6,295,7],[295,8,295,9],[299,1,299,7],[300,1,300,7],[295,0,296,0],[295,1,296,1],[295,2,296,2],[295,3,296,3],[295,4,296,4],[285,5,286,5],[285,6,285,7],[285,8,285,9],[289,1,289,7],[293,1,293,7],[285,0,286,0],[285,1,286,1],[285,2,286,2],[285,3,286,3],[285,4,286,4],[275,5,276,5],[275,6,275,7],[275,8,275,9],[279,1,279,7],[283,1,283,7],[275,0,276,0],[275,1,276,1],[275,2,276,2],[275,3,276,3],[275,4,276,4],[265,5,266,5],[265,6,265,7],[265,8,265,9],[270,1,270,7],[273,1,273,7],[265,0,266,0],[265,1,266,1],[265,2,266,2],[265,3,266,3],[265,4,266,4],[255,5,256,5],[255,6,255,7],[255,8,255,9],[260,1,260,7],[263,1,263,7],[255,0,256,0],[255,1,256,1],[255,2,256,2],[255,3,256,3],[255,4,256,4],[246,5,247,5],[246,6,246,7],[246,8,246,9],[251,1,251,7],[253,1,253,7],[246,0,247,0],[246,1,247,1],[246,2,247,2],[246,3,247,3],[246,4,247,4],[237,5,238,5],[237,6,237,7],[237,8,237,9],[242,1,242,7],[244,1,244,7],[237,0,238,0],[237,1,238,1],[237,2,238,2],[237,3,238,3],[237,4,238,4],[228,5,229,5],[228,6,228,7],[228,8,228,9],[233,1,233,7],[235,1,235,7],[228,0,229,0],[228,1,229,1],[228,2,229,2],[228,3,229,3],[228,4,229,4],[219,5,220,5],[219,6,219,7],[219,8,219,9],[224,1,224,7],[226,1,226,7],[219,0,220,0],[219,1,220,1],[219,2,220,2],[219,3,220,3],[219,4,220,4],[210,5,211,5],[210,6,210,7],[210,8,210,9],[215,1,215,7],[217,1,217,7],[210,0,211,0],[210,1,211,1],[210,2,211,2],[210,3,211,3],[210,4,211,4],[200,5,201,5],[200,6,200,7],[200,8,200,9],[205,1,205,7],[208,1,208,7],[200,0,201,0],[200,1,201,1],[200,2,201,2],[200,3,201,3],[200,4,201,4],[190,5,191,5],[190,6,190,7],[190,8,190,9],[195,1,195,7],[198,1,198,7],[190,0,191,0],[190,1,191,1],[190,2,191,2],[190,3,191,3],[190,4,191,4],[180,5,181,5],[180,6,180,7],[180,8,180,9],[185,1,185,7],[188,1,188,7],[180,0,181,0],[180,1,181,1],[180,2,181,2],[180,3,181,3],[180,4,181,4],[167,5,168,5],[167,6,167,7],[167,8,167,9],[171,1,171,7],[178,1,178,7],[167,0,168,0],[167,1,168,1],[167,2,168,2],[167,3,168,3],[167,4,168,4],[157,5,158,5],[157,6,157,7],[157,8,157,9],[161,1,161,7],[165,1,165,7],[157,0,158,0],[157,1,158,1],[157,2,158,2],[157,3,158,3],[157,4,158,4],[148,5,149,5],[148,6,148,7],[148,8,148,9],[153,1,153,7],[155,1,155,7],[148,0,149,0],[148,1,149,1],[148,2,149,2],[148,3,149,3],[148,4,149,4],[139,5,140,5],[139,6,139,7],[139,8,139,9],[144,1,144,7],[146,1,146,7],[139,0,140,0],[139,1,140,1],[139,2,140,2],[139,3,140,3],[139,4,140,4],[130,5,131,5],[130,6,130,7],[130,8,130,9],[135,1,135,7],[137,1,137,7],[130,0,131,0],[130,1,131,1],[130,2,131,2],[130,3,131,3],[130,4,131,4],[120,5,121,5],[120,6,120,7],[120,8,120,9],[124,1,124,7],[128,1,128,7],[120,0,121,0],[120,1,121,1],[120,2,121,2],[120,3,121,3],[120,4,121,4],[112,5,113,5],[112,6,112,7],[112,8,112,9],[116,1,116,7],[118,1,118,7],[112,0,113,0],[112,1,113,1],[112,2,113,2],[112,3,113,3],[112,4,113,4],[102,5,103,5],[102,6,102,7],[102,8,102,9],[107,1,107,7],[110,1,110,7],[102,0,103,0],[102,1,103,1],[102,2,103,2],[102,3,103,3],[102,4,103,4],[92,5,93,5],[92,6,92,7],[92,8,92,9],[97,1,97,7],[100,1,100,7],[92,0,93,0],[92,1,93,1],[92,2,93,2],[92,3,93,3],[92,4,93,4],[82,5,83,5],[82,6,82,7],[82,8,82,9],[87,1,87,7],[90,1,90,7],[82,0,83,0],[82,1,83,1],[82,2,83,2],[82,3,83,3],[82,4,83,4],[73,5,74,5],[73,6,73,7],[73,8,73,9],[78,1,78,7],[80,1,80,7],[73,0,74,0],[73,1,74,1],[73,2,74,2],[73,3,74,3],[73,4,74,4],[63,5,64,5],[63,6,63,7],[63,8,63,9],[68,1,68,7],[71,1,71,7],[63,0,64,0],[63,1,64,1],[63,2,64,2],[63,3,64,3],[63,4,64,4],[55,5,56,5],[55,6,55,7],[55,8,55,9],[59,1,59,7],[61,1,61,7],[55,0,56,0],[55,1,56,1],[55,2,56,2],[55,3,56,3],[55,4,56,4],[46,5,47,5],[46,6,46,7],[46,8,46,9],[51,1,51,7],[53,1,53,7],[46,0,47,0],[46,1,47,1],[46,2,47,2],[46,3,47,3],[46,4,47,4],[37,5,38,5],[37,6,37,7],[37,8,37,9],[42,1,42,7],[44,1,44,7],[37,0,38,0],[37,1,38,1],[37,2,38,2],[37,3,38,3],[37,4,38,4],[28,5,29,5],[28,6,28,7],[28,8,28,9],[33,1,33,7],[35,1,35,7],[28,0,29,0],[28,1,29,1],[28,2,29,2],[28,3,29,3],[28,4,29,4],[16,5,17,5],[16,6,16,7],[16,8,16,9],[22,1,22,7],[26,1,26,7],[16,0,17,0],[16,1,17,1],[16,2,17,2],[16,3,17,3],[16,4,17,4],[0,0,0,8],[10,0,10,2],[10,3,10,6],[11,0,11,9],[12,0,12,2],[12,3,12,6],[12,7,12,8],[7,0,7,6],[9,0,9,2],[9,3,9,6],[9,7,9,8],[3,0,3,6],[4,0,4,6],[15,0,15,9],[13,0,13,2],[13,3,13,6],[1,0,1,9],[3,7,3,9],[4,7,4,9],[6,7,6,9],[7,7,7,9],[6,0,6,6],[10,8,10,9],[13,8,13,9],[14,0,14,9],[8,0,8,9],[5,0,5,9],[2,0,2,9]]}
[]
[]
[]
["UNIDADE ESCOLAR",null,null,null,null,null,null,"CÓDIGO INEP"]
[{"$f":"Orçamento!$O$4","v":"ACERVO DAS ESCOLAS EXTINTAS DE GOIÂNIA"},null,null,null,null,null,null,{"$f":"Orçamento!$V$4","v":0}]
[]
["OBRA",null,null,null,null,null,null,"CIDADE"]
[{"$f":"Orçamento!$O$7","v":"AMPLIAÇÃO E REFORMA"},null,null,null,null,null,null,{"$f":"Orçamento!$V$7","v":"GOIÂNIA"}]
[]
["CRE",null,null,"ENDEREÇO",null,null,null,"REFERÊNCIA AGETOP"]
[{"$f":"Orçamento!$O$10","v":"GOIÂNIA"},null,null,{"$f":"Orçamento!$R$10","v":"AV. HUGO DE CARVALHO RAMOS, VILA IRANY"},null,null,null,{"$f":"Orçamento!$S$10","v":"ABR/19"},{"$f":"Orçamento!$T$10","v":"ONERADA"}]
[]
["DATA",null,null,"ÁREA TOTAL CONSTRUÍDA (M²)",null,null,null,"REFERÊNCIA SINAPI"]
[{"$f":"Orçamento!$S$7","v":"2020-09-02"},null,null,{"$f":"Orçamento!$V$13","v":2413.75},null,null,null,{"$f":"Orçamento!$V$10","v":"OUT/19"},{"$f":"Orçamento!$W$10","v":"ONERADA"}]
[]
["COMPOSIÇÕES DE CUSTOS UNITÁRIOS - SEE-GO"]
[10,"FONTE","CÓDIGO","DESCRIÇÃO","UNIDADE","COEFIC.","CUSTO UNITÁRIO",null,"CUSTO  TOTAL (A) + (B) + (C) + (D) + (E)"]
[null,null,null,null,null,null,"DESONERADO","NÃO DESONER.","DESONERADO","NÃO DESONER."]
[null,"COMPOSIÇÃO","COMP 010_SEE","DEMOLIÇÃO DE GRADE/GRELHA/CORRIMÃO/GUARDA CORPO - METÁLICO","M2",null,"-","-",4.0599999999999996,4.71]
[null,null,null,"","",null,0,0,0,0]
[null,null,null,"","",null,0,0,0,0]
[null,null,null,"","",null,0,0,0,0]
[null,"MÃO DE OBRA (B) - TOTAL",null,null,null,null,null,null,0,0]
[null,"AGETOP",20106,"RETIRADA DE JANELAS OU PORTAIS C/ TRANSP. ATÉ CB. E CARGA","m2    ",1,4.0599999999999996,4.71,4.0599999999999996,4.71]
[null,null,null,"","",null,0,0,0,0]
[null,null,null,"","",null,0,0,0,0]
[null,"MATERIAL (C) - TOTAL",null,null,null,null,null,null,4.0599999999999996,4.71]
[]
[387,"FONTE","CÓDIGO","DESCRIÇÃO","UNIDADE","COEFIC.","CUSTO UNITÁRIO",null,"CUSTO  TOTAL (A) + (B) + (C) + (D) + (E)"]
[null,null,null,null,null,null,"DESONERADO","NÃO DESONER.","DESONERADO","NÃO DESONER."]
[null,"COMPOSIÇÃO","COMP 387_SEE","LÂMPADA LED TUBULAR 18W ","UN ",null,null,null,22.09,22.11]
[null,"AGETOP_I",8,"AJUDANTE","h     ",1.4999999999999999E-2,8.75,10.14,0.13,0.15]
[null,"AGETOP_I",12,"MATERIAL HIDRO-SANITÁRIO",0,1.4999999999999999E-2,0,0,0,0]
[null,"MÃO DE OBRA (B) - TOTAL",null,null,null,null,null,null,0.13,0.15]
[null,"COTAÇÃO","COT 195_SEE","LÂMPADA LED TUBULAR 18W ","UN",1,21.959999999999997,21.959999999999997,21.96,21.96]
[null,"MATERIAL (C) - TOTAL",null,null,null,null,null,null,21.96,21.96]
[]
[40,"FONTE","CÓDIGO","DESCRIÇÃO","UNIDADE","COEFIC.","CUSTO UNITÁRIO",null,"CUSTO  TOTAL (A) + (B) + (C) + (D) + (E)"]
[null,null,null,null,null,null,"DESONERADO","NÃO DESONER.","DESONERADO","NÃO DESONER."]
[null,"COMPOSIÇÃO","COMP 040_SEE","CONJUNTO MOTOR-BOMBA ELÉTRICA TRIFÁSICO 380/220 V PARA VZ= 24,33 M³/H, HM= 46,24 M POTÊNCIA= 7,5 CV","UN ",null,null,null,3862.67,3873.79]
[null,"AGETOP_I",8,"AJUDANTE","h     ",8,8.75,10.14,70,81.12]
[null,"AGETOP_I",11,"MATERIAL ELÉTRICO",0,8,0,0,0,0]
[null,"MÃO DE OBRA (B) - TOTAL",null,null,null,null,null,null,70,81.12]
[null,"COTAÇÃO","COT 008_SEE","CONJUNTO MOTOR-BOMBA ELÉTRICA TRIFÁSICO 380/220 V PARA VZ= 24,33 M³/H, HM= 46,24 M POTÊNCIA= 7,5 CV","UN ",1,3792.6666666666665,3792.6666666666665,3792.67,3792.67]
[null,"MATERIAL (C) - TOTAL",null,null,null,null,null,null,3792.67,3792.67]
[]
[17,"FONTE","CÓDIGO","DESCRIÇÃO","UNIDADE","COEFIC.","CUSTO UNITÁRIO",null,"CUSTO  TOTAL (A) + (B) + (C) + (D) + (E)"]
[null,null,null,null,null,null,"DESONERADO","NÃO DESONER.","DESONERADO","NÃO DESONER."]
[null,"COMPOSIÇÃO","COMP 017_SEE","REDUCAO GIRATÓRIA TIPO STORZ LATAO P/ INST. PREDIAL COMBATE A INCENDIO ENGATE RAPIDO 2.1/2\" X 1.1/2\"","UN ",null,"-","-",97.09,97.31]
[null,"AGETOP_I",8,"AJUDANTE","h     ",0.16,8.75,10.14,1.4,1.62]
[null,"AGETOP_I",11,"MATERIAL ELÉTRICO",0,0.16,0,0,0,0]
[null,"MÃO DE OBRA (B) - TOTAL",null,null,null,null,null,null,1.4,1.62]
[null,"SINAPI_I",20972,"REDUCAO FIXA TIPO STORZ, ENGATE RAPIDO 2.1/2\" X 1.1/2\", EM LATAO, PARA INSTALACAO PREDIAL COMBATE A INCENDIO PREDIAL","UN    ",1,95.69,95.69,95.69,95.69]
[null,"MATERIAL (C) - TOTAL",null,null,null,null,null,null,95.69,95.69]
[]
[18,"FONTE","CÓDIGO","DESCRIÇÃO","UNIDADE","COEFIC.","CUSTO UNITÁRIO",null,"CUSTO  TOTAL (A) + (B) + (C) + (D) + (E)"]
[null,null,null,null,null,null,"DESONERADO","NÃO DESONER.","DESONERADO","NÃO DESONER."]
[null,"COMPOSIÇÃO","COMP 018_SEE","CHAVE DUPLA P/ CONEXÕES TIPO STORZ EM LATÃO ENGATE RÁPIDO 1 1/2\" X 2 1/2\"","UN ",null,"-","-",12.75,12.75]
[null,"AGETOP_I",11,"MATERIAL ELÉTRICO",0,0.15,0,0,0,0]
[null,"MÃO DE OBRA (B) - TOTAL",null,null,null,null,null,null,0,0]
[null,"SINAPI_I",20971,"CHAVE DUPLA PARA CONEXOES TIPO STORZ, ENGATE RAPIDO 1 1/2\" X 2 1/2\", EM LATAO, PARA INSTALACAO PREDIAL COMBATE A INCENDIO","UN    ",1,12.75,12.75,12.75,12.75]
[null,"MATERIAL (C) - TOTAL",null,null,null,null,null,null,12.75,12.75]
[]
[87,"FONTE","CÓDIGO","DESCRIÇÃO","UNIDADE","COEFIC.","CUSTO UNITÁRIO",null,"CUSTO  TOTAL (A) + (B) + (C) + (D) + (E)"]
[null,null,null,null,null,null,"DESONERADO","NÃO DESONER.","DESONERADO","NÃO DESONER."]
[null,"COMPOSIÇÃO","COMP 087_SEE","REGISTRO DE GAVETA COM HASTE ASCENDENTE DE BRONZE 2 1/2\"","UN ",null,null,null,241.73,243.32999999999998]
[null,"AGETOP_I",8,"AJUDANTE","h     ",1.1499999999999999,8.75,10.14,10.06,11.66]
[null,"AGETOP_I",11,"MATERIAL ELÉTRICO",0,1.1499999999999999,0,0,0,0]
[null,"MÃO DE OBRA (B) - TOTAL",null,null,null,null,null,null,10.06,11.66]
[null,"AGETOP_I","H689","","",2.82,0,0,0,0]
[null,"COTAÇÃO","COT 017_SEE","REGISTRO DE GAVETA COM HASTE ASCENDENTE DE BRONZE 2 1/2\"","UN ",1,231.66666666666666,231.66666666666666,231.67,231.67]
[null,"MATERIAL (C) - TOTAL",null,null,null,null,null,null,231.67,231.67]
[]
[19,"FONTE","CÓDIGO","DESCRIÇÃO","UNIDADE","COEFIC.","CUSTO UNITÁRIO",null,"CUSTO  TOTAL (A) + (B) + (C) + (D) + (E)"]
[null,null,null,null,null,null,"DESONERADO","NÃO DESONER.","DESONERADO","NÃO DESONER."]
[null,"COMPOSIÇÃO","COMP 019_SEE","TAMPÃO LATAO C/ CORRENTE P/ INSTALAÇÃO PREDIAL COMBATE A INCÊNDIO ENGATE RÁPIDO 1 1/2\"","UN ",null,"-","-",53.620000000000005,53.830000000000005]
[null,"AGETOP_I",11,"MATERIAL ELÉTRICO",0,0.15,0,0,0,0]
[null,"AGETOP_I",8,"AJUDANTE","h     ",0.15,8.75,10.14,1.31,1.52]
[null,"MÃO DE OBRA (B) - TOTAL",null,null,null,null,null,null,1.31,1.52]
[null,"SINAPI_I",20964,"TAMPAO COM CORRENTE, EM LATAO, ENGATE RAPIDO 1 1/2\", PARA INSTALACAO PREDIAL DE COMBATE A INCENDIO","UN    ",1,52.31,52.31,52.31,52.31]
[null,"MATERIAL (C) - TOTAL",null,null,null,null,null,null,52.31,52.31]
[]
[88,"FONTE","CÓDIGO","DESCRIÇÃO","UNIDADE","COEFIC.","CUSTO UNITÁRIO",null,"CUSTO  TOTAL (A) + (B) + (C) + (D) + (E)"]
[null,null,null,null,null,null,"DESONERADO","NÃO DESONER.","DESONERADO","NÃO DESONER."]
[null,"COMPOSIÇÃO","COMP 088_SEE","TE DE FERRO GALVANIZADO 90º X 2.1/2\" X 1\"","UN ",null,null,null,78.529999999999987,79.399999999999991]
[null,"AGETOP_I",8,"AJUDANTE","h     ",0.624,8.75,10.14,5.46,6.33]
[null,"AGETOP_I",11,"MATERIAL ELÉTRICO",0,0.624,0,0,0,0]
[null,"MÃO DE OBRA (B) - TOTAL",null,null,null,null,null,null,5.46,6.33]
[null,"AGETOP_I","H689","","",1.2,0,0,0,0]
[null,"SINAPI_I",6307,"TE DE REDUCAO DE FERRO GALVANIZADO, COM ROSCA BSP, DE 2 1/2\" X 1\"","UN    ",1,73.069999999999993,73.069999999999993,73.069999999999993,73.069999999999993]
[null,"MATERIAL (C) - TOTAL",null,null,null,null,null,null,73.069999999999993,73.069999999999993]
[]
[30,"FONTE","CÓDIGO","DESCRIÇÃO","UNIDADE","COEFIC.","CUSTO UNITÁRIO",null,"CUSTO  TOTAL (A) + (B) + (C) + (D) + (E)"]
[null,null,null,null,null,null,"DESONERADO","NÃO DESONER.","DESONERADO","NÃO DESONER."]
[null,"COMPOSIÇÃO","COMP 030_SEE","COTOVELO DE FERRO GALV. 90° X 2 1/2\"","UN ",null,null,null,56.78,58.059999999999995]
[null,"AGETOP_I",8,"AJUDANTE","h     ",0.92,8.75,10.14,8.0500000000000007,9.33]
[null,"AGETOP_I",11,"MATERIAL ELÉTRICO",0,0.92,0,0,0,0]
[null,"MÃO DE OBRA (B) - TOTAL",null,null,null,null,null,null,8.0500000000000007,9.33]
[null,"SINAPI_I",3470,"COTOVELO 90 GRAUS DE FERRO GALVANIZADO, COM ROSCA BSP, DE 2 1/2\"","UN    ",1,48.73,48.73,48.73,48.73]
[null,"AGETOP_I","H689","","",2,0,0,0,0]
[null,"MATERIAL (C) - TOTAL",null,null,null,null,null,null,48.73,48.73]
[]
[77,"FONTE","CÓDIGO","DESCRIÇÃO","UNIDADE","COEFIC.","CUSTO UNITÁRIO",null,"CUSTO  TOTAL (A) + (B) + (C) + (D) + (E)"]
[null,null,null,null,null,null,"DESONERADO","NÃO DESONER.","DESONERADO","NÃO DESONER."]
[null,"COMPOSIÇÃO","COMP 077_SEE","UNIAO FERRO GALV C/ASSENTO CONICO BRONZE 2 1/2\"","UN ",null,null,null,142.49,143.05000000000001]
[null,"AGETOP_I",8,"AJUDANTE","h     ",0.4,8.75,10.14,3.5,4.0599999999999996]
[null,"AGETOP_I",11,"MATERIAL ELÉTRICO",0,0.4,0,0,0,0]
[null,"MÃO DE OBRA (B) - TOTAL",null,null,null,null,null,null,3.5,4.0599999999999996]
[null,"AGETOP_I","H689","","",2.4,0,0,0,0]
[null,"SINAPI_I",12427,"UNIAO COM ASSENTO CONICO DE BRONZE, DIAMETRO 2 1/2\"","UN    ",1,138.99,138.99,138.99,138.99]
[null,"MATERIAL (C) - TOTAL",null,null,null,null,null,null,138.99,138.99]
[]
[22,"FONTE","CÓDIGO","DESCRIÇÃO","UNIDADE","COEFIC.","CUSTO UNITÁRIO",null,"CUSTO  TOTAL (A) + (B) + (C) + (D) + (E)"]
[null,null,null,null,null,null,"DESONERADO","NÃO DESONER.","DESONERADO","NÃO DESONER."]
[null,"COMPOSIÇÃO","COMP 022_SEE","TAMPÃO FOFO 40X50CM C/INSCRIÇÃO ","UN ",null,"-","-",195.55,195.55]
[null,"AGETOP_I",11,"MATERIAL ELÉTRICO",0,0.15,0,0,0,0]
[null,"MÃO DE OBRA (B) - TOTAL",null,null,null,null,null,null,0,0]
[null,"SINAPI_I",11293,"TAMPAO FOFO SIMPLES COM BASE, CLASSE A15 CARGA MAX 1,5 T, 400 X 500 MM, COM INSCRICAO INCENDIO","UN    ",1,195.55,195.55,195.55,195.55]
[null,"MATERIAL (C) - TOTAL",null,null,null,null,null,null,195.55,195.55]
[]
[24,"FONTE","CÓDIGO","DESCRIÇÃO","UNIDADE","COEFIC.","CUSTO UNITÁRIO",null,"CUSTO  TOTAL (A) + (B) + (C) + (D) + (E)"]
[null,null,null,null,null,null,"DESONERADO","NÃO DESONER.","DESONERADO","NÃO DESONER."]
[null,"COMPOSIÇÃO","COMP 024_SEE","SINALIZADOR FOTOLUMINESCENTE PARA EXTINTOR","UN ",null,"-","-",24.159999999999997,24.279999999999998]
[null,"AGETOP_I",5,"SERVENTE","h     ",0.09,8.75,10.14,0.79,0.91]
[null,"MÃO DE OBRA (B) - TOTAL",null,null,null,null,null,null,0.79,0.91]
[null,"AGETOP_I",3070,"BUCHA DE NYLON S-6","un",2,0.04,0.04,0.08,0.08]
[null,"AGETOP_I",3393,"PARAFUSO P/BUCHA S-6","un",2,0.08,0.08,0.16,0.16]
[null,"SINAPI_I",37556,"PLACA DE SINALIZACAO DE SEGURANCA CONTRA INCENDIO, FOTOLUMINESCENTE, QUADRADA, *20 X 20* CM, EM PVC *2* MM ANTI-CHAMAS (SIMBOLOS, CORES E PICTOGRAMAS CONFORME NBR 13434)","UN    ",1,23.13,23.13,23.13,23.13]
[null,"MATERIAL (C) - TOTAL",null,null,null,null,null,null,23.369999999999997,23.369999999999997]
[]
[186,"FONTE","CÓDIGO","DESCRIÇÃO","UNIDADE","COEFIC.","CUSTO UNITÁRIO",null,"CUSTO  TOTAL (A) + (B) + (C) + (D) + (E)"]
[null,null,null,null,null,null,"DESONERADO","NÃO DESONER.","DESONERADO","NÃO DESONER."]
[null,"COMPOSIÇÃO","COMP 186_SEE","BOTOEIRA BOMBA DE INCÊNDIO C/ MARTELO CONVENCIONAL/ ANALÓGICA","UN ",null,null,null,72.25,73.64]
[null,"AGETOP_I",8,"AJUDANTE","h     ",1,8.75,10.14,8.75,10.14]
[null,"AGETOP_I",12,"MATERIAL HIDRO-SANITÁRIO",0,1,0,0,0,0]
[null,"MÃO DE OBRA (B) - TOTAL",null,null,null,null,null,null,8.75,10.14]
[null,"COTAÇÃO","COT 088_SEE","BOTOEIRA BOMBA DE INCÊNDIO C/ MARTELO CONVENCIONAL/ ANALÓGICA","UN",1,63.5,63.5,63.5,63.5]
[null,"MATERIAL (C) - TOTAL",null,null,null,null,null,null,63.5,63.5]
[]
[188,"FONTE","CÓDIGO","DESCRIÇÃO","UNIDADE","COEFIC.","CUSTO UNITÁRIO",null,"CUSTO  TOTAL (A) + (B) + (C) + (D) + (E)"]
[null,null,null,null,null,null,"DESONERADO","NÃO DESONER.","DESONERADO","NÃO DESONER."]
[null,"COMPOSIÇÃO","COMP 188_SEE","ACIONADOR MANUAL DE ALARME","UN ",null,null,null,90.33,91.44]
[null,"AGETOP_I",8,"AJUDANTE","h     ",0.8,8.75,10.14,7,8.11]
[null,"AGETOP_I",12,"MATERIAL HIDRO-SANITÁRIO",0,0.8,0,0,0,0]
[null,"MÃO DE OBRA (B) - TOTAL",null,null,null,null,null,null,7,8.11]
[null,"COTAÇÃO","COT 090_SEE","ACIONADOR MANUAL DE ALARME","UN",1,83.333333333333329,83.333333333333329,83.33,83.33]
[null,"MATERIAL (C) - TOTAL",null,null,null,null,null,null,83.33,83.33]
[]
[190,"FONTE","CÓDIGO","DESCRIÇÃO","UNIDADE","COEFIC.","CUSTO UNITÁRIO",null,"CUSTO  TOTAL (A) + (B) + (C) + (D) + (E)"]
[null,null,null,null,null,null,"DESONERADO","NÃO DESONER.","DESONERADO","NÃO DESONER."]
[null,"COMPOSIÇÃO","COMP 190_SEE","CENTRAL DE DETECÇÃO E ALARME DE 40 SETORES COM BATERIA","UN ",null,null,null,1033.33,1044.45]
[null,"AGETOP_I",8,"AJUDANTE","h     ",8,8.75,10.14,70,81.12]
[null,"AGETOP_I",12,"MATERIAL HIDRO-SANITÁRIO",0,8,0,0,0,0]
[null,"MÃO DE OBRA (B) - TOTAL",null,null,null,null,null,null,70,81.12]
[null,"COTAÇÃO","COT 092_SEE","CENTRAL DE DETECÇÃO E ALARME DE 40 SETORES COM BATERIA (PREÇO MÉDIO)","UN",1,963.33333333333337,963.33333333333337,963.33,963.33]
[null,"MATERIAL (C) - TOTAL",null,null,null,null,null,null,963.33,963.33]
[]
[25,"FONTE","CÓDIGO","DESCRIÇÃO","UNIDADE","COEFIC.","CUSTO UNITÁRIO",null,"CUSTO  TOTAL (A) + (B) + (C) + (D) + (E)"]
[null,null,null,null,null,null,"DESONERADO","NÃO DESONER.","DESONERADO","NÃO DESONER."]
[null,"COMPOSIÇÃO","COMP 025_SEE","SINALIZADOR FOTOLUMINESCENTE DE EMERGÊNCIA","UN ",null,"-","-",24.159999999999997,24.279999999999998]
[null,"AGETOP_I",5,"SERVENTE","h     ",0.09,8.75,10.14,0.79,0.91]
[null,"MÃO DE OBRA (B) - TOTAL",null,null,null,null,null,null,0.79,0.91]
[null,"AGETOP_I",3070,"BUCHA DE NYLON S-6","un",2,0.04,0.04,0.08,0.08]
[null,"AGETOP_I",3393,"PARAFUSO P/BUCHA S-6","un",2,0.08,0.08,0.16,0.16]
[null,"SINAPI_I",37556,"PLACA DE SINALIZACAO DE SEGURANCA CONTRA INCENDIO, FOTOLUMINESCENTE, QUADRADA, *20 X 20* CM, EM PVC *2* MM ANTI-CHAMAS (SIMBOLOS, CORES E PICTOGRAMAS CONFORME NBR 13434)","UN    ",1,23.13,23.13,23.13,23.13]
[null,"MATERIAL (C) - TOTAL",null,null,null,null,null,null,23.369999999999997,23.369999999999997]
[]
[277,"FONTE","CÓDIGO","DESCRIÇÃO","UNIDADE","COEFIC.","CUSTO UNITÁRIO",null,"CUSTO  TOTAL (A) + (B) + (C) + (D) + (E)"]
[null,null,null,null,null,null,"DESONERADO","NÃO DESONER.","DESONERADO","NÃO DESONER."]
[null,"COMPOSIÇÃO","COMP 277_SEE","MARCAÇÃO NO PISO - 1X1 M PARA EXTINTOR","M2",null,null,null,29.419999999999998,29.49]
[null,"AGETOP_I",5,"SERVENTE","h     ",3.3300000000000003E-2,8.75,10.14,0.28999999999999998,0.34]
[null,"MÃO DE OBRA (B) - TOTAL",null,null,null,null,null,null,0.28999999999999998,0.34]
[null,"SINAPI_I",5318,"SOLVENTE DILUENTE A BASE DE AGUARRAS","L     ",0.13,10.86,10.86,1.41,1.41]
[null,"SINAPI",5824,"CAMINHÃO TOCO, PBT 16.000 KG, CARGA ÚTIL MÁX. 10.685 KG, DIST. ENTRE EIXOS 4,8 M, POTÊNCIA 189 CV, INCLUSIVE CARROCERIA FIXA ABERTA DE MADEIRA P/ TRANSPORTE GERAL DE CARGA SECA, DIMEN. APROX. 2,5 X 7,00 X 0,50 M - CHP DIURNO. AF_06/2014","CHP",3.3E-3,123.81,127,0.41,0.42]
[null,"SINAPI_I",7343,"TINTA A BASE DE RESINA ACRILICA, PARA SINALIZACAO HORIZONTAL VIARIA (NBR 11862)","L     ",0.6,12.55,12.55,7.53,7.53]
[null,"SINAPI_I",7348,"TINTA ACRILICA PREMIUM PARA PISO","L     ",0.03,13.5,13.5,0.41,0.41]
[null,"SINAPI_I",25972,"MICROESFERAS DE VIDRO PARA SINALIZACAO HORIZONTAL VIARIA, TIPO I-B (PREMIX) - NBR 16184","KG    ",2.14,8.8800000000000008,8.8800000000000008,19,19]
[null,"SINAPI",95133,"MÁQUINA DEMARCADORA DE FAIXA DE TRÁFEGO À FRIO, AUTOPROPELIDA, POTÊNCIA 38 HP - CHP DIURNO. AF_07/2016","CHP",3.3E-3,111.85,115.4,0.37,0.38]
[null,"MATERIAL (C) - TOTAL",null,null,null,null,null,null,29.13,29.15]
[]
[80,"FONTE","CÓDIGO","DESCRIÇÃO","UNIDADE","COEFIC.","CUSTO UNITÁRIO",null,"CUSTO  TOTAL (A) + (B) + (C) + (D) + (E)"]
[null,null,null,null,null,null,"DESONERADO","NÃO DESONER.","DESONERADO","NÃO DESONER."]
[null,"COMPOSIÇÃO","COMP 080_SEE","BUCHA REDUCAO FERRO GALV ROSCA REF. 2 1/2\"X1\"","UN ",null,null,null,26.78,27.17]
[null,"AGETOP_I",8,"AJUDANTE","h     ",0.28000000000000003,8.75,10.14,2.4500000000000002,2.84]
[null,"AGETOP_I",11,"MATERIAL ELÉTRICO",0,0.28000000000000003,0,0,0,0]
[null,"MÃO DE OBRA (B) - TOTAL",null,null,null,null,null,null,2.4500000000000002,2.84]
[null,"SINAPI_I",3148,"FITA VEDA ROSCA EM ROLOS DE 18 MM X 50 M (L X C)","UN    ",2.4500000000000001E-2,14.38,14.38,0.35,0.35]
[null,"SINAPI_I",773,"BUCHA DE REDUCAO DE FERRO GALVANIZADO, COM ROSCA BSP, DE 2 1/2\" X 1\"","UN    ",1,23.98,23.98,23.98,23.98]
[null,"MATERIAL (C) - TOTAL",null,null,null,null,null,null,24.330000000000002,24.330000000000002]
[]
[382,"FONTE","CÓDIGO","DESCRIÇÃO","UNIDADE","COEFIC.","CUSTO UNITÁRIO",null,"CUSTO  TOTAL (A) + (B) + (C) + (D) + (E)"]
[null,null,null,null,null,null,"DESONERADO","NÃO DESONER.","DESONERADO","NÃO DESONER."]
[null,"COMPOSIÇÃO","COMP 382_SEE","TE DE REDUCAO DE FERRO GALVANIZADO, COM ROSCA BSP, DE 3/4\" X 1/2\"","UN ",null,null,null,14.08,14.91]
[null,"AGETOP_I",8,"AJUDANTE","h     ",0.6,8.75,10.14,5.25,6.08]
[null,"AGETOP_I",11,"MATERIAL ELÉTRICO",0,0.61050000000000004,0,0,0,0]
[null,"MÃO DE OBRA (B) - TOTAL",null,null,null,null,null,null,5.25,6.08]
[null,"SINAPI_I",3146,"FITA VEDA ROSCA EM ROLOS DE 18 MM X 10 M (L X C)","UN    ",0.12075471698113208,3.9,3.9,0.47,0.47]
[null,"SINAPI_I",6302,"TE DE REDUCAO DE FERRO GALVANIZADO, COM ROSCA BSP, DE 3/4\" X 1/2\"","UN    ",1,8.36,8.36,8.36,8.36]
[null,"MATERIAL (C) - TOTAL",null,null,null,null,null,null,8.83,8.83]
[]
[383,"FONTE","CÓDIGO","DESCRIÇÃO","UNIDADE","COEFIC.","CUSTO UNITÁRIO",null,"CUSTO  TOTAL (A) + (B) + (C) + (D) + (E)"]
[null,null,null,null,null,null,"DESONERADO","NÃO DESONER.","DESONERADO","NÃO DESONER."]
[null,"COMPOSIÇÃO","COMP 383_SEE","BUCHA DE REDUCAO DE FERRO GALVANIZADO, COM ROSCA BSP, DE 1/2\" X 1/4\"","UN ",null,null,null,4.4800000000000004,4.7]
[null,"AGETOP_I",8,"AJUDANTE","h     ",0.16,8.75,10.14,1.4,1.62]
[null,"AGETOP_I",11,"MATERIAL ELÉTRICO",0,0.16,0,0,0,0]
[null,"MÃO DE OBRA (B) - TOTAL",null,null,null,null,null,null,1.4,1.62]
[null,"AGETOP_I","H689","","",1.2,0,0,0,0]
[null,"SINAPI_I",770,"BUCHA DE REDUCAO DE FERRO GALVANIZADO, COM ROSCA BSP, DE 1/2\" X 1/4\"","UN    ",1,3.08,3.08,3.08,3.08]
[null,"MATERIAL (C) - TOTAL",null,null,null,null,null,null,3.08,3.08]
[]
[212,"FONTE","CÓDIGO","DESCRIÇÃO","UNIDADE","COEFIC.","CUSTO UNITÁRIO",null,"CUSTO  TOTAL (A) + (B) + (C) + (D) + (E)"]
[null,null,null,null,null,null,"DESONERADO","NÃO DESONER.","DESONERADO","NÃO DESONER."]
[null,"COMPOSIÇÃO","COMP 212_SEE","NIPLE DE REDUÇÃO 1/2\" X 1/4\" BSP","UN ",null,null,null,7.4499999999999993,7.67]
[null,"AGETOP_I",8,"AJUDANTE","h     ",0.16,8.75,10.14,1.4,1.62]
[null,"AGETOP_I",11,"MATERIAL ELÉTRICO",0,0.16,0,0,0,0]
[null,"MÃO DE OBRA (B) - TOTAL",null,null,null,null,null,null,1.4,1.62]
[null,"COTAÇÃO","COT 103_SEE","NIPLE DE REDUÇÃO 1/2\" X 1/4\" BSP","UN",1,6.0533333333333337,6.0533333333333337,6.05,6.05]
[null,"MATERIAL (C) - TOTAL",null,null,null,null,null,null,6.05,6.05]
[]
[213,"FONTE","CÓDIGO","DESCRIÇÃO","UNIDADE","COEFIC.","CUSTO UNITÁRIO",null,"CUSTO  TOTAL (A) + (B) + (C) + (D) + (E)"]
[null,null,null,null,null,null,"DESONERADO","NÃO DESONER.","DESONERADO","NÃO DESONER."]
[null,"COMPOSIÇÃO","COMP 213_SEE","NIPLE DE REDUÇÃO 3/4\" X 1/2\" BSP","UN ",null,null,null,11.110000000000001,11.330000000000002]
[null,"AGETOP_I",8,"AJUDANTE","h     ",0.16,8.75,10.14,1.4,1.62]
[null,"AGETOP_I",11,"MATERIAL ELÉTRICO",0,0.16,0,0,0,0]
[null,"MÃO DE OBRA (B) - TOTAL",null,null,null,null,null,null,1.4,1.62]
[null,"COTAÇÃO","COT 104_SEE","NIPLE DE REDUÇÃO 3/4\" X 1/2\" BSP","UN",1,9.7099999999999991,9.7099999999999991,9.7100000000000009,9.7100000000000009]
[null,"MATERIAL (C) - TOTAL",null,null,null,null,null,null,9.7100000000000009,9.7100000000000009]
[]
[237,"FONTE","CÓDIGO","DESCRIÇÃO","UNIDADE","COEFIC.","CUSTO UNITÁRIO",null,"CUSTO  TOTAL (A) + (B) + (C) + (D) + (E)"]
[null,null,null,null,null,null,"DESONERADO","NÃO DESONER.","DESONERADO","NÃO DESONER."]
[null,"COMPOSIÇÃO","COMP 237_SEE","FITA ANTICORROSIVA","M",null,null,null,9.35,9.629999999999999]
[null,"AGETOP_I",8,"AJUDANTE","h     ",0.2,8.75,10.14,1.75,2.0299999999999998]
[null,"AGETOP_I",12,"MATERIAL HIDRO-SANITÁRIO",0,0.2,0,0,0,0]
[null,"MÃO DE OBRA (B) - TOTAL",null,null,null,null,null,null,1.75,2.0299999999999998]
[null,"SINAPI_I",39634,"FITA ADESIVA ANTICORROSIVA DE PVC FLEXIVEL, COR PRETA, PARA PROTECAO TUBULACAO, 50 MM X 30 M (L X C), E= *0,25* MM","M     ",1,7.6,7.6,7.6,7.6]
[null,"MATERIAL (C) - TOTAL",null,null,null,null,null,null,7.6,7.6]
[]
[542,"FONTE","CÓDIGO","DESCRIÇÃO","UNIDADE","COEFIC.","CUSTO UNITÁRIO",null,"CUSTO  TOTAL (A) + (B) + (C) + (D) + (E)"]
[null,null,null,null,null,null,"DESONERADO","NÃO DESONER.","DESONERADO","NÃO DESONER."]
[null,"COMPOSIÇÃO","COMP 542_SEE","VÁLVULA UGV 3/4\" (S) LATÃO","UN ",null,null,null,19.62,20.22]
[null,"AGETOP_I",8,"AJUDANTE","h     ",0.432,8.75,10.14,3.78,4.38]
[null,"AGETOP_I",11,"MATERIAL ELÉTRICO",0,0.432,0,0,0,0]
[null,"MÃO DE OBRA (B) - TOTAL",null,null,null,null,null,null,3.78,4.38]
[null,"COTAÇÃO","COT 281_SEE","VÁLVULA UGV 3/4\" (S) LATÃO","UN ",1,15.836666666666666,15.836666666666666,15.84,15.84]
[null,"MATERIAL (C) - TOTAL",null,null,null,null,null,null,15.84,15.84]
[]
[543,"FONTE","CÓDIGO","DESCRIÇÃO","UNIDADE","COEFIC.","CUSTO UNITÁRIO",null,"CUSTO  TOTAL (A) + (B) + (C) + (D) + (E)"]
[null,null,null,null,null,null,"DESONERADO","NÃO DESONER.","DESONERADO","NÃO DESONER."]
[null,"COMPOSIÇÃO","COMP 543_SEE","VÁLVULA UGV 1/2\" (S) LATÃO","UN ",null,null,null,18.95,19.55]
[null,"AGETOP_I",8,"AJUDANTE","h     ",0.432,8.75,10.14,3.78,4.38]
[null,"AGETOP_I",11,"MATERIAL ELÉTRICO",0,0.432,0,0,0,0]
[null,"MÃO DE OBRA (B) - TOTAL",null,null,null,null,null,null,3.78,4.38]
[null,"COTAÇÃO","COT 282_SEE","VÁLVULA UGV 1/2\" (S) LATÃO","UN ",1,15.166666666666666,15.166666666666666,15.17,15.17]
[null,"MATERIAL (C) - TOTAL",null,null,null,null,null,null,15.17,15.17]
[]
[211,"FONTE","CÓDIGO","DESCRIÇÃO","UNIDADE","COEFIC.","CUSTO UNITÁRIO",null,"CUSTO  TOTAL (A) + (B) + (C) + (D) + (E)"]
[null,null,null,null,null,null,"DESONERADO","NÃO DESONER.","DESONERADO","NÃO DESONER."]
[null,"COMPOSIÇÃO","COMP 211_SEE","REGULADOR DE 2º ESTÁGIO 5KG/H","UN ",null,null,null,69.89,71.489999999999995]
[null,"AGETOP_I",8,"AJUDANTE","h     ",1.1499999999999999,8.75,10.14,10.06,11.66]
[null,"AGETOP_I",11,"MATERIAL ELÉTRICO",0,1.1499999999999999,0,0,0,0]
[null,"MÃO DE OBRA (B) - TOTAL",null,null,null,null,null,null,10.06,11.66]
[null,"COTAÇÃO","COT 102_SEE","REGULADOR DE 2º ESTÁGIO 5KG/H","UN",1,59.833333333333336,59.833333333333336,59.83,59.83]
[null,"AGETOP_I","H689","","",2.82,0,0,0,0]
[null,"MATERIAL (C) - TOTAL",null,null,null,null,null,null,59.83,59.83]
[]
[210,"FONTE","CÓDIGO","DESCRIÇÃO","UNIDADE","COEFIC.","CUSTO UNITÁRIO",null,"CUSTO  TOTAL (A) + (B) + (C) + (D) + (E)"]
[null,null,null,null,null,null,"DESONERADO","NÃO DESONER.","DESONERADO","NÃO DESONER."]
[null,"COMPOSIÇÃO","COMP 210_SEE","REGULADOR DE 1º ESTÁGIO 60KG/H MODELO AP-40  COM MANÔMETRO","UN ",null,null,null,215.64000000000001,217.24]
[null,"AGETOP_I",8,"AJUDANTE","h     ",1.1499999999999999,8.75,10.14,10.06,11.66]
[null,"AGETOP_I",11,"MATERIAL ELÉTRICO",0,1.1499999999999999,0,0,0,0]
[null,"MÃO DE OBRA (B) - TOTAL",null,null,null,null,null,null,10.06,11.66]
[null,"COTAÇÃO","COT 101_SEE","REGULADOR DE 1º ESTÁGIO 60KG/H MODELO AP-40  COM MANÔMETRO","UN",1,205.57666666666668,205.57666666666668,205.58,205.58]
[null,"AGETOP_I","H689","","",2.82,0,0,0,0]
[null,"MATERIAL (C) - TOTAL",null,null,null,null,null,null,205.58,205.58]
[]
[235,"FONTE","CÓDIGO","DESCRIÇÃO","UNIDADE","COEFIC.","CUSTO UNITÁRIO",null,"CUSTO  TOTAL (A) + (B) + (C) + (D) + (E)"]
[null,null,null,null,null,null,"DESONERADO","NÃO DESONER.","DESONERADO","NÃO DESONER."]
[null,"COMPOSIÇÃO","COMP 235_SEE","PLACA DE SINALIZAÇÃO EM PVC COD 01 - (300X300) PROIBIDO FUMAR","UN ",null,null,null,24.159999999999997,24.279999999999998]
[null,"AGETOP_I",5,"SERVENTE","h     ",0.09,8.75,10.14,0.79,0.91]
[null,"MÃO DE OBRA (B) - TOTAL",null,null,null,null,null,null,0.79,0.91]
[null,"AGETOP_I",3070,"BUCHA DE NYLON S-6","un",2,0.04,0.04,0.08,0.08]
[null,"AGETOP_I",3393,"PARAFUSO P/BUCHA S-6","un",2,0.08,0.08,0.16,0.16]
[null,"SINAPI_I",37556,"PLACA DE SINALIZACAO DE SEGURANCA CONTRA INCENDIO, FOTOLUMINESCENTE, QUADRADA, *20 X 20* CM, EM PVC *2* MM ANTI-CHAMAS (SIMBOLOS, CORES E PICTOGRAMAS CONFORME NBR 13434)","UN    ",1,23.13,23.13,23.13,23.13]
[null,"MATERIAL (C) - TOTAL",null,null,null,null,null,null,23.369999999999997,23.369999999999997]
[]
[236,"FONTE","CÓDIGO","DESCRIÇÃO","UNIDADE","COEFIC.","CUSTO UNITÁRIO",null,"CUSTO  TOTAL (A) + (B) + (C) + (D) + (E)"]
[null,null,null,null,null,null,"DESONERADO","NÃO DESONER.","DESONERADO","NÃO DESONER."]
[null,"COMPOSIÇÃO","COMP 236_SEE","PLACA DE SINALIZAÇÃO EM PVC COD 06 - (300X300) PERIGO INFLAMÁVEL","UN ",null,null,null,24.159999999999997,24.279999999999998]
[null,"AGETOP_I",5,"SERVENTE","h     ",0.09,8.75,10.14,0.79,0.91]
[null,"MÃO DE OBRA (B) - TOTAL",null,null,null,null,null,null,0.79,0.91]
[null,"AGETOP_I",3070,"BUCHA DE NYLON S-6","un",2,0.04,0.04,0.08,0.08]
[null,"AGETOP_I",3393,"PARAFUSO P/BUCHA S-6","un",2,0.08,0.08,0.16,0.16]
[null,"SINAPI_I",37556,"PLACA DE SINALIZACAO DE SEGURANCA CONTRA INCENDIO, FOTOLUMINESCENTE, QUADRADA, *20 X 20* CM, EM PVC *2* MM ANTI-CHAMAS (SIMBOLOS, CORES E PICTOGRAMAS CONFORME NBR 13434)","UN    ",1,23.13,23.13,23.13,23.13]
[null,"MATERIAL (C) - TOTAL",null,null,null,null,null,null,23.369999999999997,23.369999999999997]
[]
[45,"FONTE","CÓDIGO","DESCRIÇÃO","UNIDADE","COEFIC.","CUSTO UNITÁRIO",null,"CUSTO  TOTAL (A) + (B) + (C) + (D) + (E)"]
[null,null,null,null,null,null,"DESONERADO","NÃO DESONER.","DESONERADO","NÃO DESONER."]
[null,"COMPOSIÇÃO","COMP 045_SEE","LAUDO DE ESTANQUEIDADE","UN ",null,null,null,936,1085.1199999999999]
[null,"AGETOP",250101,"ENGENHEIRO - (OBRAS CIVIS)","H     ",16,58.5,67.819999999999993,936,1085.1199999999999]
[null,"MÃO DE OBRA (B) - TOTAL",null,null,null,null,null,null,936,1085.1199999999999]
[null,"MATERIAL (C) - TOTAL",null,null,null,null,null,null,0,0]
[]
[83,"FONTE","CÓDIGO","DESCRIÇÃO","UNIDADE","COEFIC.","CUSTO UNITÁRIO",null,"CUSTO  TOTAL (A) + (B) + (C) + (D) + (E)"]
[null,null,null,null,null,null,"DESONERADO","NÃO DESONER.","DESONERADO","NÃO DESONER."]
[null,"COMPOSIÇÃO","COMP 083_SEE","CORRIMÃO PISO - SEDUC","M",null,null,null,143.18,147.41000000000003]
[null,"AGETOP_I",25,"OFICIAL \"B\"","h     ",1,13.95,16.16,13.95,16.16]
[null,"AGETOP_I",8,"AJUDANTE","h     ",1,8.75,10.14,8.75,10.14]
[null,"MÃO DE OBRA (B) - TOTAL",null,null,null,null,null,null,22.7,26.3]
[null,"AGETOP_I",2376,"TUBO INDUSTRIAL 2\" CHAPA 13 ","Kg",8.2197499999999994,5.23,5.23,42.99,42.99]
[null,"AGETOP_I",2504,"TUBO INDUSTRIAL D=25 MM CHAPA 13 ","Kg",1.1000000000000001,5.07,5.07,5.58,5.58]
[null,"AGETOP_I",2417,"MASSA PLASTICA","Kg",0.2041,10.58,10.58,2.16,2.16]
[null,"AGETOP_I",2246,"ELETRODO 2.5 OK","Kg",0.11459999999999999,8.6999999999999993,8.6999999999999993,1,1]
[null,"AGETOP_I",1672,"LIXA PARA FERRO ( NÚMERO 100 )","un",0.125,2.12,2.12,0.27,0.27]
[null,"AGETOP_I",1264,"DISCO DE DESBASTE 7/8\" P/ CONC./FERRO (1/4\" X 7\")","un",2.5000000000000001E-2,7,7,0.18,0.18]
[null,"AGETOP_I",1334,"DISCO DE CORTE DIAM. 5/8\"- 10\"","un",0.1865,5.5,5.5,1.03,1.03]
[null,"AGETOP_I",2902,"FABRICAÇÃO / MONTAGEM","un",1,50.44,50.44,50.44,50.44]
[null,"AGETOP_I",2150,"CHAPA DE FERRO DOBRADA No.13","Kg",0.43519999999999998,5.28,5.28,2.2999999999999998,2.2999999999999998]
[null,"AGETOP_I",2719,"CHAPA PERFILADA 3/16\"","Kg",1.1644000000000001,5.04,5.04,5.87,5.87]
[null,"AGETOP_I",2436,"ACO CA-25 - 6,3 MM (1/4\") - BARRA LISA A-36","Kg",0.48150000000000004,5.13,5.13,2.4700000000000002,2.4700000000000002]
[null,"AGETOP",261602,"PINT.ESMALTE/ESQUAD.FERRO C/FUNDO ANTICOR.","m2    ",0.44,14.07,15.51,6.19,6.82]
[null,"MATERIAL (C) - TOTAL",null,null,null,null,null,null,120.48,121.11000000000001]
[]
[84,"FONTE","CÓDIGO","DESCRIÇÃO","UNIDADE","COEFIC.","CUSTO UNITÁRIO",null,"CUSTO  TOTAL (A) + (B) + (C) + (D) + (E)"]
[null,null,null,null,null,null,"DESONERADO","NÃO DESONER.","DESONERADO","NÃO DESONER."]
[null,"COMPOSIÇÃO","COMP 084_SEE","GUARDA-CORPO COM CORRIMÃO - SEDUC","M",null,null,null,206.14000000000001,211.22000000000003]
[null,"AGETOP_I",25,"OFICIAL \"B\"","h     ",1.1000000000000001,13.95,16.16,15.35,17.78]
[null,"AGETOP_I",8,"AJUDANTE","h     ",1.1000000000000001,8.75,10.14,9.6300000000000008,11.15]
[null,"MÃO DE OBRA (B) - TOTAL",null,null,null,null,null,null,24.98,28.93]
[null,"AGETOP_I",2376,"TUBO INDUSTRIAL 2\" CHAPA 13 ","Kg",7.7778,5.23,5.23,40.68,40.68]
[null,"AGETOP_I",2504,"TUBO INDUSTRIAL D=25 MM CHAPA 13 ","Kg",4.6319999999999997,5.07,5.07,23.48,23.48]
[null,"AGETOP_I",2377,"TUBO INDUSTRIAL 40X40 CH.13","Kg",6.3419999999999996,5.07,5.07,32.15,32.15]
[null,"AGETOP_I",2421,"TUBO INDUSTRIAL 1.1/2\" CHAPA 13 ","Kg",1.4862,5.07,5.07,7.54,7.54]
[null,"AGETOP_I",2417,"MASSA PLASTICA","Kg",0.2041,10.58,10.58,2.16,2.16]
[null,"AGETOP_I",2246,"ELETRODO 2.5 OK","Kg",0.11459999999999999,8.6999999999999993,8.6999999999999993,1,1]
[null,"AGETOP_I",1672,"LIXA PARA FERRO ( NÚMERO 100 )","un",0.25509999999999999,2.12,2.12,0.54,0.54]
[null,"AGETOP_I",1264,"DISCO DE DESBASTE 7/8\" P/ CONC./FERRO (1/4\" X 7\")","un",5.0999999999999997E-2,7,7,0.36,0.36]
[null,"AGETOP_I",1334,"DISCO DE CORTE DIAM. 5/8\"- 10\"","un",0.373,5.5,5.5,2.0499999999999998,2.0499999999999998]
[null,"AGETOP_I",2902,"FABRICAÇÃO / MONTAGEM","un",1,50.44,50.44,50.44,50.44]
[null,"AGETOP_I",2150,"CHAPA DE FERRO DOBRADA No.13","Kg",0.43519999999999998,5.28,5.28,2.2999999999999998,2.2999999999999998]
[null,"AGETOP_I",2719,"CHAPA PERFILADA 3/16\"","Kg",1.0979999999999999,5.04,5.04,5.53,5.53]
[null,"AGETOP_I",2436,"ACO CA-25 - 6,3 MM (1/4\") - BARRA LISA A-36","Kg",0.38124999999999998,5.13,5.13,1.96,1.96]
[null,"AGETOP",261602,"PINT.ESMALTE/ESQUAD.FERRO C/FUNDO ANTICOR.","m2    ",0.78,14.07,15.51,10.97,12.1]
[null,"MATERIAL (C) - TOTAL",null,null,null,null,null,null,181.16000000000003,182.29000000000002]

{"sheet":"Cotações","index":8,"n_rows":147,"n_cols":9,"rows_kept":147,"cut":false,"hidden":false,"merged":[[144,3,144,4],[144,7,144,8],[145,3,145,4],[145,7,145,8],[146,3,146,8],[141,3,141,4],[141,7,141,8],[142,3,142,4],[142,7,142,8],[143,3,143,4],[143,7,143,8],[137,7,138,8],[139,7,139,8],[140,3,140,4],[140,5,140,6],[140,7,140,8],[137,1,138,1],[137,2,138,2],[137,3,138,3],[137,4,138,4],[137,5,137,6],[133,3,133,4],[133,7,133,8],[134,3,134,4],[134,7,134,8],[135,3,135,8],[130,3,130,4],[130,7,130,8],[131,3,131,4],[131,7,131,8],[132,3,132,4],[132,7,132,8],[126,7,127,8],[128,7,128,8],[129,3,129,4],[129,5,129,6],[129,7,129,8],[126,1,127,1],[126,2,127,2],[126,3,127,3],[126,4,127,4],[126,5,126,6],[122,3,122,4],[122,7,122,8],[123,3,123,4],[123,7,123,8],[124,3,124,8],[119,3,119,4],[119,7,119,8],[120,3,120,4],[120,7,120,8],[121,3,121,4],[121,7,121,8],[115,7,116,8],[117,7,117,8],[118,3,118,4],[118,5,118,6],[118,7,118,8],[115,1,116,1],[115,2,116,2],[115,3,116,3],[115,4,116,4],[115,5,115,6],[111,3,111,4],[111,7,111,8],[112,3,112,4],[112,7,112,8],[113,3,113,8],[108,3,108,4],[108,7,108,8],[109,3,109,4],[109,7,109,8],[110,3,110,4],[110,7,110,8],[104,7,105,8],[106,7,106,8],[107,3,107,4],[107,5,107,6],[107,7,107,8],[104,1,105,1],[104,2,105,2],[104,3,105,3],[104,4,105,4],[104,5,104,6],[100,3,100,4],[100,7,100,8],[101,3,101,4],[101,7,101,8],[102,3,102,8],[97,3,97,4],[97,7,97,8],[98,3,98,4],[98,7,98,8],[99,3,99,4],[99,7,99,8],[93,7,94,8],[95,7,95,8],[96,3,96,4],[96,5,96,6],[96,7,96,8],[93,1,94,1],[93,2,94,2],[93,3,94,3],[93,4,94,4],[93,5,93,6],[89,3,89,4],[89,7,89,8],[90,3,90,4],[90,7,90,8],[91,3,91,8],[86,3,86,4],[86,7,86,8],[87,3,87,4],[87,7,87,8],[88,3,88,4],[88,7,88,8],[82,7,83,8],[84,7,84,8],[85,3,85,4],[85,5,85,6],[85,7,85,8],[82,1,83,1],[82,2,83,2],[82,3,83,3],[82,4,83,4],[82,5,82,6],[78,3,78,4],[78,7,78,8],[79,3,79,4],[79,7,79,8],[80,3,80,8],[75,3,75,4],[75,7,75,8],[76,3,76,4],[76,7,76,8],[77,3,77,4],[77,7,77,8],[71,7,72,8],[73,7,73,8],[74,3,74,4],[74,5,74,6],[74,7,74,8],[71,1,72,1],[71,2,72,2],[71,3,72,3],[71,4,72,4],[71,5,71,6],[67,3,67,4],[67,7,67,8],[68,3,68,4],[68,7,68,8],[69,3,69,8],[64,3,64,4],[64,7,64,8],[65,3,65,4],[65,7,65,8],[66,3,66,4],[66,7,66,8],[60,7,61,8],[62,7,62,8],[63,3,63,4],[63,5,63,6],[63,7,63,8],[60,1,61,1],[60,2,61,2],[60,3,61,3],[60,4,61,4],[60,5,60,6],[56,3,56,4],[56,7,56,8],[57,3,57,4],[57,7,57,8],[58,3,58,8],[53,3,53,4],[53,7,53,8],[54,3,54,4],[54,7,54,8],[55,3,55,4],[55,7,55,8],[49,7,50,8],[51,7,51,8],[52,3,52,4],[52,5,52,6],[52,7,52,8],[49,1,50,1],[49,2,50,2],[49,3,50,3],[49,4,50,4],[49,5,49,6],[45,3,45,4],[45,7,45,8],[46,3,46,4],[46,7,46,8],[47,3,47,8],[42,3,42,4],[42,7,42,8],[43,3,43,4],[43,7,43,8],[44,3,44,4],[44,7,44,8],[38,7,39,8],[40,7,40,8],[41,3,41,4],[41,5,41,6],[41,7,41,8],[38,1,39,1],[38,2,39,2],[38,3,39,3],[38,4,39,4],[38,5,38,6],[34,3,34,4],[34,7,34,8],[35,3,35,4],[35,7,35,8],[36,3,36,8],[31,3,31,4],[31,7,31,8],[32,3,32,4],[32,7,32,8],[33,3,33,4],[33,7,33,8],[27,7,28,8],[29,7,29,8],[30,3,30,4],[30,5,30,6],[30,7,30,8],[27,1,28,1],[27,2,28,2],[27,3,28,3],[27,4,28,4],[27,5,27,6],[23,3,23,4],[23,7,23,8],[24,3,24,4],[24,7,24,8],[25,3,25,8],[20,3,20,4],[20,7,20,8],[21,3,21,4],[21,7,21,8],[22,3,22,4],[22,7,22,8],[16,7,17,8],[18,7,18,8],[19,3,19,4],[19,5,19,6],[19,7,19,8],[16,1,17,1],[16,2,17,2],[16,3,17,3],[16,4,17,4],[16,5,16,6],[8,0,8,8],[0,0,0,8],[1,0,1,9],[2,0,2,8],[3,0,3,6],[3,7,3,9],[4,0,4,6],[4,7,4,9],[5,0,5,8],[6,0,6,6],[6,7,6,9],[7,0,7,6],[7,7,7,9],[9,0,9,2],[9,3,9,6],[9,7,9,8],[10,0,10,2],[10,3,10,6],[10,8,10,9],[14,0,14,8],[15,0,15,9],[11,0,11,9],[12,0,12,2],[12,3,12,6],[12,7,12,8],[13,0,13,2],[13,3,13,6],[13,8,13,9]]}
[]
[]
[]
["UNIDADE ESCOLAR",null,null,null,null,null,null,"CÓDIGO INEP"]
[{"$f":"Orçamento!$O$4","v":"ACERVO DAS ESCOLAS EXTINTAS DE GOIÂNIA"},null,null,null,null,null,null,{"$f":"Orçamento!$V$4","v":0}]
[]
["OBRA",null,null,null,null,null,null,"CIDADE"]
[{"$f":"Orçamento!$O$7","v":"AMPLIAÇÃO E REFORMA"},null,null,null,null,null,null,{"$f":"Orçamento!$V$7","v":"GOIÂNIA"}]
[]
["CRE",null,null,"ENDEREÇO",null,null,null,"REFERÊNCIA AGETOP"]
[{"$f":"Orçamento!$O$10","v":"GOIÂNIA"},null,null,{"$f":"Orçamento!$R$10","v":"AV. HUGO DE CARVALHO RAMOS, VILA IRANY"},null,null,null,{"$f":"Orçamento!$S$10","v":"ABR/19"},{"$f":"Orçamento!$T$10","v":"ONERADA"}]
[]
["DATA",null,null,"ÁREA TOTAL CONSTRUÍDA (M²)",null,null,null,"REFERÊNCIA SINAPI"]
[{"$f":"Orçamento!$S$7","v":"2020-09-02"},null,null,{"$f":"Orçamento!$V$13","v":2413.75},null,null,null,{"$f":"Orçamento!$V$10","v":"OUT/19"},{"$f":"Orçamento!$W$10","v":"ONERADA"}]
[]
["COTAÇÕES DE PREÇOS - SEE-GO"]
[null,"FONTE","CÓDIGO","DESCRIÇÃO","UNIDADE","MÉDIA",null,"ÍNDICE RETROAÇÃO"]
[null,null,null,null,null,"DESONERADA","ONERADA"]
[195,"COTAÇÃO","COT 195_SEE","LÂMPADA LED TUBULAR 18W ","UN",21.959999999999997,21.959999999999997,""]
[null,null,"EMPRESA","NOME DA EMPRESA",null,"COTAÇÕES",null,"DATA COTAÇÃO"]
[null,null,"E030 - AJEL M...","AJEL MATERIAIS ELÉTRICOS",null,19.89,19.89,""]
[null,null,"E013 - ELETRO...","ELETROTRANSOL",null,25.99,25.99,""]
[null,null,"E014 - MAKRO ...","MAKRO SERVICE",null,20,20,""]
[null,null,"","",null,null,null,""]
[null,null,"","",null,null,null,""]
[null,null,"OBSERVAÇÕES:",""]
[]
[null,"FONTE","CÓDIGO","DESCRIÇÃO","UNIDADE","MÉDIA",null,"ÍNDICE RETROAÇÃO"]
[null,null,null,null,null,"DESONERADA","ONERADA"]
[8,"COTAÇÃO","COT 008_SEE","CONJUNTO MOTOR-BOMBA ELÉTRICA TRIFÁSICO 380/220 V PARA VZ= 24,33 M³/H, HM= 46,24 M POTÊNCIA= 7,5 CV","UN ",3792.6666666666665,3792.6666666666665,""]
[null,null,"EMPRESA","NOME DA EMPRESA",null,"COTAÇÕES",null,"DATA COTAÇÃO"]
[null,null,"E036 - TECNOB...","TECNOBOMBAS",null,4200,4200,"05.02.2019"]
[null,null,"E039 - ESPÍND...","ESPÍNDOLA E ANDRADE LTDA-ME",null,3178,3178,"05.02.2019"]
[null,null,"E054 - R M D ...","R M D DE SOUZA EIRELI - ME",null,4000,4000,"06.02.2019"]
[null,null,"","",null,null,null,""]
[null,null,"","",null,null,null,""]
[null,null,"OBSERVAÇÕES:",""]
[]
[null,"FONTE","CÓDIGO","DESCRIÇÃO","UNIDADE","MÉDIA",null,"ÍNDICE RETROAÇÃO"]
[null,null,null,null,null,"DESONERADA","ONERADA"]
[17,"COTAÇÃO","COT 017_SEE","REGISTRO DE GAVETA COM HASTE ASCENDENTE DE BRONZE 2 1/2\"","UN ",231.66666666666666,231.66666666666666,""]
[null,null,"EMPRESA","NOME DA EMPRESA",null,"COTAÇÕES",null,"DATA COTAÇÃO"]
[null,null,"E034 - VALK T...","VALK TUBOS",null,220,220,""]
[null,null,"E035 - ACIONA...","ACIONAR SERVIÇOS E EQUIPAMENTOS CONTRA INCÊNDIO",null,250,250,""]
[null,null,"E038 - CENTER...","CENTER FIRE",null,225,225,""]
[null,null,"","",null,null,null,""]
[null,null,"","",null,null,null,""]
[null,null,"OBSERVAÇÕES:",""]
[]
[null,"FONTE","CÓDIGO","DESCRIÇÃO","UNIDADE","MÉDIA",null,"ÍNDICE RETROAÇÃO"]
[null,null,null,null,null,"DESONERADA","ONERADA"]
[88,"COTAÇÃO","COT 088_SEE","BOTOEIRA BOMBA DE INCÊNDIO C/ MARTELO CONVENCIONAL/ ANALÓGICA","UN",63.5,63.5,""]
[null,null,"EMPRESA","NOME DA EMPRESA",null,"COTAÇÕES",null,"DATA COTAÇÃO"]
[null,null,"E034 - VALK T...","VALK TUBOS",null,58,58,""]
[null,null,"E035 - ACIONA...","ACIONAR SERVIÇOS E EQUIPAMENTOS CONTRA INCÊNDIO",null,67.5,67.5,""]
[null,null,"E038 - CENTER...","CENTER FIRE",null,65,65,""]
[null,null,"","",null,null,null,""]
[null,null,"","",null,null,null,""]
[null,null,"OBSERVAÇÕES:",""]
[]
[null,"FONTE","CÓDIGO","DESCRIÇÃO","UNIDADE","MÉDIA",null,"ÍNDICE RETROAÇÃO"]
[null,null,null,null,null,"DESONERADA","ONERADA"]
[90,"COTAÇÃO","COT 090_SEE","ACIONADOR MANUAL DE ALARME","UN",83.333333333333329,83.333333333333329,""]
[null,null,"EMPRESA","NOME DA EMPRESA",null,"COTAÇÕES",null,"DATA COTAÇÃO"]
[null,null,"E034 - VALK T...","VALK TUBOS",null,120,120,""]
[null,null,"E035 - ACIONA...","ACIONAR SERVIÇOS E EQUIPAMENTOS CONTRA INCÊNDIO",null,65,65,""]
[null,null,"E038 - CENTER...","CENTER FIRE",null,65,65,""]
[null,null,"","",null,null,null,""]
[null,null,"","",null,null,null,""]
[null,null,"OBSERVAÇÕES:",""]
[]
[null,"FONTE","CÓDIGO","DESCRIÇÃO","UNIDADE","MÉDIA",null,"ÍNDICE RETROAÇÃO"]
[null,null,null,null,null,"DESONERADA","ONERADA"]
[92,"COTAÇÃO","COT 092_SEE","CENTRAL DE DETECÇÃO E ALARME DE 40 SETORES COM BATERIA (PREÇO MÉDIO)","UN",963.33333333333337,963.33333333333337,""]
[null,null,"EMPRESA","NOME DA EMPRESA",null,"COTAÇÕES",null,"DATA COTAÇÃO"]
[null,null,"E034 - VALK T...","VALK TUBOS",null,840,840,""]
[null,null,"E035 - ACIONA...","ACIONAR SERVIÇOS E EQUIPAMENTOS CONTRA INCÊNDIO",null,980,980,""]
[null,null,"E038 - CENTER...","CENTER FIRE",null,1070,1070,""]
[null,null,"","",null,null,null,""]
[null,null,"","",null,null,null,""]
[null,null,"OBSERVAÇÕES:",""]
[]
[null,"FONTE","CÓDIGO","DESCRIÇÃO","UNIDADE","MÉDIA",null,"ÍNDICE RETROAÇÃO"]
[null,null,null,null,null,"DESONERADA","ONERADA"]
[103,"COTAÇÃO","COT 103_SEE","NIPLE DE REDUÇÃO 1/2\" X 1/4\" BSP","UN",6.0533333333333337,6.0533333333333337,""]
[null,null,"EMPRESA","NOME DA EMPRESA",null,"COTAÇÕES",null,"DATA COTAÇÃO"]
[null,null,"E070 - FOCO R...","FOCO REPRESENTAÇÃO E CONSULTORIA LTDA-ME",null,4.46,4.46,"12/02/2019"]
[null,null,"E071 - CASA D...","CASA DAS PEÇAS COM E INDUSTRIA DE FOGOES LTDA",null,3.9,3.9,"11/02/2019"]
[null,null,"E072 - AMIG I...","AMIG INSTALAÇÃO DE REDE DE GÁS E INCÊNDIO",null,9.8000000000000007,9.8000000000000007,"08/02/2019"]
[null,null,"","",null,null,null,""]
[null,null,"","",null,null,null,""]
[null,null,"OBSERVAÇÕES:",""]
[]
[null,"FONTE","CÓDIGO","DESCRIÇÃO","UNIDADE","MÉDIA",null,"ÍNDICE RETROAÇÃO"]
[null,null,null,null,null,"DESONERADA","ONERADA"]
[104,"COTAÇÃO","COT 104_SEE","NIPLE DE REDUÇÃO 3/4\" X 1/2\" BSP","UN",9.7099999999999991,9.7099999999999991,""]
[null,null,"EMPRESA","NOME DA EMPRESA",null,"COTAÇÕES",null,"DATA COTAÇÃO"]
[null,null,"E070 - FOCO R...","FOCO REPRESENTAÇÃO E CONSULTORIA LTDA-ME",null,10.93,10.93,"12/02/2019"]
[null,null,"E071 - CASA D...","CASA DAS PEÇAS COM E INDUSTRIA DE FOGOES LTDA",null,5.5,5.5,"11/02/2019"]
[null,null,"E072 - AMIG I...","AMIG INSTALAÇÃO DE REDE DE GÁS E INCÊNDIO",null,12.7,12.7,"08/02/2019"]
[null,null,"","",null,null,null,""]
[null,null,"","",null,null,null,""]
[null,null,"OBSERVAÇÕES:",""]
[]
[null,"FONTE","CÓDIGO","DESCRIÇÃO","UNIDADE","MÉDIA",null,"ÍNDICE RETROAÇÃO"]
[null,null,null,null,null,"DESONERADA","ONERADA"]
[281,"COTAÇÃO","COT 281_SEE","VÁLVULA UGV 3/4\" (S) LATÃO","UN ",15.836666666666666,15.836666666666666,""]
[null,null,"EMPRESA","NOME DA EMPRESA",null,"COTAÇÕES",null,"DATA COTAÇÃO"]
[null,null,"E070 - FOCO R...","FOCO REPRESENTAÇÃO E CONSULTORIA LTDA-ME",null,12.51,12.51,"12/02/2019"]
[null,null,"E071 - CASA D...","CASA DAS PEÇAS COM E INDUSTRIA DE FOGOES LTDA",null,17.5,17.5,"11/02/2019"]
[null,null,"E072 - AMIG I...","AMIG INSTALAÇÃO DE REDE DE GÁS E INCÊNDIO",null,17.5,17.5,"08/02/2019"]
[null,null,"",""]
[null,null,"","",null,null,null,""]
[null,null,"OBSERVAÇÕES:",""]
[]
[null,"FONTE","CÓDIGO","DESCRIÇÃO","UNIDADE","MÉDIA",null,"ÍNDICE RETROAÇÃO"]
[null,null,null,null,null,"DESONERADA","ONERADA"]
[282,"COTAÇÃO","COT 282_SEE","VÁLVULA UGV 1/2\" (S) LATÃO","UN ",15.166666666666666,15.166666666666666,""]
[null,null,"EMPRESA","NOME DA EMPRESA",null,"COTAÇÕES",null,"DATA COTAÇÃO"]
[null,null,"E070 - FOCO R...","FOCO REPRESENTAÇÃO E CONSULTORIA LTDA-ME",null,11.2,11.2,"12/02/2019"]
[null,null,"E071 - CASA D...","CASA DAS PEÇAS COM E INDUSTRIA DE FOGOES LTDA",null,17.5,17.5,"11/02/2019"]
[null,null,"E072 - AMIG I...","AMIG INSTALAÇÃO DE REDE DE GÁS E INCÊNDIO",null,16.8,16.8,"08/02/2019"]
[null,null,"","",null,null,null,""]
[null,null,"","",null,null,null,""]
[null,null,"OBSERVAÇÕES:",""]
[]
[null,"FONTE","CÓDIGO","DESCRIÇÃO","UNIDADE","MÉDIA",null,"ÍNDICE RETROAÇÃO"]
[null,null,null,null,null,"DESONERADA","ONERADA"]
[102,"COTAÇÃO","COT 102_SEE","REGULADOR DE 2º ESTÁGIO 5KG/H","UN",59.833333333333336,59.833333333333336,""]
[null,null,"EMPRESA","NOME DA EMPRESA",null,"COTAÇÕES",null,"DATA COTAÇÃO"]
[null,null,"E070 - FOCO R...","FOCO REPRESENTAÇÃO E CONSULTORIA LTDA-ME",null,38.9,38.9,"12/02/2019"]
[null,null,"E071 - CASA D...","CASA DAS PEÇAS COM E INDUSTRIA DE FOGOES LTDA",null,55.599999999999994,55.599999999999994,"11/02/2019"]
[null,null,"E072 - AMIG I...","AMIG INSTALAÇÃO DE REDE DE GÁS E INCÊNDIO",null,85,85,"08/02/2019"]
[null,null,"","",null,null,null,""]
[null,null,"","",null,null,null,""]
[null,null,"OBSERVAÇÕES:","AMIG enviou cotação de regulador de 2º estágio de 12kg/h."]
[]
[null,"FONTE","CÓDIGO","DESCRIÇÃO","UNIDADE","MÉDIA",null,"ÍNDICE RETROAÇÃO"]
[null,null,null,null,null,"DESONERADA","ONERADA"]
[101,"COTAÇÃO","COT 101_SEE","REGULADOR DE 1º ESTÁGIO 60KG/H MODELO AP-40  COM MANÔMETRO","UN",205.57666666666668,205.57666666666668,""]
[null,null,"EMPRESA","NOME DA EMPRESA",null,"COTAÇÕES",null,"DATA COTAÇÃO"]
[null,null,"E070 - FOCO R...","FOCO REPRESENTAÇÃO E CONSULTORIA LTDA-ME",null,148.72999999999999,148.72999999999999,"12/02/2019"]
[null,null,"E071 - CASA D...","CASA DAS PEÇAS COM E INDUSTRIA DE FOGOES LTDA",null,198,198,"11/02/2019"]
[null,null,"E072 - AMIG I...","AMIG INSTALAÇÃO DE REDE DE GÁS E INCÊNDIO",null,270,270,"08/02/2019"]
[null,null,"","",null,null,null,""]
[null,null,"","",null,null,null,""]
[null,null,"OBSERVAÇÕES:",""]