{"text_format":"1","workbook":"xlsx","n_sheets":9,"sheets":["Orçamento","Resumo ","Somatório","Cronog_90_Dias","Composição BDI","Relatório CENTRAL","Parc Maior Relev","Composições","Cotações"],"not_rendered":{"charts":0,"images":3,"macros":1,"external_links":0,"defined_names":82,"comments":1,"pivot_tables":0},"unopened":[],"bounds":{"document_bytes":16777216,"sheet_cells":100000,"rows_first":2000,"rows_last":500,"rows_between":2000,"halvings":0,"cell_chars":16384,"cell_head_chars":4096},"cells_cut":0,"cells_raw":0,"read":"whole","date_system":"1900"}

{"sheet":"Orçamento","index":0,"n_rows":598,"n_cols":27,"rows_kept":598,"cut":false,"hidden":false,"merged":[[585,18,585,22],[586,15,586,17],[586,18,586,22],[587,15,587,17],[587,18,587,22],[12,24,12,25],[11,23,11,25],[579,18,579,22],[580,15,580,17],[580,18,580,22],[581,15,581,17],[581,18,581,22],[576,15,576,17],[576,18,576,22],[577,15,577,17],[577,18,577,22],[578,15,578,17],[578,18,578,22],[572,14,572,26],[573,18,573,22],[574,15,574,17],[574,18,574,22],[591,23,591,25],[592,23,592,25],[593,23,593,25],[594,23,594,25],[595,23,595,25],[596,23,596,25],[597,23,597,25],[566,14,566,17],[573,15,573,17],[594,18,594,22],[582,15,582,17],[582,18,582,22],[583,15,583,17],[583,18,583,22],[584,15,584,17],[584,18,584,22],[588,15,588,17],[588,18,588,22],[589,15,589,17],[589,18,589,22],[590,15,590,17],[579,15,579,17],[590,18,590,22],[585,15,585,17],[597,18,597,22],[594,14,594,17],[591,15,591,17],[591,18,591,22],[592,15,592,17],[592,18,592,22],[593,15,593,17],[593,18,593,22],[596,18,596,22],[595,18,595,22],[575,15,575,17],[575,18,575,22],[530,16,530,24],[531,16,531,24],[532,16,532,24],[10,14,10,26],[13,14,13,26],[9,17,9,22],[2,14,2,22],[3,14,3,22],[5,18,5,22],[6,18,6,22],[11,18,11,22],[12,18,12,22],[6,14,6,17],[5,14,5,17],[3,23,3,25],[2,23,2,25],[5,23,5,25],[6,23,6,25],[534,16,534,24],[8,23,8,25],[9,24,9,25],[539,15,539,17],[552,15,552,17],[553,15,553,17],[554,15,554,17],[555,15,555,17],[556,15,556,17],[557,15,557,17],[558,15,558,17],[559,15,559,17],[533,16,533,24],[523,23,523,24],[524,23,524,24],[539,23,539,25],[564,15,564,17],[565,15,565,17],[538,14,538,26],[522,17,527,17],[539,18,539,22],[540,18,540,22],[548,18,548,22],[549,18,549,22],[550,18,550,22],[551,18,551,22],[563,18,563,22],[560,15,560,17],[540,15,540,17],[541,15,541,17],[542,15,542,17],[543,15,543,17],[544,15,544,17],[545,15,545,17],[546,15,546,17],[547,15,547,17],[548,15,548,17],[569,18,569,22],[545,18,545,22],[546,18,546,22],[544,18,544,22],[553,18,553,22],[535,18,535,24],[541,18,541,22],[542,18,542,22],[543,18,543,22],[566,18,566,22],[564,18,564,22],[565,18,565,22],[555,18,555,22],[562,18,562,22],[558,18,558,22],[560,18,560,22],[556,18,556,22],[557,18,557,22],[566,23,566,25],[560,23,560,25],[561,23,561,25],[562,23,562,25],[563,23,563,25],[564,23,564,25],[8,12,9,12],[568,18,568,22],[0,14,0,24],[8,14,8,16],[9,14,9,16],[11,14,11,16],[12,14,12,16],[14,14,14,24],[1,14,1,24],[4,14,4,24],[7,14,7,24],[552,18,552,22],[549,15,549,17],[550,15,550,17],[551,15,551,17],[561,18,561,22],[559,18,559,22],[522,23,522,24],[567,18,567,22],[554,18,554,22],[547,18,547,22],[561,15,561,17],[562,15,562,17],[563,15,563,17],[573,23,573,25],[574,23,574,25],[575,23,575,25],[576,23,576,25],[577,23,577,25],[578,23,578,25],[579,23,579,25],[580,23,580,25],[581,23,581,25],[582,23,582,25],[583,23,583,25],[584,23,584,25],[585,23,585,25],[586,23,586,25],[587,23,587,25],[588,23,588,25],[589,23,589,25],[590,23,590,25],[567,23,567,25],[568,23,568,25],[569,23,569,25],[565,23,565,25],[540,23,540,25],[541,23,541,25],[542,23,542,25],[543,23,543,25],[544,23,544,25],[545,23,545,25],[546,23,546,25],[547,23,547,25],[548,23,548,25],[549,23,549,25],[550,23,550,25],[551,23,551,25],[552,23,552,25],[553,23,553,25],[554,23,554,25],[555,23,555,25],[556,23,556,25],[557,23,557,25],[558,23,558,25],[559,23,559,25]]}
[]
[]
[null,null,null,null,null,null,null,null,null,null,null,null,null,null,"UNIDADE ESCOLAR",null,null,null,null,null,null,null,null,"CÓDIGO INEP"]
[null,null,null,null,null,null,null,null,null,null,null,null,null,null,"CENTRO DE ENSINO EM PERÍODO INTEGRAL POLIVALENTE ANTÔNIO C PANIAGO",null,null,null,null,null,null,null,null,52053385]
[]
["Nmax",null,null,null,null,null,null,null,null,null,null,null,"Ajustar altura?",null,"OBRA",null,null,null,"DATA",null,null,null,null,"CIDADE"]
[{"$f":"MAX($C$18:$C$522)","v":4},null,null,null,null,null,null,null,null,null,null,null,"NÃO",null,"REFORMA E AMPLIAÇÃO",null,null,null,"2020-04-23",null,null,null,null,"MINEIROS"]
[]
[null,null,null,null,null,null,null,null,null,null,null,null,"",null,"CRE",null,null,"ENDEREÇO",null,null,null,null,null,"REFERÊNCIA AGETOP"]
[null,null,null,null,null,null,null,null,null,null,null,null,null,null,"MINEIROS",null,null,"RUA 6 A, MARTINS, CEP:75832-028",null,null,null,null,null,"DEZ/18","ONERADA"]
[]
[null,null,null,null,null,null,null,null,null,null,null,null,null,null,"ÁREA EXISTENTE (M²)",null,null,"ÁREA A CONSTRUIR (M²)","ÁREA TOTAL CONSTRUÍDA (M²)",null,null,null,null,"REFERÊNCIA SINAPI"]
[null,null,null,null,null,null,null,null,null,null,null,null,null,null,3044.01,null,null,398.67,3442.6800000000003,null,null,null,null,"AGO/19","ONERADA"]
[]
[null,null,null,null,null,null,null,null,null,null,null,"FILTRO",null,null,"PLANILHA ORÇAMENTÁRIA"]
["Nível E","Save Nivel","Nível C","Altura","n1","n2","n3","n4","n5","Czero","Cnível","↓","Nível","Nível Corrigido","ITEM","TABELA","CODIGO","DESCRIÇÃO DOS SERVIÇOS","UNID","QUANT","REPET","QUANT TOTAL","MAT","MO","VALOR UNIT","VALOR TOTAL","OBSERVAÇÕES¹"]
[{"$f":"CHOOSE(1+LOG(1+2*(ORÇAMENTO.Nivel=\"Nível 1\")+4*(ORÇAMENTO.Nivel=\"Nível 2\")+8*(ORÇAMENTO.Nivel=\"Nível 3\")+16*(ORÇAMENTO.Nivel=\"Nível 4\")+32*(ORÇAMENTO.Nivel=\"Serviço\"),2),0,1,2,3,4,\"S\")","v":"S"},{"$f":"IF(OR(C17=\"s\",C17=0),OFFSET(B17,-1,0),C17)","v":"Save Nivel"},{"$f":"IF(OFFSET(C17,-1,0)=\"L\",1,IF(OFFSET(C17,-1,0)=1,2,IF(OR(A17=\"s\",A17=0),\"S\",IF(AND(OFFSET(C17,-1,0)=2,A17=4),3,IF(AND(OR(OFFSET(C17,-1,0)=\"s\",OFFSET(C17,-1,0)=0),A17<>\"s\",A17>OFFSET(B17,-1,0)),OFFSET(B17,-1,0),A17)))))","v":"S"},{"$f":"IF(OR(C17=\"S\",C17=0),0,IF(ISERROR(K17),J17,SMALL(J17:K17,1)))","v":0},{"$f":"IF($C17=1,OFFSET(E17,-1,0)+1,OFFSET(E17,-1,0))","v":"n1"},{"$f":"IF($C17=1,0,IF($C17=2,OFFSET(F17,-1,0)+1,OFFSET(F17,-1,0)))","v":"n2"},{"$f":"IF(AND($C17<=2,$C17<>0),0,IF($C17=3,OFFSET(G17,-1,0)+1,OFFSET(G17,-1,0)))","v":"n3"},{"$f":"IF(AND($C17<=3,$C17<>0),0,IF($C17=4,OFFSET(H17,-1,0)+1,OFFSET(H17,-1,0)))","v":"n4"},{"$f":"IF(AND($C17<=4,$C17<>0),0,IF(AND($C17=\"S\",$Y17>0),OFFSET(I17,-1,0)+1,OFFSET(I17,-1,0)))","v":"n5"},{"$f":"IF(OR($C17=\"S\",$C17=0),0,MATCH(0,OFFSET($D17,1,$C17,ROW($C$522)-ROW($C17)),0))","v":0},{"$f":"IF(OR($C17=\"S\",$C17=0),0,MATCH(OFFSET($D17,0,$C17)+1,OFFSET($D17,1,$C17,ROW($C$522)-ROW($C17)),0))","v":0},"","Serviço","Serviço","-","SINAPI",null,"(sem código)","-",null,"REPET","-",0,0,0,"-",""]
[0,null,"L",{"$f":"COUNTA(OFFSET(D18,1,0):D$522)","v":503},{"$f":"LEFT(O19,1)-1","v":0},null,null,null,null,null,null,"F","LOTE","LOTE","REFORMA E AMPLIAÇÃO - CENTRO DE ENSINO EM PERÍODO INTEGRAL POLIVALENTE ANTÔNIO C PANIAGO",null,null,null,null,null,null,null,null,null,null,628742.41999999993]
[1,{"$f":"IF(OR(C19=\"s\",C19=0),OFFSET(B19,-1,0),C19)","v":1},{"$f":"IF(OFFSET(C19,-1,0)=\"L\",1,IF(OFFSET(C19,-1,0)=1,2,IF(OR(A19=\"s\",A19=0),\"S\",IF(AND(OFFSET(C19,-1,0)=2,A19=4),3,IF(AND(OR(OFFSET(C19,-1,0)=\"s\",OFFSET(C19,-1,0)=0),A19<>\"s\",A19>OFFSET(B19,-1,0)),OFFSET(B19,-1,0),A19)))))","v":1},{"$f":"IF(OR(C19=\"S\",C19=0),0,IF(ISERROR(K19),J19,SMALL(J19:K19,1)))","v":223},{"$f":"IF($C19=1,OFFSET(E19,-1,0)+1,OFFSET(E19,-1,0))","v":1},{"$f":"IF($C19=1,0,IF($C19=2,OFFSET(F19,-1,0)+1,OFFSET(F19,-1,0)))","v":0},{"$f":"IF(AND($C19<=2,$C19<>0),0,IF($C19=3,OFFSET(G19,-1,0)+1,OFFSET(G19,-1,0)))","v":0},{"$f":"IF(AND($C19<=3,$C19<>0),0,IF($C19=4,OFFSET(H19,-1,0)+1,OFFSET(H19,-1,0)))","v":0},0,{"$f":"IF(OR($C19=\"S\",$C19=0),0,MATCH(0,OFFSET($D19,1,$C19,ROW($C$522)-ROW($C19)),0))","v":503},{"$f":"IF(OR($C19=\"S\",$C19=0),0,MATCH(OFFSET($D19,0,$C19)+1,OFFSET($D19,1,$C19,ROW($C$522)-ROW($C19)),0))","v":223},"F","Nível 1","Nível 1","1.","AGETOP",null,"REFORMA","UN",1,1]
[2,2,{"$f":"IF(OFFSET(C20,-1,0)=\"L\",1,IF(OFFSET(C20,-1,0)=1,2,IF(OR(A20=\"s\",A20=0),\"S\",IF(AND(OFFSET(C20,-1,0)=2,A20=4),3,IF(AND(OR(OFFSET(C20,-1,0)=\"s\",OFFSET(C20,-1,0)=0),A20<>\"s\",A20>OFFSET(B20,-1,0)),OFFSET(B20,-1,0),A20)))))","v":2},11,{"$f":"IF($C20=1,OFFSET(E20,-1,0)+1,OFFSET(E20,-1,0))","v":1},{"$f":"IF($C20=1,0,IF($C20=2,OFFSET(F20,-1,0)+1,OFFSET(F20,-1,0)))","v":1},{"$f":"IF(AND($C20<=2,$C20<>0),0,IF($C20=3,OFFSET(G20,-1,0)+1,OFFSET(G20,-1,0)))","v":0},{"$f":"IF(AND($C20<=3,$C20<>0),0,IF($C20=4,OFFSET(H20,-1,0)+1,OFFSET(H20,-1,0)))","v":0},0,222,11,"F","Nível 2","Nível 2","1.1.","SINAPI",null,"SERVIÇOS PRELIMINARES","-",null,1,null,null,null,null,null,""]
["S",2,"S",0,1,1,0,0,0,0,0,"F","Serviço","Serviço","1.1.0.0.1.","SINAPI",97640,"REMOÇÃO DE FORROS DE DRYWALL, PVC E FIBROMINERAL, DE FORMA MANUAL, SEM REAPROVEITAMENTO. AF_12/2017","M2",2240,1,null,null,null,null,null,""]
["S",2,"S",0,1,1,0,0,0,0,0,"F","Serviço","Serviço","1.1.0.0.2.","SINAPI",97642,"REMOÇÃO DE TRAMA METÁLICA OU DE MADEIRA PARA FORRO, DE FORMA MANUAL, SEM REAPROVEITAMENTO. AF_12/2017","M2",2240,1,null,null,null,null,null,""]
["S",2,"S",0,1,1,0,0,0,0,0,"F","Serviço","Serviço","1.1.0.0.3.","SINAPI",97644,"REMOÇÃO DE PORTAS, DE FORMA MANUAL, SEM REAPROVEITAMENTO. AF_12/2017","M2",19.350000000000001,1,null,null,null,null,null,"Referência: AGETOP - 20106"]
["S",2,"S",0,1,1,0,0,0,0,0,"F","Serviço","Serviço","1.1.0.0.4.","AGETOP",20112,"DEM.PISO CERAM. INCLUS. RETIRADA DE CONTRAPISO SOBRE LASTRO CONC.C/TR.CB.E CARGA","m2    ",63.6,1,null,null,null,null,null,""]
["S",2,"S",0,1,1,0,0,0,0,0,"F","Serviço","Serviço","1.1.0.0.5.","AGETOP",20121,"DEM. MANUAL EM CONCR.SIMPLES C/TR.ATE CB.E CARGA (O.C.)","m3    ",5.85,1,null,null,null,null,null,""]
["S",2,"S",0,1,1,0,0,0,0,0,"F","Serviço","Serviço","1.1.0.0.6.","SINAPI",97633,"DEMOLIÇÃO DE REVESTIMENTO CERÂMICO, DE FORMA MANUAL, SEM REAPROVEITAMENTO. AF_12/2017","M2",154.19999999999999,1,null,null,null,null,null,"Referência: AGETOP - 20115"]
["S",2,"S",0,1,1,0,0,0,0,0,"F","Serviço","Serviço","1.1.0.0.7.","SINAPI",97622,"DEMOLIÇÃO DE ALVENARIA DE BLOCO FURADO, DE FORMA MANUAL, SEM REAPROVEITAMENTO. AF_12/2017","M3",9.08,1,null,null,null,null,null,"Referência: AGETOP - 20118"]
["S",2,"S",0,1,1,0,0,0,0,0,"F","Serviço","Serviço","1.1.0.0.8.","AGETOP",20139,"DEMOLIÇAO DE BANCADAS C/ TRANSP. ATÉ CB. E CARGA","m2    ",5.7,1,null,null,null,null,null,""]
["S",2,"S",0,1,1,0,0,0,{"$f":"IF(OR($C29=\"S\",$C29=0),0,MATCH(0,OFFSET($D29,1,$C29,ROW($C$522)-ROW($C29)),0))","v":0},{"$f":"IF(OR($C29=\"S\",$C29=0),0,MATCH(OFFSET($D29,0,$C29)+1,OFFSET($D29,1,$C29,ROW($C$522)-ROW($C29)),0))","v":0},"F","Serviço","Serviço","1.1.0.0.9.","AGETOP",20163,"DEMOLIÇÃO DAS INSTALAÇÕES HIDROSANITÁRIAS E AFINS C/ TRANSP. ATÉ CB. E CARGA","H     ",8,1,null,null,null,null,null,""]
["S",2,"S",0,1,1,0,0,0,0,0,"F","Serviço","Serviço","1.1.0.0.10.","SINAPI","74209/1","PLACA DE OBRA EM CHAPA DE ACO GALVANIZADO","M2",7.5,1,null,null,null,null,null,"Referência: AGETOP - 21301"]
[2,2,2,3,1,2,0,0,0,211,3,"F","Nível 2","Nível 2","1.2.","AGETOP",null,"TRANSPORTES","-",null,1,null,null,null,null,null,""]
["S",2,"S",0,1,2,0,0,0,0,0,"F","Serviço","Serviço","1.2.0.0.1.","SINAPI",72900,"TRANSPORTE DE ENTULHO COM CAMINHAO BASCULANTE 6 M3, RODOVIA PAVIMENTADA, DMT 0,5 A 1,0 KM","M3",27.906900000000004,1,null,null,null,null,null,""]
["S",2,"S",0,1,2,0,0,0,0,0,"F","Serviço","Serviço","1.2.0.0.2.","SINAPI",72897,"CARGA MANUAL DE ENTULHO EM CAMINHAO BASCULANTE 6 M3","M3",27.906900000000004,1,null,null,null,null,null,""]
[2,2,2,49,1,3,0,0,0,208,49,"F","Nível 2","Nível 2","1.3.",null,null,"INSTALAÇÕES ELÉTRICAS","-",null,1,null,null,null,null,null,""]
[3,3,3,32,1,3,1,0,0,48,32,"F","Nível 3","Nível 3","1.3.1.","SINAPI",null,"INST. ELÉTRICAS","-",null,1,null,null,null,null,null,""]
["S",3,"S",0,1,3,1,0,0,0,0,"F","Serviço","Serviço","1.3.1.0.1.","SINAPI",93654,"DISJUNTOR MONOPOLAR TIPO DIN, CORRENTE NOMINAL DE 16A - FORNECIMENTO E INSTALAÇÃO. AF_04/2016","UN",2,1,null,null,null,null,null,""]
["S",3,"S",0,1,3,1,0,0,0,0,"F","Serviço","Serviço","1.3.1.0.2.","SINAPI",93653,"DISJUNTOR MONOPOLAR TIPO DIN, CORRENTE NOMINAL DE 10A - FORNECIMENTO E INSTALAÇÃO. AF_04/2016","UN",2,1,null,null,null,null,null,""]
["S",3,"S",0,1,3,1,0,0,0,0,"F","Serviço","Serviço","1.3.1.0.3.","SINAPI",93656,"DISJUNTOR MONOPOLAR TIPO DIN, CORRENTE NOMINAL DE 25A - FORNECIMENTO E INSTALAÇÃO. AF_04/2016","UN",6,1,null,null,null,null,null,""]
["S",3,"S",0,1,3,1,0,0,0,0,"F","Serviço","Serviço","1.3.1.0.4.","SINAPI",91926,"CABO DE COBRE FLEXÍVEL ISOLADO, 2,5 MM², ANTI-CHAMA 450/750 V, PARA CIRCUITOS TERMINAIS - FORNECIMENTO E INSTALAÇÃO. AF_12/2015","M",750,1,null,null,null,null,null,"Referência: AGETOP - 70563"]
["S",3,"S",0,1,3,1,0,0,0,0,"F","Serviço","Serviço","1.3.1.0.5.","SINAPI",91928,"CABO DE COBRE FLEXÍVEL ISOLADO, 4 MM², ANTI-CHAMA 450/750 V, PARA CIRCUITOS TERMINAIS - FORNECIMENTO E INSTALAÇÃO. AF_12/2015","M",1386.36,1,null,null,null,null,null,"Referência: AGETOP - 70564"]
["S",3,"S",0,1,3,1,0,0,0,0,"F","Serviço","Serviço","1.3.1.0.6.","SINAPI",91867,"ELETRODUTO RÍGIDO ROSCÁVEL, PVC, DN 25 MM (3/4\"), PARA CIRCUITOS TERMINAIS, INSTALADO EM LAJE - FORNECIMENTO E INSTALAÇÃO. AF_12/2015","M",42,1,null,null,null,null,null,"Referência: AGETOP - 71201"]
["S",3,"S",0,1,3,1,0,0,0,0,"F","Serviço","Serviço","1.3.1.0.7.","SINAPI",91834,"ELETRODUTO FLEXÍVEL CORRUGADO, PVC, DN 25 MM (3/4\"), PARA CIRCUITOS TERMINAIS, INSTALADO EM FORRO - FORNECIMENTO E INSTALAÇÃO. AF_12/2015","M",275,1,null,null,null,null,null,"Referência: AGETOP - 71194"]
["S",3,"S",0,1,3,1,0,0,0,0,"F","Serviço","Serviço","1.3.1.0.8.","SINAPI",91836,"ELETRODUTO FLEXÍVEL CORRUGADO, PVC, DN 32 MM (1\"), PARA CIRCUITOS TERMINAIS, INSTALADO EM FORRO - FORNECIMENTO E INSTALAÇÃO. AF_12/2015","M",56,1,null,null,null,null,null,"Referência: AGETOP - 71195"]
["S",3,"S",0,1,3,1,0,0,0,0,"F","Serviço","Serviço","1.3.1.0.9.","AGETOP",71197,"ELETRODUTO PVC FLEXÍVEL - MANGUEIRA CORRUGADA REFORÇADA - DIAM. 50MM","M     ",9,1,null,null,null,null,null,""]
["S",3,"S",0,1,3,1,0,0,0,0,"F","Serviço","Serviço","1.3.1.0.10.","AGETOP",70351,"BRACADEIRA METALICA TIPO \"U\" DIAM. 3/4\"","Un    ",14,1,null,null,null,null,null,""]
["S",3,"S",0,1,3,1,0,0,0,0,"F","Serviço","Serviço","1.3.1.0.11.","AGETOP",70352,"BRACADEIRA METALICA TIPO \"U\" DIAM. 1\"","Un    ",3,1,null,null,null,null,null,""]
["S",3,"S",0,1,3,1,0,0,0,0,"F","Serviço","Serviço","1.3.1.0.12.","SINAPI",91879,"LUVA PARA ELETRODUTO, PVC, ROSCÁVEL, DN 25 MM (3/4\"), PARA CIRCUITOS TERMINAIS, INSTALADA EM LAJE - FORNECIMENTO E INSTALAÇÃO. AF_12/2015","UN",14,1,null,null,null,null,null,"Referência: AGETOP - 71741"]
["S",3,"S",0,1,3,1,0,0,0,0,"F","Serviço","Serviço","1.3.1.0.13.","SINAPI",91880,"LUVA PARA ELETRODUTO, PVC, ROSCÁVEL, DN 32 MM (1\"), PARA CIRCUITOS TERMINAIS, INSTALADA EM LAJE - FORNECIMENTO E INSTALAÇÃO. AF_12/2015","UN",3,1,null,null,null,null,null,"Referência: AGETOP - 71742"]
["S",3,"S",0,1,3,1,0,0,0,0,"F","Serviço","Serviço","1.3.1.0.14.","SINAPI",91939,"CAIXA RETANGULAR 4\" X 2\" ALTA (2,00 M DO PISO), PVC, INSTALADA EM PAREDE - FORNECIMENTO E INSTALAÇÃO. AF_12/2015","UN",20,1,null,null,null,null,null,""]
["S",3,"S",0,1,3,1,0,0,0,0,"F","Serviço","Serviço","1.3.1.0.15.","SINAPI",95777,"CONDULETE DE ALUMÍNIO, TIPO B, PARA ELETRODUTO DE AÇO GALVANIZADO DN 20 MM (3/4''), APARENTE - FORNECIMENTO E INSTALAÇÃO. AF_11/2016_P","UN",13,1,null,null,null,null,null,""]
["S",3,"S",0,1,3,1,0,0,0,0,"F","Serviço","Serviço","1.3.1.0.16.","SINAPI",95778,"CONDULETE DE ALUMÍNIO, TIPO C, PARA ELETRODUTO DE AÇO GALVANIZADO DN 20 MM (3/4''), APARENTE - FORNECIMENTO E INSTALAÇÃO. AF_11/2016_P","UN",7,1,null,null,null,null,null,""]
["S",3,"S",0,1,3,1,0,0,0,0,"F","Serviço","Serviço","1.3.1.0.17.","SINAPI",95795,"CONDULETE DE ALUMÍNIO, TIPO T, PARA ELETRODUTO DE AÇO GALVANIZADO DN 20 MM (3/4''), APARENTE - FORNECIMENTO E INSTALAÇÃO. AF_11/2016_P","UN",6,1,null,null,null,null,null,""]
["S",3,"S",0,1,3,1,0,0,0,0,"F","Serviço","Serviço","1.3.1.0.18.","SINAPI",95787,"CONDULETE DE ALUMÍNIO, TIPO LR, PARA ELETRODUTO DE AÇO GALVANIZADO DN 20 MM (3/4''), APARENTE - FORNECIMENTO E INSTALAÇÃO. AF_11/2016_P","UN",5,1,null,null,null,null,null,""]
["S",3,"S",0,1,3,1,0,0,0,0,"F","Serviço","Serviço","1.3.1.0.19.","AGETOP",72395,"TAMPA CEGA PARA CONDULETE METÁLICO","Un    ",31,1,null,null,null,null,null,""]
["S",3,"S",0,1,3,1,0,0,0,0,"F","Serviço","Serviço","1.3.1.0.20.","SINAPI",91993,"TOMADA ALTA DE EMBUTIR (1 MÓDULO), 2P+T 20 A, INCLUINDO SUPORTE E PLACA - FORNECIMENTO E INSTALAÇÃO. AF_12/2015","UN",2,1,null,null,null,null,null,"Referência: AGETOP - 72585"]
["S",3,"S",0,1,3,1,0,0,0,0,"F","Serviço","Serviço","1.3.1.0.21.","SINAPI",91996,"TOMADA MÉDIA DE EMBUTIR (1 MÓDULO), 2P+T 10 A, INCLUINDO SUPORTE E PLACA - FORNECIMENTO E INSTALAÇÃO. AF_12/2015","UN",10,1,null,null,null,null,null,"Referência: AGETOP - 72578"]
["S",3,"S",0,1,3,1,0,0,0,0,"F","Serviço","Serviço","1.3.1.0.22.","SINAPI",92004,"TOMADA MÉDIA DE EMBUTIR (2 MÓDULOS), 2P+T 10 A, INCLUINDO SUPORTE E PLACA - FORNECIMENTO E INSTALAÇÃO. AF_12/2015","UN",1,1,null,null,null,null,null,"Referência: AGETOP - 72578"]
["S",3,"S",0,1,3,1,0,0,0,0,"F","Serviço","Serviço","1.3.1.0.23.","SINAPI",92004,"TOMADA MÉDIA DE EMBUTIR (2 MÓDULOS), 2P+T 10 A, INCLUINDO SUPORTE E PLACA - FORNECIMENTO E INSTALAÇÃO. AF_12/2015","UN",7,1,null,null,null,null,null,"Referência: AGETOP - 72578"]
["S",3,"S",0,1,3,1,0,0,0,0,"F","Serviço","Serviço","1.3.1.0.24.","SINAPI",97585,"LUMINÁRIA TIPO CALHA, DE SOBREPOR, COM 2 LÂMPADAS TUBULARES DE 18 W - FORNECIMENTO E INSTALAÇÃO. AF_11/2017","UN",11,1,null,null,null,null,null,""]
["S",3,"S",0,1,3,1,0,0,0,0,"F","Serviço","Serviço","1.3.1.0.25.","SINAPI",97593,"LUMINÁRIA TIPO SPOT, DE SOBREPOR, COM 1 LÂMPADA DE 15 W - FORNECIMENTO E INSTALAÇÃO. AF_11/2017","UN",1,1,null,null,null,null,null,"Referência: AGETOP - 71688"]
["S",3,"S",0,1,3,1,0,0,0,0,"F","Serviço","Serviço","1.3.1.0.26.","SINAPI",97610,"LÂMPADA COMPACTA DE LED 10 W, BASE E27 - FORNECIMENTO E INSTALAÇÃO. AF_11/2017","UN",1,1,null,null,null,null,null,""]
["S",3,"S",0,1,3,1,0,0,0,0,"F","Serviço","Serviço","1.3.1.0.27.","SINAPI",91953,"INTERRUPTOR SIMPLES (1 MÓDULO), 10A/250V, INCLUINDO SUPORTE E PLACA - FORNECIMENTO E INSTALAÇÃO. AF_12/2015","UN",2,1,null,null,null,null,null,"Referência: AGETOP - 71440"]
["S",3,"S",0,1,3,1,0,0,0,0,"F","Serviço","Serviço","1.3.1.0.28.","SINAPI",91959,"INTERRUPTOR SIMPLES (2 MÓDULOS), 10A/250V, INCLUINDO SUPORTE E PLACA - FORNECIMENTO E INSTALAÇÃO. AF_12/2015","UN",1,1,null,null,null,null,null,"Referência: AGETOP - 71441"]
["S",3,"S",0,1,3,1,0,0,0,0,"F","Serviço","Serviço","1.3.1.0.29.","AGETOP",71861,"PARAFUSO P/BUCHA S-6","Un    ",100,1,null,null,null,null,null,""]
["S",3,"S",0,1,3,1,0,0,0,0,"F","Serviço","Serviço","1.3.1.0.30.","AGETOP",70391,"BUCHA DE NYLON S-6","Un    ",100,1,null,null,null,null,null,""]
["S",3,"S",0,1,3,1,0,0,0,0,"F","Serviço","Serviço","1.3.1.0.31.","AGETOP",20162,"DEMOLIÇÃO DAS INSTALAÇÕES ELÉTRICAS E AFINS C/ TRANSP. ATÉ CB. E CARGA","H     ",40,1,null,null,null,null,null,""]
[3,3,3,16,1,3,2,0,0,16,50,"F","Nível 3","Nível 3","1.3.2.",null,null,"IMPLANTAÇÃO","-",null,1,null,null,null,null,null,""]
["S",3,"S",0,1,3,2,0,0,0,0,"F","Serviço","Serviço","1.3.2.0.1.","SINAPI",93671,"DISJUNTOR TRIPOLAR TIPO DIN, CORRENTE NOMINAL DE 32A - FORNECIMENTO E INSTALAÇÃO. AF_04/2016","UN",1,1,null,null,null,null,null,"Referência: AGETOP - 71173"]
["S",3,"S",0,1,3,2,0,0,0,0,"F","Serviço","Serviço","1.3.2.0.2.","AGETOP",71175,"DISJUNTOR TRIPOLAR DE 60 A 100-A","Un    ",1,1,null,null,null,null,null,""]
["S",3,"S",0,1,3,2,0,0,0,0,"F","Serviço","Serviço","1.3.2.0.3.","SINAPI",91930,"CABO DE COBRE FLEXÍVEL ISOLADO, 6 MM², ANTI-CHAMA 450/750 V, PARA CIRCUITOS TERMINAIS - FORNECIMENTO E INSTALAÇÃO. AF_12/2015","M",230,1,null,null,null,null,null,"Referência: AGETOP - 70565"]
["S",3,"S",0,1,3,2,0,0,0,0,"F","Serviço","Serviço","1.3.2.0.4.","SINAPI",92985,"CABO DE COBRE FLEXÍVEL ISOLADO, 35 MM², ANTI-CHAMA 450/750 V, PARA DISTRIBUIÇÃO - FORNECIMENTO E INSTALAÇÃO. AF_12/2015","M",276,1,null,null,null,null,null,""]
["S",3,"S",0,1,3,2,0,0,0,0,"F","Serviço","Serviço","1.3.2.0.5.","SINAPI",92983,"CABO DE COBRE FLEXÍVEL ISOLADO, 25 MM², ANTI-CHAMA 450/750 V, PARA DISTRIBUIÇÃO - FORNECIMENTO E INSTALAÇÃO. AF_12/2015","M",69,1,null,null,null,null,null,""]
["S",3,"S",0,1,3,2,0,0,0,0,"F","Serviço","Serviço","1.3.2.0.6.","SINAPI",91872,"ELETRODUTO RÍGIDO ROSCÁVEL, PVC, DN 32 MM (1\"), PARA CIRCUITOS TERMINAIS, INSTALADO EM PAREDE - FORNECIMENTO E INSTALAÇÃO. AF_12/2015","M",46,1,null,null,null,null,null,"Referência: AGETOP - 71202"]
["S",3,"S",0,1,3,2,0,0,0,0,"F","Serviço","Serviço","1.3.2.0.7.","SINAPI",93009,"ELETRODUTO RÍGIDO ROSCÁVEL, PVC, DN 60 MM (2\") - FORNECIMENTO E INSTALAÇÃO. AF_12/2015","M",69,1,null,null,null,null,null,""]
["S",3,"S",0,1,3,2,0,0,0,0,"F","Serviço","Serviço","1.3.2.0.8.","AGETOP",70352,"BRACADEIRA METALICA TIPO \"U\" DIAM. 1\"","Un    ",16,1,null,null,null,null,null,""]
["S",3,"S",0,1,3,2,0,0,0,0,"F","Serviço","Serviço","1.3.2.0.9.","AGETOP",70355,"BRACADEIRA METALICA TIPO \"U\" DIAM. 2\"","Un    ",23,1,null,null,null,null,null,""]
["S",3,"S",0,1,3,2,0,0,0,0,"F","Serviço","Serviço","1.3.2.0.10.","SINAPI",91880,"LUVA PARA ELETRODUTO, PVC, ROSCÁVEL, DN 32 MM (1\"), PARA CIRCUITOS TERMINAIS, INSTALADA EM LAJE - FORNECIMENTO E INSTALAÇÃO. AF_12/2015","UN",16,1,null,null,null,null,null,"Referência: AGETOP - 71742"]
["S",3,"S",0,1,3,2,0,0,0,0,"F","Serviço","Serviço","1.3.2.0.11.","SINAPI",93014,"LUVA PARA ELETRODUTO, PVC, ROSCÁVEL, DN 60 MM (2\") - FORNECIMENTO E INSTALAÇÃO. AF_12/2015","UN",23,1,null,null,null,null,null,"Referência: AGETOP - 71745"]
["S",3,"S",0,1,3,2,0,0,0,0,"F","Serviço","Serviço","1.3.2.0.12.","SINAPI",97889,"CAIXA ENTERRADA ELÉTRICA RETANGULAR, EM ALVENARIA COM TIJOLOS CERÂMICOS MACIÇOS, FUNDO COM BRITA, DIMENSÕES INTERNAS: 0,8X0,8X0,6 M. AF_05/2018","UN",1,1,null,null,null,null,null,""]
["S",3,"S",0,1,3,2,0,0,0,0,"F","Serviço","Serviço","1.3.2.0.13.","SINAPI",6171,"TAMPA DE CONCRETO ARMADO 60X60X5CM PARA CAIXA","UN",1,1,null,null,null,null,null,""]
["S",3,"S",0,1,3,2,0,0,0,0,"F","Serviço","Serviço","1.3.2.0.14.","AGETOP",71861,"PARAFUSO P/BUCHA S-6","Un    ",100,1,null,null,null,null,null,""]
["S",3,"S",0,1,3,2,0,0,0,0,"F","Serviço","Serviço","1.3.2.0.15.","AGETOP",70391,"BUCHA DE NYLON S-6","Un    ",100,1,null,null,null,null,null,""]
[2,2,2,89,1,4,0,0,0,159,89,"F","Nível 2","Nível 2","1.4.","AGETOP",null,"INSTALAÇÕES HIDROSSANITÁRIAS","-",null,1,null,null,null,null,null,""]
[3,3,3,9,1,4,1,0,0,{"$f":"IF(OR($C84=\"S\",$C84=0),0,MATCH(0,OFFSET($D84,1,$C84,ROW($C$522)-ROW($C84)),0))","v":88},{"$f":"IF(OR($C84=\"S\",$C84=0),0,MATCH(OFFSET($D84,0,$C84)+1,OFFSET($D84,1,$C84,ROW($C$522)-ROW($C84)),0))","v":9},"F","Nível 3","Nível 3","1.4.1.","SINAPI",null,"PEÇAS E ACESSÓRIOS","-",null,1,null,null,null,null,null,""]
[4,4,4,6,1,4,1,1,0,8,6,"F","Nível 4","Nível 4","1.4.1.1.","SINAPI",null,"PIA / ACESSÓRIOS","-",null,1,null,null,null,null,null,""]
["S",4,"S",0,1,4,1,1,0,0,0,"F","Serviço","Serviço","1.4.1.1.1.","AGETOP",80660,"TORNEIRA DE PAREDE PARA PIA OU BEBEDOURO DIÂMETRO DE 1/2\" E 3/4\" ","Un    ",5,1,null,null,null,null,null,""]
["S",4,"S",0,1,4,1,1,0,0,0,"F","Serviço","Serviço","1.4.1.1.2.","AGETOP",80671,"SIFAO PVC P/PIA 1.1/2\" X 2\"","Un    ",5,1,null,null,null,null,null,""]
["S",4,"S",0,1,4,1,1,0,0,0,"F","Serviço","Serviço","1.4.1.1.3.","AGETOP",80680,"VALVULA P/PIA TIPO AMERICANA DIAM.3.1/2\" (METAL)","Un    ",5,1,null,null,null,null,null,""]
["S",4,"S",0,1,4,1,1,0,0,0,"F","Serviço","Serviço","1.4.1.1.4.","AGETOP",80686,"CUBA INOX 56X34X17CM E=0,6MM-AÇO 304 (CUBA Nº2)","Un    ",3,1,null,null,null,null,null,""]
["S",4,"S",0,1,4,1,1,0,0,0,"F","Serviço","Serviço","1.4.1.1.5.","AGETOP",80693,"TANQUE (PANELAO) INOX 60 X 70 X 40 CM CH.18","Un    ",2,1,null,null,null,null,null,""]
[4,4,4,2,1,4,1,2,0,2,10,"F","Nível 4","Nível 4","1.4.1.2.","SINAPI",null,"REGISTROS","-",null,1,null,null,null,null,null,""]
["S",4,"S",0,1,4,1,2,0,0,0,"F","Serviço","Serviço","1.4.1.2.1.","AGETOP",80902,"REGISTRO DE GAVETA BRUTO DIAMETRO 3/4\"","Un    ",1,1,null,null,null,null,null,""]
[3,3,3,24,1,4,2,0,0,79,24,"F","Nível 3","Nível 3","1.4.2.","SINAPI",null,"ÁGUA FRIA","-",null,1,null,null,null,null,null,""]
[4,4,4,5,1,4,2,1,0,23,5,"F","Nível 4","Nível 4","1.4.2.1.","SINAPI",null,"TUBOS DE PVC SOLDÁVEL","-",null,1,null,null,null,null,null,""]
["S",4,"S",0,1,4,2,1,0,0,0,"F","Serviço","Serviço","1.4.2.1.1.","SINAPI",89402,"TUBO, PVC, SOLDÁVEL, DN 25MM, INSTALADO EM RAMAL DE DISTRIBUIÇÃO DE ÁGUA - FORNECIMENTO E INSTALAÇÃO. AF_12/2014","M",15,1,null,null,null,null,null,"Referência: AGETOP - 81003"]
["S",4,"S",0,1,4,2,1,0,0,0,"F","Serviço","Serviço","1.4.2.1.2.","SINAPI",89447,"TUBO, PVC, SOLDÁVEL, DN 32MM, INSTALADO EM PRUMADA DE ÁGUA - FORNECIMENTO E INSTALAÇÃO. AF_12/2014","M",25,1,null,null,null,null,null,""]
["S",4,"S",0,1,4,2,1,0,0,0,"F","Serviço","Serviço","1.4.2.1.3.","SINAPI",89449,"TUBO, PVC, SOLDÁVEL, DN 50MM, INSTALADO EM PRUMADA DE ÁGUA - FORNECIMENTO E INSTALAÇÃO. AF_12/2014","M",25,1,null,null,null,null,null,""]
["S",4,"S",0,1,4,2,1,0,0,0,"F","Serviço","Serviço","1.4.2.1.4.","SINAPI",89450,"TUBO, PVC, SOLDÁVEL, DN 60MM, INSTALADO EM PRUMADA DE ÁGUA - FORNECIMENTO E INSTALAÇÃO. AF_12/2014","M",28,1,null,null,null,null,null,""]
[4,4,4,2,1,4,2,2,0,18,2,"F","Nível 4","Nível 4","1.4.2.2.","SINAPI",null,"ADAPTADORES DE PVC SOLDÁVEL","-",null,1,null,null,null,null,null,""]
["S",4,"S",0,1,4,2,2,0,0,0,"F","Serviço","Serviço","1.4.2.2.1.","SINAPI",89538,"ADAPTADOR CURTO COM BOLSA E ROSCA PARA REGISTRO, PVC, SOLDÁVEL, DN 25MM X 3/4\u0094, INSTALADO EM PRUMADA DE ÁGUA - FORNECIMENTO E INSTALAÇÃO. AF_12/2014","UN",2,1,null,null,null,null,null,""]
[4,4,4,2,1,4,2,3,0,16,2,"F","Nível 4","Nível 4","1.4.2.3.","SINAPI",null,"BUCHAS","-",null,1,null,null,null,null,null,""]
["S",4,"S",0,1,4,2,3,0,0,0,"F","Serviço","Serviço","1.4.2.3.1.","AGETOP",81165,"BUCHA DE REDUCAO SOLD. CURTA 60 X 50 mm","Un    ",1,1,null,null,null,null,null,""]
[4,4,4,6,1,4,2,4,0,14,6,"F","Nível 4","Nível 4","1.4.2.4.","SINAPI",null,"JOELHO","-",null,1,null,null,null,null,null,""]
["S",4,"S",0,1,4,2,4,0,0,0,"F","Serviço","Serviço","1.4.2.4.1.","SINAPI",89481,"JOELHO 90 GRAUS, PVC, SOLDÁVEL, DN 25MM, INSTALADO EM PRUMADA DE ÁGUA - FORNECIMENTO E INSTALAÇÃO. AF_12/2014","UN",1,1,null,null,null,null,null,""]
["S",4,"S",0,1,4,2,4,0,0,0,"F","Serviço","Serviço","1.4.2.4.2.","SINAPI",89413,"JOELHO 90 GRAUS, PVC, SOLDÁVEL, DN 32MM, INSTALADO EM RAMAL DE DISTRIBUIÇÃO DE ÁGUA - FORNECIMENTO E INSTALAÇÃO. AF_12/2014","UN",3,1,null,null,null,null,null,"Referência: AGETOP - 81322"]
["S",4,"S",0,1,4,2,4,0,0,0,"F","Serviço","Serviço","1.4.2.4.3.","SINAPI",89501,"JOELHO 90 GRAUS, PVC, SOLDÁVEL, DN 50MM, INSTALADO EM PRUMADA DE ÁGUA - FORNECIMENTO E INSTALAÇÃO. AF_12/2014","UN",1,1,null,null,null,null,null,""]
["S",4,"S",0,1,4,2,4,0,0,0,"F","Serviço","Serviço","1.4.2.4.4.","SINAPI",89505,"JOELHO 90 GRAUS, PVC, SOLDÁVEL, DN 60MM, INSTALADO EM PRUMADA DE ÁGUA - FORNECIMENTO E INSTALAÇÃO. AF_12/2014","UN",3,1,null,null,null,null,null,"Referência: AGETOP - 81325"]
["S",4,"S",0,1,4,2,4,0,0,0,"F","Serviço","Serviço","1.4.2.4.5.","AGETOP",81369,"JOELHO 90 GRAUS SOLD. C/BUCHA LATAO 25 X 3/4\"","Un    ",2,1,null,null,null,null,null,""]
[4,4,4,5,1,4,2,5,0,8,5,"F","Nível 4","Nível 4","1.4.2.5.","SINAPI",null,"TÊ","-",null,1,null,null,null,null,null,""]
["S",4,"S",0,1,4,2,5,0,0,0,"F","Serviço","Serviço","1.4.2.5.1.","SINAPI",89617,"TE, PVC, SOLDÁVEL, DN 25MM, INSTALADO EM PRUMADA DE ÁGUA - FORNECIMENTO E INSTALAÇÃO. AF_12/2014","UN",1,1,null,null,null,null,null,""]
["S",4,"S",0,1,4,2,5,0,0,0,"F","Serviço","Serviço","1.4.2.5.2.","AGETOP",81444,"TE 90 GR.SOLD.C/BUC.LATAO NA BOLSA CENT.25X25X3/4\"","Un    ",3,1,null,null,null,null,null,""]
["S",4,"S",0,1,4,2,5,0,0,0,"F","Serviço","Serviço","1.4.2.5.3.","AGETOP",81425,"TE REDUCAO 90 GRAUS SOLDAVEL 50 X 32 mm","Un    ",1,1,null,null,null,null,null,""]
["S",4,"S",0,1,4,2,5,0,0,0,"F","Serviço","Serviço","1.4.2.5.4.","AGETOP",81406,"TE 90 GRAUS SOLDAVEL DIMETRO 60 mm","Un    ",1,1,null,null,null,null,null,""]
[4,4,4,3,1,4,2,6,0,3,{"$error":"#N/A"},"F","Nível 4","Nível 4","1.4.2.6.","SINAPI",null,"ADESIVOS","-",null,1,null,null,null,null,null,""]
["S",4,"S",0,1,4,2,6,0,0,0,"F","Serviço","Serviço","1.4.2.6.1.","AGETOP",81501,"ADESIVO PLASTICO - FRASCO 850 G","Un    ",1,1,null,null,null,null,null,""]
["S",4,"S",0,1,4,2,6,0,0,0,"F","Serviço","Serviço","1.4.2.6.2.","AGETOP",81504,"SOLUCAO LIMPADORA 1000 CM3","Un    ",1,1,null,null,null,null,null,""]
[3,3,3,10,1,4,3,0,0,55,10,"F","Nível 3","Nível 3","1.4.3.","SINAPI",null,"ESGOTO SANITÁRIO","-",null,1,null,null,null,null,null,""]
[4,4,4,2,1,4,3,1,0,9,2,"F","Nível 4","Nível 4","1.4.3.1.","SINAPI",null,"CURVAS","-",null,1,null,null,null,null,null,""]
["S",4,"S",0,1,4,3,1,0,0,0,"F","Serviço","Serviço","1.4.3.1.1.","AGETOP",81550,"CURVA 45º DIAMETRO 50 MM","Un    ",2,1,null,null,null,null,null,""]
[4,4,4,2,1,4,3,2,0,7,2,"F","Nível 4","Nível 4","1.4.3.2.","SINAPI",null,"JODELHOS","-",null,1,null,null,null,null,null,""]
["S",4,"S",0,1,4,3,2,0,0,0,"F","Serviço","Serviço","1.4.3.2.1.","SINAPI",89731,"JOELHO 90 GRAUS, PVC, SERIE NORMAL, ESGOTO PREDIAL, DN 50 MM, JUNTA ELÁSTICA, FORNECIDO E INSTALADO EM RAMAL DE DESCARGA OU RAMAL DE ESGOTO SANITÁRIO. AF_12/2014","UN",10,1,null,null,null,null,null,""]
[4,4,4,2,1,4,3,3,0,5,2,"F","Nível 4","Nível 4","1.4.3.3.","SINAPI",null,"JUNÇÕES","-",null,1,null,null,null,null,null,""]
["S",4,"S",0,1,4,3,3,0,0,0,"F","Serviço","Serviço","1.4.3.3.1.","AGETOP",81970,"JUNCAO SIMPLES DIAMETRO 50 X 50 MM","Un    ",1,1,null,null,null,null,null,""]
[4,4,4,3,1,4,3,4,0,3,{"$error":"#N/A"},"F","Nível 4","Nível 4","1.4.3.4.","SINAPI",null,"TUBOS","-",null,1,null,null,null,null,null,""]
["S",4,"S",0,1,4,3,4,0,0,0,"F","Serviço","Serviço","1.4.3.4.1.","SINAPI",89798,"TUBO PVC, SERIE NORMAL, ESGOTO PREDIAL, DN 50 MM, FORNECIDO E INSTALADO EM PRUMADA DE ESGOTO SANITÁRIO OU VENTILAÇÃO. AF_12/2014","M",20,1,null,null,null,null,null,""]
["S",4,"S",0,1,4,3,4,0,0,0,"F","Serviço","Serviço","1.4.3.4.2.","SINAPI",89800,"TUBO PVC, SERIE NORMAL, ESGOTO PREDIAL, DN 100 MM, FORNECIDO E INSTALADO EM PRUMADA DE ESGOTO SANITÁRIO OU VENTILAÇÃO. AF_12/2014","M",70,1,null,null,null,null,null,""]
[3,3,3,4,1,4,4,0,0,45,4,"F","Nível 3","Nível 3","1.4.4.","SINAPI",null,"OUTROS","-",null,1,null,null,null,null,null,""]
["S",3,"S",0,1,4,4,0,0,0,0,"F","Serviço","Serviço","1.4.4.0.1.","AGETOP",81825,"CAIXA DE PASSAGEM 60 X 60 CM SEM TAMPA","Un    ",2,1,null,null,null,null,null,""]
["S",3,"S",0,1,4,4,0,0,0,0,"F","Serviço","Serviço","1.4.4.0.2.","AGETOP",81826,"TAMPA EM CONCRETO ARMADO 25 MPA E=5CM PARA A CAIXA DE PASSAGEM 60X60CM","Un    ",2,1,null,null,null,null,null,""]
["S",3,"S",0,1,4,4,0,0,0,0,"F","Serviço","Serviço","1.4.4.0.3.","AGETOP",81854,"CAIXA DE GORDURA 600 L. CONCRETO PADRÃO AGETOP IMPERMEABILIZADA","un    ",2,1,null,null,null,null,null,""]
[3,3,3,41,1,4,5,0,0,41,{"$error":"#N/A"},"F","Nível 3","Nível 3","1.4.5.","SINAPI",null,"INSTALAÇÕES DE INCÊNDIO","-",null,1,null,null,null,null,null,""]
["S",3,"S",0,1,4,5,0,0,0,0,"F","Serviço","Serviço","1.4.5.0.1.","SINAPI",83644,"BOMBA RECALQUE D'AGUA TRIFASICA 10,0 HP","UN",1,1,null,null,null,null,null,""]
["S",3,"S",0,1,4,5,0,0,0,0,"F","Serviço","Serviço","1.4.5.0.2.","AGETOP",72338,"SIRENE METALICA ALCANCE 500 M","Un    ",2,1,null,null,null,null,null,""]
["S",3,"S",0,1,4,5,0,0,0,0,"F","Serviço","Serviço","1.4.5.0.3.","AGETOP",71156,"CURVA DE 90 GRAUS AÇO GALVANIZADO DIAM. 2.1/2\"","Un    ",1,1,null,null,null,null,null,""]
["S",3,"S",0,1,4,5,0,0,0,0,"F","Serviço","Serviço","1.4.5.0.4.","AGETOP",80910,"REGISTRO DE GAVETA BRUTO DIAMETRO 2.1/2\"","Un    ",2,1,null,null,null,null,null,""]
["S",3,"S",0,1,4,5,0,0,0,0,"F","Serviço","Serviço","1.4.5.0.5.","AGETOP",82379,"TUBO FERRO GALVANIZADO DIAM.2.1/2\"","m     ",330,1,null,null,null,null,null,""]
["S",3,"S",0,1,4,5,0,0,0,0,"F","Serviço","Serviço","1.4.5.0.6.","AGETOP",85003,"EXTINTOR PO QUIMICO SECO (6 KG) - CAPACIDADE EXTINTORA 20 BC","Un    ",2,1,null,null,null,null,null,""]
["S",3,"S",0,1,4,5,0,0,0,0,"F","Serviço","Serviço","1.4.5.0.7.","AGETOP",85006,"EXTINTOR MULTI USO EM PO A B C (6 KG) - CAPACIDADE EXTINTORA 3A 20BC","un    ",4,1,null,null,null,null,null,""]
["S",3,"S",0,1,4,5,0,0,0,0,"F","Serviço","Serviço","1.4.5.0.8.","AGETOP",85011,"CAIXA DE INCÊNDIO METÁLICA COM SUPORTE PARA MANGUEIRA, TAMPA E MURETA 17X60X90 CM C/PINTURA","Un    ",6,1,null,null,null,null,null,""]
["S",3,"S",0,1,4,5,0,0,0,0,"F","Serviço","Serviço","1.4.5.0.9.","AGETOP",85017,"MANGUEIRA DE INCÊNDIO D.I. = 38 MM TIPO 2 COMP. = 15 M","CJ    ",12,1,null,null,null,null,null,""]
["S",3,"S",0,1,4,5,0,0,0,0,"F","Serviço","Serviço","1.4.5.0.10.","AGETOP",85025,"ESGUICHO REGULÁVEL 1.1/2\"","Un    ",6,1,null,null,null,null,null,""]
["S",3,"S",0,1,4,5,0,0,0,0,"F","Serviço","Serviço","1.4.5.0.11.","AGETOP",85027,"ADAPTADOR P/ENGATE STORZ 2.1/2\" X 1.1/2\"","Un    ",7,1,null,null,null,null,null,""]
["S",3,"S",0,1,4,5,0,0,0,0,"F","Serviço","Serviço","1.4.5.0.12.","AGETOP",85031,"REGISTRO GLOBO ANGULAR 2.1/2\"","Un    ",6,1,null,null,null,null,null,""]
["S",3,"S",0,1,4,5,0,0,0,0,"F","Serviço","Serviço","1.4.5.0.13.","AGETOP",85035,"TAMPÃO CEGO COM CORRENTE 2.1/2\"","Un    ",7,1,null,null,null,null,null,""]
["S",3,"S",0,1,4,5,0,0,0,0,"F","Serviço","Serviço","1.4.5.0.14.","AGETOP",85037,"TANQUE DE PRESSÃO DE 10 L","Un    ",1,1,null,null,null,null,null,""]
["S",3,"S",0,1,4,5,0,0,0,0,"F","Serviço","Serviço","1.4.5.0.15.","AGETOP",85039,"PRESSOSTATO 50 A 80 PSI","Un    ",1,1,null,null,null,null,null,""]
["S",3,"S",0,1,4,5,0,0,0,0,"F","Serviço","Serviço","1.4.5.0.16.","AGETOP",85041,"MANOMETRO - 0 A 10 KG/CM2","Un    ",1,1,null,null,null,null,null,""]
["S",3,"S",0,1,4,5,0,0,{"$f":"IF(OR($C148=\"S\",$C148=0),0,MATCH(0,OFFSET($D148,1,$C148,ROW($C$522)-ROW($C148)),0))","v":0},{"$f":"IF(OR($C148=\"S\",$C148=0),0,MATCH(OFFSET($D148,0,$C148)+1,OFFSET($D148,1,$C148,ROW($C$522)-ROW($C148)),0))","v":0},"F","Serviço","Serviço","1.4.5.0.17.","AGETOP",85047,"NIPLE DUPLO FERRO GALVANIZADO 2.1/2\"","Un    ",5,1,null,null,null,null,null,""]
["S",3,"S",0,1,4,5,0,0,0,0,"F","Serviço","Serviço","1.4.5.0.18.","SINAPI",92377,"NIPLE, EM FERRO GALVANIZADO, DN 65 (2 1/2\"), CONEXÃO ROSQUEADA, INSTALADO EM REDE DE ALIMENTAÇÃO PARA HIDRANTE - FORNECIMENTO E INSTALAÇÃO. AF_12/2015","UN",6,1,null,null,null,null,null,""]
["S",3,"S",0,1,4,5,0,0,0,0,"F","Serviço","Serviço","1.4.5.0.19.","AGETOP",85077,"VÁLVULA DE RETENÇÃO HORIZONTAL 2.1/2\"","Un    ",2,1,null,null,null,null,null,""]
["S",3,"S",0,1,4,5,0,0,0,0,"F","Serviço","Serviço","1.4.5.0.20.","COMPOSIÇÃO","COMP 017_SEE","REDUCAO GIRATÓRIA TIPO STORZ LATAO P/ INST. PREDIAL COMBATE A INCENDIO ENGATE RAPIDO 2.1/2\" X 1.1/2\"","UN ",6,1,null,null,null,null,null,""]
["S",3,"S",0,1,4,5,0,0,0,0,"F","Serviço","Serviço","1.4.5.0.21.","COMPOSIÇÃO","COMP 018_SEE","CHAVE DUPLA P/ CONEXÕES TIPO STORZ EM LATÃO ENGATE RÁPIDO 1 1/2\" X 2 1/2\"","UN ",6,1,null,null,null,null,null,""]
["S",3,"S",0,1,4,5,0,0,0,0,"F","Serviço","Serviço","1.4.5.0.22.","AGETOP",80981,"REGISTRO DE ESFERA DIAMETRO 2.1/2\"","Un    ",1,1,null,null,null,null,null,""]
["S",3,"S",0,1,4,5,0,0,0,0,"F","Serviço","Serviço","1.4.5.0.23.","COMPOSIÇÃO","COMP 087_SEE","REGISTRO DE GAVETA COM HASTE ASCENDENTE DE BRONZE 2 1/2\"","UN ",1,1,null,null,null,null,null,""]
["S",3,"S",0,1,4,5,0,0,0,0,"F","Serviço","Serviço","1.4.5.0.24.","AGETOP",85056,"TÊ DE FERRO GALVANIZADO 90º X 2 1/2\"","un    ",9,1,null,null,null,null,null,""]
["S",3,"S",0,1,4,5,0,0,0,0,"F","Serviço","Serviço","1.4.5.0.25.","COMPOSIÇÃO","COMP 030_SEE","COTOVELO DE FERRO GALV. 90° X 2 1/2\"","UN ",21,1,null,null,null,null,null,""]
["S",3,"S",0,1,4,5,0,0,0,0,"F","Serviço","Serviço","1.4.5.0.26.","COMPOSIÇÃO","COMP 077_SEE","UNIAO FERRO GALV C/ASSENTO CONICO BRONZE 2 1/2\"","UN ",6,1,null,null,null,null,null,""]
["S",3,"S",0,1,4,5,0,0,0,0,"F","Serviço","Serviço","1.4.5.0.27.","COMPOSIÇÃO","COMP 347_SEE","ADAPTADOR PVC SOLDAVEL, COM FLANGES LIVRES, 75 MM X 2 1/2\", PARA CAIXA D' AGUA","UN ",1,1,null,null,null,null,null,""]
["S",3,"S",0,1,4,5,0,0,0,0,"F","Serviço","Serviço","1.4.5.0.28.","COMPOSIÇÃO","COMP 022_SEE","TAMPÃO FOFO 40X50CM C/INSCRIÇÃO ","UN ",1,1,null,null,null,null,null,""]
["S",3,"S",0,1,4,5,0,0,0,0,"F","Serviço","Serviço","1.4.5.0.29.","COMPOSIÇÃO","COMP 546_SEE","BUJÃO DE REBORDO 2.1/2\"","UN ",1,1,null,null,null,null,null,""]
["S",3,"S",0,1,4,5,0,0,0,0,"F","Serviço","Serviço","1.4.5.0.30.","COMPOSIÇÃO","COMP 186_SEE","BOTOEIRA BOMBA DE INCÊNDIO C/ MARTELO CONVENCIONAL/ ANALÓGICA","UN ",1,1,null,null,null,null,null,""]
["S",3,"S",0,1,4,5,0,0,0,0,"F","Serviço","Serviço","1.4.5.0.31.","COMPOSIÇÃO","COMP 188_SEE","ACIONADOR MANUAL DE ALARME","UN ",6,1,null,null,null,null,null,""]
["S",3,"S",0,1,4,5,0,0,0,0,"F","Serviço","Serviço","1.4.5.0.32.","COMPOSIÇÃO","COMP 190_SEE","CENTRAL DE DETECÇÃO E ALARME DE 40 SETORES COM BATERIA","UN ",1,1,null,null,null,null,null,""]
["S",3,"S",0,1,4,5,0,0,0,0,"F","Serviço","Serviço","1.4.5.0.33.","SINAPI",97599,"LUMINÁRIA DE EMERGÊNCIA - FORNECIMENTO E INSTALAÇÃO. AF_11/2017","UN",28,1,null,null,null,null,null,""]
["S",3,"S",0,1,4,5,0,0,0,0,"F","Serviço","Serviço","1.4.5.0.34.","COMPOSIÇÃO","COMP 024_SEE","SINALIZADOR FOTOLUMINESCENTE PARA EXTINTOR","UN ",6,1,null,null,null,null,null,""]
["S",3,"S",0,1,4,5,0,0,0,0,"F","Serviço","Serviço","1.4.5.0.35.","COMPOSIÇÃO","COMP 025_SEE","SINALIZADOR FOTOLUMINESCENTE DE EMERGÊNCIA","UN ",28,1,null,null,null,null,null,""]
["S",3,"S",0,1,4,5,0,0,0,0,"F","Serviço","Serviço","1.4.5.0.36.","COMPOSIÇÃO","COMP 277_SEE","MARCAÇÃO NO PISO - 1X1 M PARA EXTINTOR","M2",6,1,null,null,null,null,null,""]
["S",3,"S",0,1,4,5,0,0,0,0,"F","Serviço","Serviço","1.4.5.0.37.","COMPOSIÇÃO","COMP 235_SEE","PLACA DE SINALIZAÇÃO EM PVC COD 01 - (300X300) PROIBIDO FUMAR","UN ",1,1,null,null,null,null,null,""]
["S",3,"S",0,1,4,5,0,0,0,0,"F","Serviço","Serviço","1.4.5.0.38.","COMPOSIÇÃO","COMP 236_SEE","PLACA DE SINALIZAÇÃO EM PVC COD 06 - (300X300) PERIGO INFLAMÁVEL","UN ",1,1,null,null,null,null,null,""]
["S",3,"S",0,1,4,5,0,0,0,0,"F","Serviço","Serviço","1.4.5.0.39.","COMPOSIÇÃO","COMP 411_SEE","PLACA DE SINALIZAÇÃO EM PVC COD 13 - (316X158) SAÍDA DE EMERGÊNCIA","UN ",1,1,null,null,null,null,null,""]
["S",3,"S",0,1,4,5,0,0,0,0,"F","Serviço","Serviço","1.4.5.0.40.","COMPOSIÇÃO","COMP 412_SEE","PLACA DE SINALIZAÇÃO EM PVC COD 17 - (316X158) MENSAGEM \"SAÍDA\"","UN ",3,1,null,null,null,null,null,""]
[2,2,2,27,1,5,0,0,0,70,27,"F","Nível 2","Nível 2","1.5.",null,null,"INSTALAÇÕES ESPECIAIS","-",null,1,null,null,null,null,null,""]
["S",2,"S",0,1,5,0,0,0,0,0,"F","Serviço","Serviço","1.5.0.0.1.","AGETOP",91007,"CENTRAL DE GÁS PADRÃO AGETOP SEM INSTALAÇÕES (1+1 CILINDRO 45 KG)","Un    ",1,1,null,null,null,null,null,""]
["S",2,"S",0,1,5,0,0,0,0,0,"F","Serviço","Serviço","1.5.0.0.2.","AGETOP",91023,"UNIÃO S/BRONZE PRETA 3/4\" NPT 300 LBS","Un    ",3,1,null,null,null,null,null,""]
["S",2,"S",0,1,5,0,0,0,0,0,"F","Serviço","Serviço","1.5.0.0.3.","COMPOSIÇÃO","COMP 382_SEE","TE DE REDUCAO DE FERRO GALVANIZADO, COM ROSCA BSP, DE 3/4\" X 1/2\"","UN ",1,1,null,null,null,null,null,""]
["S",2,"S",0,1,5,0,0,0,0,0,"F","Serviço","Serviço","1.5.0.0.4.","COMPOSIÇÃO","COMP 383_SEE","BUCHA DE REDUCAO DE FERRO GALVANIZADO, COM ROSCA BSP, DE 1/2\" X 1/4\"","UN ",3,1,null,null,null,null,null,""]
["S",2,"S",0,1,5,0,0,0,0,0,"F","Serviço","Serviço","1.5.0.0.5.","AGETOP",91021,"LUVA GALVANIZADO DE REDUÇÃO 3/4\" X 1/2\" (GÁS)","Un    ",2,1,null,null,null,null,null,""]
["S",2,"S",0,1,5,0,0,0,0,0,"F","Serviço","Serviço","1.5.0.0.6.","SINAPI",92692,"NIPLE, EM FERRO GALVANIZADO, CONEXÃO ROSQUEADA, DN 15 (1/2\"), INSTALADO EM RAMAIS E SUB-RAMAIS DE GÁS - FORNECIMENTO E INSTALAÇÃO. AF_12/2015","UN",6,1,null,null,null,null,null,""]
["S",2,"S",0,1,5,0,0,0,0,0,"F","Serviço","Serviço","1.5.0.0.7.","AGETOP",91031,"NIPLE DUPLO 300 PSI 3/4\"","Un    ",6,1,null,null,null,null,null,""]
["S",2,"S",0,1,5,0,0,0,0,0,"F","Serviço","Serviço","1.5.0.0.8.","COMPOSIÇÃO","COMP 212_SEE","NIPLE DE REDUÇÃO 1/2\" X 1/4\" BSP","UN ",4,1,null,null,null,null,null,""]
["S",2,"S",0,1,5,0,0,0,0,0,"F","Serviço","Serviço","1.5.0.0.9.","COMPOSIÇÃO","COMP 213_SEE","NIPLE DE REDUÇÃO 3/4\" X 1/2\" BSP","UN ",4,1,null,null,null,null,null,""]
["S",2,"S",0,1,5,0,0,0,0,0,"F","Serviço","Serviço","1.5.0.0.10.","SINAPI",92688,"TUBO DE AÇO GALVANIZADO COM COSTURA, CLASSE MÉDIA, CONEXÃO ROSQUEADA, DN 20 (3/4\"), INSTALADO EM RAMAIS E SUB-RAMAIS DE GÁS - FORNECIMENTO E INSTALAÇÃO. AF_12/2015","M",12,1,null,null,null,null,null,""]
["S",2,"S",0,1,5,0,0,0,0,0,"F","Serviço","Serviço","1.5.0.0.11.","SINAPI",92701,"JOELHO 90 GRAUS, EM FERRO GALVANIZADO, CONEXÃO ROSQUEADA, DN 20 (3/4\"), INSTALADO EM RAMAIS E SUB-RAMAIS DE GÁS - FORNECIMENTO E INSTALAÇÃO. AF_12/2015","UN",8,1,null,null,null,null,null,""]
["S",2,"S",0,1,5,0,0,0,0,0,"F","Serviço","Serviço","1.5.0.0.12.","COMPOSIÇÃO","COMP 237_SEE","FITA ANTICORROSIVA","M",9,1,null,null,null,null,null,""]
["S",2,"S",0,1,5,0,0,0,0,0,"F","Serviço","Serviço","1.5.0.0.13.","AGETOP",91025,"VÁLVULA ESFERICA LATÃO 3/4\"","Un    ",3,1,null,null,null,null,null,""]
["S",2,"S",0,1,5,0,0,0,0,0,"F","Serviço","Serviço","1.5.0.0.14.","AGETOP",91019,"TE PRETO 90º 3/4\" NPT 300 LBS","Un    ",1,1,null,null,null,null,null,""]
["S",2,"S",0,1,5,0,0,0,0,0,"F","Serviço","Serviço","1.5.0.0.15.","COMPOSIÇÃO","COMP 542_SEE","VÁLVULA UGV 3/4\" (S) LATÃO","UN ",4,1,null,null,null,null,null,""]
["S",2,"S",0,1,5,0,0,0,0,0,"F","Serviço","Serviço","1.5.0.0.16.","COMPOSIÇÃO","COMP 543_SEE","VÁLVULA UGV 1/2\" (S) LATÃO","UN ",4,1,null,null,null,null,null,""]
["S",2,"S",0,1,5,0,0,0,0,0,"F","Serviço","Serviço","1.5.0.0.17.","AGETOP",91029,"VALVULA DE RETENÇÃO LATÃO 1/2\" X 7/16\" NPT","Un    ",4,1,null,null,null,null,null,""]
["S",2,"S",0,1,5,0,0,0,0,0,"F","Serviço","Serviço","1.5.0.0.18.","COMPOSIÇÃO","COMP 211_SEE","REGULADOR DE 2º ESTÁGIO 5KG/H","UN ",4,1,null,null,null,null,null,""]
["S",2,"S",0,1,5,0,0,0,0,0,"F","Serviço","Serviço","1.5.0.0.19.","COMPOSIÇÃO","COMP 210_SEE","REGULADOR DE 1º ESTÁGIO 60KG/H MODELO AP-40  COM MANÔMETRO","UN ",1,1,null,null,null,null,null,""]
["S",2,"S",0,1,5,0,0,0,0,0,"F","Serviço","Serviço","1.5.0.0.20.","AGETOP",85003,"EXTINTOR PO QUIMICO SECO (6 KG) - CAPACIDADE EXTINTORA 20 BC","Un    ",1,1,null,null,null,null,null,""]
["S",2,"S",0,1,5,0,0,0,0,0,"F","Serviço","Serviço","1.5.0.0.21.","COMPOSIÇÃO","COMP 235_SEE","PLACA DE SINALIZAÇÃO EM PVC COD 01 - (300X300) PROIBIDO FUMAR","UN ",2,1,null,null,null,null,null,""]
["S",2,"S",0,1,5,0,0,0,0,0,"F","Serviço","Serviço","1.5.0.0.22.","COMPOSIÇÃO","COMP 236_SEE","PLACA DE SINALIZAÇÃO EM PVC COD 06 - (300X300) PERIGO INFLAMÁVEL","UN ",2,1,null,null,null,null,null,""]
["S",2,"S",0,1,5,0,0,0,0,0,"F","Serviço","Serviço","1.5.0.0.23.","AGETOP",91043,"BRAÇADEIRA METALICA TIPO \"D\" DIAM. 3/4\"","Un    ",6,1,null,null,null,null,null,""]
["S",2,"S",0,1,5,0,0,0,0,0,"F","Serviço","Serviço","1.5.0.0.24.","AGETOP",71863,"PARAFUSO P/BUCHA S-10","Un    ",12,1,null,null,null,null,null,""]
["S",2,"S",0,1,5,0,0,0,0,0,"F","Serviço","Serviço","1.5.0.0.25.","AGETOP",70393,"BUCHA DE NYLON S-10","Un    ",12,1,null,null,null,null,null,""]
["S",2,"S",0,1,5,0,0,0,0,0,"F","Serviço","Serviço","1.5.0.0.26.","AGETOP",91045,"SUPORTE PARA COLETOR","Un    ",2,1,null,null,null,null,null,""]
[2,2,2,2,1,6,0,0,0,43,2,"F","Nível 2","Nível 2","1.6.","SINAPI",null,"ALVENARIAS E DIVISÓRIAS","-",null,1,null,null,null,null,null,""]
["S",2,"S",0,1,6,0,0,0,0,0,"F","Serviço","Serviço","1.6.0.0.1.","SINAPI",87520,"ALVENARIA DE VEDAÇÃO DE BLOCOS CERÂMICOS FURADOS NA HORIZONTAL DE 9X19X19CM (ESPESSURA 9CM) DE PAREDES COM ÁREA LÍQUIDA MAIOR OU IGUAL A 6M² COM VÃOS E ARGAMASSA DE ASSENTAMENTO COM PREPARO MANUAL. AF_06/2014","M2",10,1,null,null,null,null,null,"Referência: AGETOP - 100201"]
[2,2,2,2,1,7,0,0,0,41,2,"F","Nível 2","Nível 2","1.7.",null,null,"COBERTURAS","-",null,1,null,null,null,null,null,""]
["S",2,"S",0,1,7,0,0,0,0,0,"F","Serviço","Serviço","1.7.0.0.1.","SINAPI",94228,"CALHA EM CHAPA DE AÇO GALVANIZADO NÚMERO 24, DESENVOLVIMENTO DE 50 CM, INCLUSO TRANSPORTE VERTICAL. AF_07/2019","M",55,1,null,null,null,null,null,"Referência: AGETOP - 160601"]
[2,2,2,2,1,8,0,0,0,39,2,"F","Nível 2","Nível 2","1.8.",null,null,"ESQUADRIAS METÁLICAS","-",null,1,null,null,null,null,null,""]
["S",2,"S",0,1,8,0,0,0,0,0,"F","Serviço","Serviço","1.8.0.0.1.","SINAPI","74136/3","PORTA DE ACO CHAPA 24, DE ENROLAR, RAIADA, LARGA COM ACABAMENTO GALVANIZADO NATURAL","M2",24,1,null,null,null,null,null,"Referência: AGETOP - 180303"]
[2,2,2,5,1,9,0,0,0,37,5,"F","Nível 2","Nível 2","1.9.",null,null,"REVESTIMENTO DE PAREDE","-",null,1,null,null,null,null,null,""]
["S",2,"S",0,1,9,0,0,0,0,0,"F","Serviço","Serviço","1.9.0.0.1.","SINAPI",87553,"EMBOÇO, PARA RECEBIMENTO DE CERÂMICA, EM ARGAMASSA TRAÇO 1:2:8, PREPARO MECÂNICO COM BETONEIRA 400L, APLICADO MANUALMENTE EM FACES INTERNAS DE PAREDES, PARA AMBIENTE COM ÁREA MAIOR QUE 10M2, ESPESSURA DE 10MM, COM EXECUÇÃO DE TALISCAS. AF_06/2014","M2",50.28,1,null,null,null,null,null,""]
["S",2,"S",0,1,9,0,0,0,{"$f":"IF(OR($C207=\"S\",$C207=0),0,MATCH(0,OFFSET($D207,1,$C207,ROW($C$522)-ROW($C207)),0))","v":0},{"$f":"IF(OR($C207=\"S\",$C207=0),0,MATCH(OFFSET($D207,0,$C207)+1,OFFSET($D207,1,$C207,ROW($C$522)-ROW($C207)),0))","v":0},"F","Serviço","Serviço","1.9.0.0.2.","SINAPI",87547,"MASSA ÚNICA, PARA RECEBIMENTO DE PINTURA, EM ARGAMASSA TRAÇO 1:2:8, PREPARO MECÂNICO COM BETONEIRA 400L, APLICADA MANUALMENTE EM FACES INTERNAS DE PAREDES, ESPESSURA DE 10MM, COM EXECUÇÃO DE TALISCAS. AF_06/2014","M2",20,1,null,null,null,null,null,""]
["S",2,"S",0,1,9,0,0,0,0,0,"F","Serviço","Serviço","1.9.0.0.3.","SINAPI",87904,"CHAPISCO APLICADO EM ALVENARIA (COM PRESENÇA DE VÃOS) E ESTRUTURAS DE CONCRETO DE FACHADA, COM COLHER DE PEDREIRO.  ARGAMASSA TRAÇO 1:3 COM PREPARO MANUAL. AF_06/2014","M2",50.28,1,null,null,null,null,null,"Referência: AGETOP - 200101"]
["S",2,"S",0,1,9,0,0,0,0,0,"F","Serviço","Serviço","1.9.0.0.4.","SINAPI",87273,"REVESTIMENTO CERÂMICO PARA PAREDES INTERNAS COM PLACAS TIPO ESMALTADA EXTRA DE DIMENSÕES 33X45 CM APLICADAS EM AMBIENTES DE ÁREA MAIOR QUE 5 M² NA ALTURA INTEIRA DAS PAREDES. AF_06/2014","M2",205.04,1,null,null,null,null,null,""]
[2,2,2,2,1,10,0,0,0,32,2,"F","Nível 2","Nível 2","1.10.",null,null,"FORROS","-",null,1,null,null,null,null,null,""]
["S",2,"S",0,1,10,0,0,0,0,0,"F","Serviço","Serviço","1.10.0.0.1.","AGETOP",210498,"FORRO DE GESSO ACARTONADO PARA ÁREAS SECAS ESPESSURA DE 12,5MM","m2    ",2240,1,null,null,null,null,null,""]
[2,2,2,4,1,11,0,0,0,30,4,"F","Nível 2","Nível 2","1.11.",null,null,"REVESTIMENTO DE PISO","-",null,1,null,null,null,null,null,""]
["S",2,"S",0,1,11,0,0,0,0,0,"F","Serviço","Serviço","1.11.0.0.1.","SINAPI",84191,"PISO EM GRANILITE, MARMORITE OU GRANITINA ESPESSURA 8 MM, INCLUSO JUNTAS DE DILATACAO PLASTICAS","M2",100.3,1,null,null,null,null,null,"Referência: AGETOP - 221101"]
["S",2,"S",0,1,11,0,0,0,0,0,"F","Serviço","Serviço","1.11.0.0.2.","AGETOP",221104,"RASPAGEM E APLICAÇÃO RESINA ACRÍLICA DUAS DEMÃOS","m2    ",100.3,1,null,null,null,null,null,""]
["S",2,"S",0,1,11,0,0,0,{"$f":"IF(OR($C215=\"S\",$C215=0),0,MATCH(0,OFFSET($D215,1,$C215,ROW($C$522)-ROW($C215)),0))","v":0},{"$f":"IF(OR($C215=\"S\",$C215=0),0,MATCH(OFFSET($D215,0,$C215)+1,OFFSET($D215,1,$C215,ROW($C$522)-ROW($C215)),0))","v":0},"F","Serviço","Serviço","1.11.0.0.3.","AGETOP",221126,"PISO DE LADRILHO HIDRÁULICO COLORIDO MODELO TÁTIL ( ALERTA OU DIRECIONAL) SEM LASTRO","m2    ",117,1,null,null,null,null,null,""]
[2,2,2,6,1,12,0,0,0,26,6,"F","Nível 2","Nível 2","1.12.",null,null,"ADMINISTRAÇÃO","-",null,1,null,null,null,null,null,""]
[3,3,3,3,1,12,1,0,0,5,3,"F","Nível 3","Nível 3","1.12.1.",null,null,"MENSALISTAS","-",null,1,null,null,null,null,null,""]
["S",3,"S",0,1,12,1,0,0,0,0,"F","Serviço","Serviço","1.12.1.0.1.","SINAPI",90778,"ENGENHEIRO CIVIL DE OBRA PLENO COM ENCARGOS COMPLEMENTARES","H",330,1,null,null,null,null,null,"Referência: AGETOP - 250101"]
["S",3,"S",0,1,12,1,0,0,0,0,"F","Serviço","Serviço","1.12.1.0.2.","SINAPI",90776,"ENCARREGADO GERAL COM ENCARGOS COMPLEMENTARES","H",660,1,null,null,null,null,null,"Referência: AGETOP - 250103"]
[3,3,3,2,1,12,2,0,0,2,11,"F","Nível 3","Nível 3","1.12.2.",null,null,"LAUDO DE ESTANQUEIDADE","-",null,1,null,null,null,null,null,""]
["S",3,"S",0,1,12,2,0,0,0,0,"F","Serviço","Serviço","1.12.2.0.1.","SINAPI",90778,"ENGENHEIRO CIVIL DE OBRA PLENO COM ENCARGOS COMPLEMENTARES","H",16,1,null,null,null,null,null,"Referência: AGETOP - 250101"]
[2,2,2,17,1,13,0,0,0,20,17,"F","Nível 2","Nível 2","1.13.",null,null,"PINTURA","-",null,1,null,null,null,null,null,""]
[3,3,3,4,1,13,1,0,0,16,4,"F","Nível 3","Nível 3","1.13.1.",null,null,"ESMALTE SINTÉTICO","-",null,1,null,null,null,null,null,""]
["S",3,"S",0,1,13,1,0,0,0,0,"F","Serviço","Serviço","1.13.1.0.1.","AGETOP",260105,"REMOCAO DE PINTURA ANTIGA A OLEO OU ESMALTE","m2    ",350,1,null,null,null,null,null,""]
["S",3,"S",0,1,13,1,0,0,0,0,"F","Serviço","Serviço","1.13.1.0.2.","SINAPI",88497,"APLICAÇÃO E LIXAMENTO DE MASSA LÁTEX EM PAREDES, DUAS DEMÃOS. AF_06/2014","M2",350,1,null,null,null,null,null,"Referência: AGETOP - 261300"]
["S",3,"S",0,1,13,1,0,0,0,0,"F","Serviço","Serviço","1.13.1.0.3.","AGETOP",261550,"PINT.ESMALTE SINT.PAREDES - 2 DEM.C/SELADOR","m2    ",1078,1,null,null,null,null,null,""]
[3,3,3,4,1,13,2,0,0,12,4,"F","Nível 3","Nível 3","1.13.2.","AGETOP",null,"LÁTEX ACRÍLICA","-",null,1,null,null,null,null,null,""]
["S",3,"S",0,1,13,2,0,0,0,0,"F","Serviço","Serviço","1.13.2.0.1.","AGETOP",260104,"REMOCAO DE PINTURA ANTIGA A LATEX","m2    ",350,1,null,null,null,null,null,""]
["S",3,"S",0,1,13,2,0,0,0,0,"F","Serviço","Serviço","1.13.2.0.2.","SINAPI",88497,"APLICAÇÃO E LIXAMENTO DE MASSA LÁTEX EM PAREDES, DUAS DEMÃOS. AF_06/2014","M2",350,1,null,null,null,null,null,"Referência: AGETOP - 261300"]
["S",3,"S",0,1,13,2,0,0,0,0,"F","Serviço","Serviço","1.13.2.0.3.","SINAPI",88489,"APLICAÇÃO MANUAL DE PINTURA COM TINTA LÁTEX ACRÍLICA EM PAREDES, DUAS DEMÃOS. AF_06/2014","M2",1028,1,null,null,null,null,null,"Referência: AGETOP - 261001"]
[3,3,3,3,1,13,3,0,0,8,3,"F","Nível 3","Nível 3","1.13.3.","AGETOP",null,"EXTERNA","-",null,1,null,null,null,null,null,""]
["S",3,"S",0,1,13,3,0,0,0,0,"F","Serviço","Serviço","1.13.3.0.1.","SINAPI",88489,"APLICAÇÃO MANUAL DE PINTURA COM TINTA LÁTEX ACRÍLICA EM PAREDES, DUAS DEMÃOS. AF_06/2014","M2",2038.6,1,null,null,null,null,null,"Referência: AGETOP - 261001"]
["S",3,"S",0,1,13,3,0,0,{"$f":"IF(OR($C233=\"S\",$C233=0),0,MATCH(0,OFFSET($D233,1,$C233,ROW($C$522)-ROW($C233)),0))","v":0},{"$f":"IF(OR($C233=\"S\",$C233=0),0,MATCH(OFFSET($D233,0,$C233)+1,OFFSET($D233,1,$C233,ROW($C$522)-ROW($C233)),0))","v":0},"F","Serviço","Serviço","1.13.3.0.2.","SINAPI",88485,"APLICAÇÃO DE FUNDO SELADOR ACRÍLICO EM PAREDES, UMA DEMÃO. AF_06/2014","M2",2038.6,1,null,null,null,null,null,""]
[3,3,3,3,1,13,4,0,0,5,3,"F","Nível 3","Nível 3","1.13.4.","AGETOP",null,"ESQUADRIAS EXISTENTES","-",null,1,null,null,null,null,null,""]
["S",3,"S",0,1,13,4,0,0,0,0,"F","Serviço","Serviço","1.13.4.0.1.","AGETOP",260105,"REMOCAO DE PINTURA ANTIGA A OLEO OU ESMALTE","m2    ",766,1,null,null,null,null,null,""]
["S",3,"S",0,1,13,4,0,0,0,0,"F","Serviço","Serviço","1.13.4.0.2.","SINAPI","73924/3","PINTURA ESMALTE FOSCO, DUAS DEMAOS, SOBRE SUPERFICIE METALICA","M2",766,1,null,null,null,null,null,"Referência: AGETOP - 261503"]
[3,3,3,2,1,13,5,0,0,2,{"$error":"#N/A"},"F","Nível 3","Nível 3","1.13.5.","SINAPI",null,"ESQUADRIAS NOVAS","-",null,1,null,null,null,null,null,""]
["S",3,"S",0,1,13,5,0,0,0,0,"F","Serviço","Serviço","1.13.5.0.1.","SINAPI","74145/1","PINTURA ESMALTE FOSCO, DUAS DEMAOS, SOBRE SUPERFICIE METALICA, INCLUSO UMA DEMAO DE FUNDO ANTICORROSIVO. UTILIZACAO DE REVOLVER ( AR-COMPRIMIDO).","M2",48,1,null,null,null,null,null,"Referência: AGETOP - 261602"]
[2,2,2,3,1,14,0,0,0,3,157,"F","Nível 2","Nível 2","1.14.",null,null,"DIVERSOS","-",null,1,null,null,null,null,null,""]
["S",2,"S",0,1,14,0,0,0,0,0,"F","Serviço","Serviço","1.14.0.0.1.","AGETOP",270501,"LIMPEZA FINAL DE OBRA - (OBRAS CIVIS)","m2    ",150,1,null,null,null,null,null,""]
["S",2,"S",0,1,14,0,0,0,0,0,"F","Serviço","Serviço","1.14.0.0.2.","AGETOP",271608,"BANCADA DE GRANITO C/ESPELHO","m2    ",21.25,1,null,null,null,null,null,""]
[1,1,1,172,2,0,0,0,0,280,172,"F","Nível 1","Nível 1","2.","SINAPI",null,"VESTIÁRIO PADRÃO SEDUC","UN",1,1,null,null,null,null,null,""]
[2,2,2,2,2,1,0,0,0,171,2,"F","Nível 2","Nível 2","2.1.","SINAPI",null,"SERVIÇOS PRELIMINARES","-",null,1,null,null,null,null,null,""]
["S",2,"S",0,2,1,0,0,0,0,0,"F","Serviço","Serviço","2.1.0.0.1.","AGETOP",20701,"LOCAÇÃO DA OBRA, EXECUÇÃO DE GABARITO SEM REAPROVEITAMENTO, INCLUSO PINTURA (FACE INTERNA DO RIPÃO 15CM) E PIQUETE COM TESTEMUNHA","m2    ",98.23,1,null,null,null,null,null,""]
[2,2,2,3,2,2,0,0,0,169,3,"F","Nível 2","Nível 2","2.2.","SINAPI",null,"TRANSPORTES","-",null,1,null,null,null,null,null,""]
["S",2,"S",0,2,2,0,0,0,0,0,"F","Serviço","Serviço","2.2.0.0.1.","SINAPI",72897,"CARGA MANUAL DE ENTULHO EM CAMINHAO BASCULANTE 6 M3","M3",10,1,null,null,null,null,null,""]
["S",2,"S",0,2,2,0,0,0,0,0,"F","Serviço","Serviço","2.2.0.0.2.","SINAPI",72900,"TRANSPORTE DE ENTULHO COM CAMINHAO BASCULANTE 6 M3, RODOVIA PAVIMENTADA, DMT 0,5 A 1,0 KM","M3",10,1,null,null,null,null,null,""]
[2,2,2,3,2,3,0,0,0,166,3,"F","Nível 2","Nível 2","2.3.","SINAPI",null,"SERVIÇO EM TERRA","-",null,1,null,null,null,null,null,""]
["S",2,"S",0,2,3,0,0,0,0,0,"F","Serviço","Serviço","2.3.0.0.1.","SINAPI",93358,"ESCAVAÇÃO MANUAL DE VALA COM PROFUNDIDADE MENOR OU IGUAL A 1,30 M. AF_03/2016","M3",7,1,null,null,null,null,null,"Referência: AGETOP - 40101"]
["S",2,"S",0,2,3,0,0,0,0,0,"F","Serviço","Serviço","2.3.0.0.2.","AGETOP",41002,"APILOAMENTO","m2    ",132.78,1,null,null,null,null,null,""]
[2,2,2,8,2,4,0,0,0,163,8,"F","Nível 2","Nível 2","2.4.","SINAPI",null,"FUNDAÇÕES E SONDAGENS","-",null,1,null,null,null,null,null,""]
["S",2,"S",0,2,4,0,0,0,0,0,"F","Serviço","Serviço","2.4.0.0.1.","SINAPI",95474,"ALVENARIA DE EMBASAMENTO EM TIJOLOS CERAMICOS MACICOS 5X10X20CM, ASSENTADO  COM ARGAMASSA TRACO 1:2:8 (CIMENTO, CAL E AREIA)","M3",0.4,1,null,null,null,null,null,"Referência: AGETOP - 50201"]
["S",2,"S",0,2,4,0,0,0,0,0,"F","Serviço","Serviço","2.4.0.0.2.","SINAPI",98230,"ESTACA BROCA DE CONCRETO, DIÂMETRO DE 30 CM, PROFUNDIDADE DE ATÉ 3 M, ESCAVAÇÃO MANUAL COM TRADO CONCHA, NÃO ARMADA. AF_03/2018","M",49.5,1,null,null,null,null,null,"Referência: AGETOP - 50302"]
["S",2,"S",0,2,4,0,0,0,0,0,"F","Serviço","Serviço","2.4.0.0.3.","SINAPI",94963,"CONCRETO FCK = 15MPA, TRAÇO 1:3,4:3,5 (CIMENTO/ AREIA MÉDIA/ BRITA 1)  - PREPARO MECÂNICO COM BETONEIRA 400 L. AF_07/2016","M3",6.81,1,null,null,null,null,null,""]
["S",2,"S",0,2,4,0,0,0,0,0,"F","Serviço","Serviço","2.4.0.0.4.","AGETOP",51026,"LANÇAMENTO/APLICAÇÃO/ADENSAMENTO DE CONCRETO EM FUNDAÇÃO- (O.C.)","m3    ",6.81,1,null,null,null,null,null,""]
["S",2,"S",0,2,4,0,0,0,0,0,"F","Serviço","Serviço","2.4.0.0.5.","SINAPI",96545,"ARMAÇÃO DE BLOCO, VIGA BALDRAME OU SAPATA UTILIZANDO AÇO CA-50 DE 8 MM - MONTAGEM. AF_06/2017","KG",60,1,null,null,null,null,null,"Referência: AGETOP - 52004"]
["S",2,"S",0,2,4,0,0,0,0,0,"F","Serviço","Serviço","2.4.0.0.6.","SINAPI",96546,"ARMAÇÃO DE BLOCO, VIGA BALDRAME OU SAPATA UTILIZANDO AÇO CA-50 DE 10 MM - MONTAGEM. AF_06/2017","KG",80,1,null,null,null,null,null,"Referência: AGETOP - 52005"]
["S",2,"S",0,2,4,0,0,0,0,0,"F","Serviço","Serviço","2.4.0.0.7.","SINAPI",96543,"ARMAÇÃO DE BLOCO, VIGA BALDRAME E SAPATA UTILIZANDO AÇO CA-60 DE 5 MM - MONTAGEM. AF_06/2017","KG",54,1,null,null,null,null,null,"Referência: AGETOP - 52014"]
[2,2,2,8,2,5,0,0,0,155,8,"F","Nível 2","Nível 2","2.5.","SINAPI",null,"ESTRUTURA","-",null,1,null,null,null,null,null,""]
["S",2,"S",0,2,5,0,0,0,0,0,"F","Serviço","Serviço","2.5.0.0.1.","AGETOP",60208,"FORMA CH.COMPENSADA 12MM-VIGA/PILAR U=3V - (OBRAS CIVIS","m2    ",54.36,1,null,null,null,null,null,""]
["S",2,"S",0,2,5,0,0,0,0,0,"F","Serviço","Serviço","2.5.0.0.2.","SINAPI",92778,"ARMAÇÃO DE PILAR OU VIGA DE UMA ESTRUTURA CONVENCIONAL DE CONCRETO ARMADO EM UMA EDIFICAÇÃO TÉRREA OU SOBRADO UTILIZANDO AÇO CA-50 DE 10,0 MM - MONTAGEM. AF_12/2015","KG",207,1,null,null,null,null,null,"Referência: AGETOP - 60305"]
[{"$f":"CHOOSE(1+LOG(1+2*(ORÇAMENTO.Nivel=\"Nível 1\")+4*(ORÇAMENTO.Nivel=\"Nível 2\")+8*(ORÇAMENTO.Nivel=\"Nível 3\")+16*(ORÇAMENTO.Nivel=\"Nível 4\")+32*(ORÇAMENTO.Nivel=\"Serviço\"),2),0,1,2,3,4,\"S\")","v":"S"},2,"S",0,2,5,0,0,{"$f":"IF(AND($C262<=4,$C262<>0),0,IF(AND($C262=\"S\",$Y262>0),OFFSET(I262,-1,0)+1,OFFSET(I262,-1,0)))","v":0},0,0,"F","Serviço","Serviço","2.5.0.0.3.","SINAPI",92779,"ARMAÇÃO DE PILAR OU VIGA DE UMA ESTRUTURA CONVENCIONAL DE CONCRETO ARMADO EM UMA EDIFICAÇÃO TÉRREA OU SOBRADO UTILIZANDO AÇO CA-50 DE 12,5 MM - MONTAGEM. AF_12/2015","KG",322,1,null,null,null,null,null,""]
["S",{"$f":"IF(OR(C263=\"s\",C263=0),OFFSET(B263,-1,0),C263)","v":2},"S",{"$f":"IF(OR(C263=\"S\",C263=0),0,IF(ISERROR(K263),J263,SMALL(J263:K263,1)))","v":0},2,5,0,0,0,0,0,"F","Serviço","Serviço","2.5.0.0.4.","SINAPI",92775,"ARMAÇÃO DE PILAR OU VIGA DE UMA ESTRUTURA CONVENCIONAL DE CONCRETO ARMADO EM UMA EDIFICAÇÃO TÉRREA OU SOBRADO UTILIZANDO AÇO CA-60 DE 5,0 MM - MONTAGEM. AF_12/2015","KG",246.2,1,null,null,null,null,null,"Referência: AGETOP - 60314"]
["S",2,{"$f":"IF(OFFSET(C264,-1,0)=\"L\",1,IF(OFFSET(C264,-1,0)=1,2,IF(OR(A264=\"s\",A264=0),\"S\",IF(AND(OFFSET(C264,-1,0)=2,A264=4),3,IF(AND(OR(OFFSET(C264,-1,0)=\"s\",OFFSET(C264,-1,0)=0),A264<>\"s\",A264>OFFSET(B264,-1,0)),OFFSET(B264,-1,0),A264)))))","v":"S"},0,{"$f":"IF($C264=1,OFFSET(E264,-1,0)+1,OFFSET(E264,-1,0))","v":2},{"$f":"IF($C264=1,0,IF($C264=2,OFFSET(F264,-1,0)+1,OFFSET(F264,-1,0)))","v":5},{"$f":"IF(AND($C264<=2,$C264<>0),0,IF($C264=3,OFFSET(G264,-1,0)+1,OFFSET(G264,-1,0)))","v":0},{"$f":"IF(AND($C264<=3,$C264<>0),0,IF($C264=4,OFFSET(H264,-1,0)+1,OFFSET(H264,-1,0)))","v":0},0,0,0,"F","Serviço","Serviço","2.5.0.0.5.","SINAPI",94964,"CONCRETO FCK = 20MPA, TRAÇO 1:2,7:3 (CIMENTO/ AREIA MÉDIA/ BRITA 1)  - PREPARO MECÂNICO COM BETONEIRA 400 L. AF_07/2016","M3",8.83,1,null,null,null,null,null,""]
["S",2,"S",0,2,5,0,0,0,0,0,"F","Serviço","Serviço","2.5.0.0.6.","AGETOP",60802,"LANÇAMENTO/APLICAÇÃO/ADENSAMENTO DE CONCRETO EM ESTRUTURA - (O.C.)","m3    ",8.83,1,null,null,null,null,null,""]
["S",2,"S",0,2,5,0,0,0,0,0,"F","Serviço","Serviço","2.5.0.0.7.","SINAPI","74202/1","LAJE PRE-MOLDADA P/FORRO, SOBRECARGA 100KG/M2, VAOS ATE 3,50M/E=8CM, C/LAJOTAS E CAP.C/CONC FCK=20MPA, 3CM, INTER-EIXO 38CM, C/ESCORAMENTO (REAPR.3X) E FERRAGEM NEGATIVA","M2",67,1,null,null,null,null,null,""]
[2,2,2,34,2,6,0,0,0,147,34,"F","Nível 2","Nível 2","2.6.","SINAPI",null,"INSTALAÇÕES ELÉTRICAS","-",null,1,null,null,null,null,null,""]
["S",2,"S",0,2,6,0,0,0,0,0,"F","Serviço","Serviço","2.6.0.0.1.","AGETOP",70351,"BRACADEIRA METALICA TIPO \"U\" DIAM. 3/4\"","Un    ",5,1,null,null,null,null,null,""]
["S",2,"S",0,2,6,0,0,0,0,0,"F","Serviço","Serviço","2.6.0.0.2.","AGETOP",70352,"BRACADEIRA METALICA TIPO \"U\" DIAM. 1\"","Un    ",5,1,null,null,null,null,null,""]
["S",2,"S",0,2,6,0,0,0,0,0,"F","Serviço","Serviço","2.6.0.0.3.","AGETOP",70355,"BRACADEIRA METALICA TIPO \"U\" DIAM. 2\"","Un    ",5,1,null,null,null,null,null,""]
["S",2,"S",0,2,6,0,0,0,0,0,"F","Serviço","Serviço","2.6.0.0.4.","AGETOP",70421,"BUCHA E ARRUELA METALICA DIAM. 3/4\"","PR    ",25,1,null,null,null,null,null,""]
["S",2,"S",0,2,6,0,0,0,0,0,"F","Serviço","Serviço","2.6.0.0.5.","AGETOP",70422,"BUCHA E ARRUELA METALICA DIAM. 1\"","PR    ",10,1,null,null,null,null,null,""]
["S",2,"S",0,2,6,0,0,0,0,0,"F","Serviço","Serviço","2.6.0.0.6.","AGETOP",70425,"BUCHA E ARRUELA METALICA DIAM. 2\"","PR    ",5,1,null,null,null,null,null,""]
["S",2,"S",0,2,6,0,0,0,0,0,"F","Serviço","Serviço","2.6.0.0.7.","SINAPI",91927,"CABO DE COBRE FLEXÍVEL ISOLADO, 2,5 MM², ANTI-CHAMA 0,6/1,0 KV, PARA CIRCUITOS TERMINAIS - FORNECIMENTO E INSTALAÇÃO. AF_12/2015","M",170,1,null,null,null,null,null,"Referência: AGETOP - 70581"]
["S",2,"S",0,2,6,0,0,0,0,0,"F","Serviço","Serviço","2.6.0.0.8.","SINAPI",91929,"CABO DE COBRE FLEXÍVEL ISOLADO, 4 MM², ANTI-CHAMA 0,6/1,0 KV, PARA CIRCUITOS TERMINAIS - FORNECIMENTO E INSTALAÇÃO. AF_12/2015","M",280,1,null,null,null,null,null,"Referência: AGETOP - 70582"]
["S",2,"S",0,2,6,0,0,0,0,0,"F","Serviço","Serviço","2.6.0.0.9.","SINAPI",92984,"CABO DE COBRE FLEXÍVEL ISOLADO, 25 MM², ANTI-CHAMA 0,6/1,0 KV, PARA DISTRIBUIÇÃO - FORNECIMENTO E INSTALAÇÃO. AF_12/2015","M",22,1,null,null,null,null,null,"Referência: AGETOP - 70511"]
["S",2,"S",0,2,6,0,0,0,0,0,"F","Serviço","Serviço","2.6.0.0.10.","SINAPI",92986,"CABO DE COBRE FLEXÍVEL ISOLADO, 35 MM², ANTI-CHAMA 0,6/1,0 KV, PARA DISTRIBUIÇÃO - FORNECIMENTO E INSTALAÇÃO. AF_12/2015","M",209,1,null,null,null,null,null,"Referência: AGETOP - 70512"]
["S",2,"S",0,2,6,0,0,0,0,0,"F","Serviço","Serviço","2.6.0.0.11.","SINAPI",92868,"CAIXA RETANGULAR 4\" X 2\" MÉDIA (1,30 M DO PISO), METÁLICA, INSTALADA EM PAREDE - FORNECIMENTO E INSTALAÇÃO. AF_12/2015","UN",7,1,null,null,null,null,null,"Referência: AGETOP - 70691"]
["S",2,"S",0,2,6,0,0,0,0,0,"F","Serviço","Serviço","2.6.0.0.12.","SINAPI",92867,"CAIXA RETANGULAR 4\" X 2\" ALTA (2,00 M DO PISO), METÁLICA, INSTALADA EM PAREDE - FORNECIMENTO E INSTALAÇÃO. AF_12/2015","UN",12,1,null,null,null,null,null,""]
["S",2,"S",0,2,6,0,0,0,{"$f":"IF(OR($C280=\"S\",$C280=0),0,MATCH(0,OFFSET($D280,1,$C280,ROW($C$522)-ROW($C280)),0))","v":0},{"$f":"IF(OR($C280=\"S\",$C280=0),0,MATCH(OFFSET($D280,0,$C280)+1,OFFSET($D280,1,$C280,ROW($C$522)-ROW($C280)),0))","v":0},"F","Serviço","Serviço","2.6.0.0.13.","SINAPI",97893,"CAIXA ENTERRADA ELÉTRICA RETANGULAR, EM ALVENARIA COM BLOCOS DE CONCRETO, FUNDO COM BRITA, DIMENSÕES INTERNAS: 0,8X0,8X0,6 M. AF_05/2018","UN",1,1,null,null,null,null,null,""]
["S",2,"S",0,2,6,0,0,0,0,0,"F","Serviço","Serviço","2.6.0.0.14.","SINAPI",91902,"CURVA 90 GRAUS PARA ELETRODUTO, PVC, ROSCÁVEL, DN 25 MM (3/4\"), PARA CIRCUITOS TERMINAIS, INSTALADA EM LAJE - FORNECIMENTO E INSTALAÇÃO. AF_12/2015","UN",20,1,null,null,null,null,null,"Referência: AGETOP - 71141"]
["S",2,"S",0,2,6,0,0,0,0,0,"F","Serviço","Serviço","2.6.0.0.15.","SINAPI",93653,"DISJUNTOR MONOPOLAR TIPO DIN, CORRENTE NOMINAL DE 10A - FORNECIMENTO E INSTALAÇÃO. AF_04/2016","UN",1,1,null,null,null,null,null,""]
["S",2,"S",0,2,6,0,0,0,0,0,"F","Serviço","Serviço","2.6.0.0.16.","SINAPI",93654,"DISJUNTOR MONOPOLAR TIPO DIN, CORRENTE NOMINAL DE 16A - FORNECIMENTO E INSTALAÇÃO. AF_04/2016","UN",1,1,null,null,null,null,null,""]
["S",2,"S",0,2,6,0,0,0,0,0,"F","Serviço","Serviço","2.6.0.0.17.","SINAPI",93656,"DISJUNTOR MONOPOLAR TIPO DIN, CORRENTE NOMINAL DE 25A - FORNECIMENTO E INSTALAÇÃO. AF_04/2016","UN",12,1,null,null,null,null,null,""]
["S",2,"S",0,2,6,0,0,0,0,0,"F","Serviço","Serviço","2.6.0.0.18.","SINAPI","74130/5","DISJUNTOR TERMOMAGNETICO TRIPOLAR PADRAO NEMA (AMERICANO) 60 A 100A 240V, FORNECIMENTO E INSTALACAO","UN",2,1,null,null,null,null,null,""]
["S",2,"S",0,2,6,0,0,0,0,0,"F","Serviço","Serviço","2.6.0.0.19.","AGETOP",71450,"INTERRUPTOR DIFERENCIAL RESIDUAL (D.R.) BIPOLAR DE 25A-30mA","Un    ",12,1,null,null,null,null,null,""]
["S",2,"S",0,2,6,0,0,0,0,0,"F","Serviço","Serviço","2.6.0.0.20.","SINAPI",91953,"INTERRUPTOR SIMPLES (1 MÓDULO), 10A/250V, INCLUINDO SUPORTE E PLACA - FORNECIMENTO E INSTALAÇÃO. AF_12/2015","UN",5,1,null,null,null,null,null,"Referência: AGETOP - 71440"]
["S",2,"S",0,2,6,0,0,0,0,0,"F","Serviço","Serviço","2.6.0.0.21.","SINAPI",91871,"ELETRODUTO RÍGIDO ROSCÁVEL, PVC, DN 25 MM (3/4\"), PARA CIRCUITOS TERMINAIS, INSTALADO EM PAREDE - FORNECIMENTO E INSTALAÇÃO. AF_12/2015","M",65,1,null,null,null,null,null,"Referência: AGETOP - 71201"]
["S",2,"S",0,2,6,0,0,0,0,0,"F","Serviço","Serviço","2.6.0.0.22.","SINAPI",91872,"ELETRODUTO RÍGIDO ROSCÁVEL, PVC, DN 32 MM (1\"), PARA CIRCUITOS TERMINAIS, INSTALADO EM PAREDE - FORNECIMENTO E INSTALAÇÃO. AF_12/2015","M",30,1,null,null,null,null,null,"Referência: AGETOP - 71202"]
["S",2,"S",0,2,6,0,0,0,0,0,"F","Serviço","Serviço","2.6.0.0.23.","SINAPI",93009,"ELETRODUTO RÍGIDO ROSCÁVEL, PVC, DN 60 MM (2\") - FORNECIMENTO E INSTALAÇÃO. AF_12/2015","M",15,1,null,null,null,null,null,""]
["S",2,"S",0,2,6,0,0,0,0,0,"F","Serviço","Serviço","2.6.0.0.24.","AGETOP",71321,"FITA DE AUTO FUSAO, ROLO E 10,00 MM","Un    ",1,1,null,null,null,null,null,""]
["S",2,"S",0,2,6,0,0,0,0,0,"F","Serviço","Serviço","2.6.0.0.25.","AGETOP",71331,"FITA ISOLANTE, ROLO DE 20,00 M","Un    ",10,1,null,null,null,null,null,""]
["S",2,"S",0,2,6,0,0,0,0,0,"F","Serviço","Serviço","2.6.0.0.26.","SINAPI",97586,"LUMINÁRIA TIPO CALHA, DE SOBREPOR, COM 2 LÂMPADAS TUBULARES DE 36 W - FORNECIMENTO E INSTALAÇÃO. AF_11/2017","UN",14,1,null,null,null,null,null,""]
["S",2,"S",0,2,6,0,0,0,0,0,"F","Serviço","Serviço","2.6.0.0.27.","COMPOSIÇÃO","COMP 387_SEE","LÂMPADA LED TUBULAR 18W ","UN ",28,1,null,null,null,null,null,""]
["S",2,"S",0,2,6,0,0,0,0,0,"F","Serviço","Serviço","2.6.0.0.28.","SINAPI",91884,"LUVA PARA ELETRODUTO, PVC, ROSCÁVEL, DN 25 MM (3/4\"), PARA CIRCUITOS TERMINAIS, INSTALADA EM PAREDE - FORNECIMENTO E INSTALAÇÃO. AF_12/2015","UN",25,1,null,null,null,null,null,"Referência: AGETOP - 71741"]
["S",2,"S",0,2,6,0,0,0,0,0,"F","Serviço","Serviço","2.6.0.0.29.","SINAPI",91885,"LUVA PARA ELETRODUTO, PVC, ROSCÁVEL, DN 32 MM (1\"), PARA CIRCUITOS TERMINAIS, INSTALADA EM PAREDE - FORNECIMENTO E INSTALAÇÃO. AF_12/2015","UN",10,1,null,null,null,null,null,"Referência: AGETOP - 71742"]
["S",2,"S",0,2,6,0,0,0,0,0,"F","Serviço","Serviço","2.6.0.0.30.","SINAPI",93014,"LUVA PARA ELETRODUTO, PVC, ROSCÁVEL, DN 60 MM (2\") - FORNECIMENTO E INSTALAÇÃO. AF_12/2015","UN",5,1,null,null,null,null,null,"Referência: AGETOP - 71745"]
["S",2,"S",0,2,6,0,0,0,0,0,"F","Serviço","Serviço","2.6.0.0.31.","SINAPI","74131/5","QUADRO DE DISTRIBUICAO DE ENERGIA DE EMBUTIR, EM CHAPA METALICA, PARA 24 DISJUNTORES TERMOMAGNETICOS MONOPOLARES, COM BARRAMENTO TRIFASICO E NEUTRO, FORNECIMENTO E INSTALACAO","UN",4,1,null,null,null,null,null,""]
["S",2,"S",0,2,6,0,0,0,0,0,"F","Serviço","Serviço","2.6.0.0.32.","SINAPI",91996,"TOMADA MÉDIA DE EMBUTIR (1 MÓDULO), 2P+T 10 A, INCLUINDO SUPORTE E PLACA - FORNECIMENTO E INSTALAÇÃO. AF_12/2015","UN",2,1,null,null,null,null,null,"Referência: AGETOP - 72578"]
["S",2,"S",0,2,6,0,0,0,0,0,"F","Serviço","Serviço","2.6.0.0.33.","SINAPI",91993,"TOMADA ALTA DE EMBUTIR (1 MÓDULO), 2P+T 20 A, INCLUINDO SUPORTE E PLACA - FORNECIMENTO E INSTALAÇÃO. AF_12/2015","UN",12,1,null,null,null,null,null,"Referência: AGETOP - 72585"]
[2,2,2,71,2,7,0,0,0,113,71,"F","Nível 2","Nível 2","2.7.","SINAPI",null,"INSTALAÇÕES HIDROSSANITÁRIAS","-",null,1,null,null,null,null,null,""]
["S",2,"S",0,2,7,0,0,0,0,0,"F","Serviço","Serviço","2.7.0.0.1.","AGETOP",81825,"CAIXA DE PASSAGEM 60 X 60 CM SEM TAMPA","Un    ",4,1,null,null,null,null,null,""]
["S",2,"S",0,2,7,0,0,0,0,0,"F","Serviço","Serviço","2.7.0.0.2.","AGETOP",81826,"TAMPA EM CONCRETO ARMADO 25 MPA E=5CM PARA A CAIXA DE PASSAGEM 60X60CM","Un    ",4,1,null,null,null,null,null,""]
["S",2,"S",0,2,7,0,0,0,0,0,"F","Serviço","Serviço","2.7.0.0.3.","AGETOP",80502,"VASO SANITARIO","Un    ",8,1,null,null,null,null,null,""]
["S",2,"S",0,2,7,0,0,0,0,0,"F","Serviço","Serviço","2.7.0.0.4.","AGETOP",80510,"ANEL DE VEDAÇÃO PARA VASO SANITÁRIO","Un    ",8,1,null,null,null,null,null,""]
["S",2,"S",0,2,7,0,0,0,0,0,"F","Serviço","Serviço","2.7.0.0.5.","AGETOP",80512,"TUBO DE DESCIDA PARA CAIXA DE DESCARGA ( LONGO 1 1/4\" )","Un    ",8,1,null,null,null,null,null,""]
["S",2,"S",0,2,7,0,0,0,0,0,"F","Serviço","Serviço","2.7.0.0.6.","AGETOP",80518,"VÁLVULA DE DESCARGA COM SISTEMA PASSANTE EM POLÍMERO - OPÇÃO ECONÔMICA ( ALTA SEGURANÇA)","Un    ",8,1,null,null,null,null,null,""]
["S",2,"S",0,2,7,0,0,0,0,0,"F","Serviço","Serviço","2.7.0.0.7.","AGETOP",80520,"CONJUNTO DE FIXACAO P/VASO SANITARIO (PAR)","CJ    ",8,1,null,null,null,null,null,""]
["S",2,"S",0,2,7,0,0,0,0,0,"F","Serviço","Serviço","2.7.0.0.8.","SINAPI",95544,"PAPELEIRA DE PAREDE EM METAL CROMADO SEM TAMPA, INCLUSO FIXAÇÃO. AF_10/2016","UN",4,1,null,null,null,null,null,""]
["S",2,"S",0,2,7,0,0,0,0,0,"F","Serviço","Serviço","2.7.0.0.9.","AGETOP",80532,"PORTA PAPEL HIGIÊNICO EM METAL/ACABAMENTO CROMADO","Un    ",8,1,null,null,null,null,null,""]
["S",2,"S",0,2,7,0,0,0,0,0,"F","Serviço","Serviço","2.7.0.0.10.","AGETOP",80590,"CUBA DE LOUCA DE EMBUTIR OVAL MÉDIA ","Un    ",6,1,null,null,null,null,null,""]
["S",2,"S",0,2,7,0,0,0,0,0,"F","Serviço","Serviço","2.7.0.0.11.","AGETOP",80550,"FIXACAO P/LAVATORIO (PAR)","PAR   ",6,1,null,null,null,null,null,""]
["S",2,"S",0,2,7,0,0,0,0,0,"F","Serviço","Serviço","2.7.0.0.12.","AGETOP",80556,"LIGAÇÃO FLEXÍVEL PVC DIAM.1/2\" (ENGATE)","Un    ",6,1,null,null,null,null,null,""]
["S",2,"S",0,2,7,0,0,0,0,0,"F","Serviço","Serviço","2.7.0.0.13.","SINAPI",86883,"SIFÃO DO TIPO FLEXÍVEL EM PVC 1\u0094 X 1.1/2\u0094 - FORNECIMENTO E INSTALAÇÃO. AF_12/2013","UN",6,1,null,null,null,null,null,""]
["S",2,"S",0,2,7,0,0,0,0,0,"F","Serviço","Serviço","2.7.0.0.14.","SINAPI",86915,"TORNEIRA CROMADA DE MESA, 1/2\" OU 3/4\", PARA LAVATÓRIO, PADRÃO MÉDIO - FORNECIMENTO E INSTALAÇÃO. AF_12/2013","UN",6,1,null,null,null,null,null,"Referência: AGETOP - 80570"]
["S",2,"S",0,2,7,0,0,0,0,0,"F","Serviço","Serviço","2.7.0.0.15.","SINAPI",86877,"VÁLVULA EM METAL CROMADO 1.1/2\" X 1.1/2\" PARA TANQUE OU LAVATÓRIO, COM OU SEM LADRÃO - FORNECIMENTO E INSTALAÇÃO. AF_12/2013","UN",6,1,null,null,null,null,null,"Referência: AGETOP - 80580"]
["S",2,"S",0,2,7,0,0,0,0,0,"F","Serviço","Serviço","2.7.0.0.16.","SINAPI",9535,"CHUVEIRO ELETRICO COMUM CORPO PLASTICO TIPO DUCHA, FORNECIMENTO E INSTALACAO","UN",12,1,null,null,null,null,null,""]
["S",2,"S",0,2,7,0,0,0,0,0,"F","Serviço","Serviço","2.7.0.0.17.","AGETOP",80730,"CABIDE TIPO GANCHO EM LOUÇA","Un    ",12,1,null,null,null,null,null,""]
["S",2,"S",0,2,7,0,0,0,0,0,"F","Serviço","Serviço","2.7.0.0.18.","AGETOP",80740,"MEIA SABONETEIRA EM LOUÇA DE EMBUTIR","Un    ",12,1,null,null,null,null,null,""]
["S",2,"S",0,2,7,0,0,0,0,0,"F","Serviço","Serviço","2.7.0.0.19.","SINAPI",89987,"REGISTRO DE GAVETA BRUTO, LATÃO, ROSCÁVEL, 3/4\", COM ACABAMENTO E CANOPLA CROMADOS. FORNECIDO E INSTALADO EM RAMAL DE ÁGUA. AF_12/2014","UN",2,1,null,null,null,null,null,"Referência: AGETOP - 80926"]
["S",2,"S",0,2,7,0,0,0,0,0,"F","Serviço","Serviço","2.7.0.0.20.","AGETOP",80927,"REGISTRO DE GAVETA C/CANOPLA DIAMETRO 1\"","Un    ",2,1,null,null,null,null,null,""]
["S",2,"S",0,2,7,0,0,0,0,0,"F","Serviço","Serviço","2.7.0.0.21.","SINAPI",94794,"REGISTRO DE GAVETA BRUTO, LATÃO, ROSCÁVEL, 1 1/2\u0094, COM ACABAMENTO E CANOPLA CROMADOS, INSTALADO EM RESERVAÇÃO DE ÁGUA DE EDIFICAÇÃO QUE POSSUA RESERVATÓRIO DE FIBRA/FIBROCIMENTO \u0096 FORNECIMENTO E INSTALAÇÃO. AF_06/2016","UN",6,1,null,null,null,null,null,"Referência: AGETOP - 80929"]
["S",2,"S",0,2,7,0,0,0,0,0,"F","Serviço","Serviço","2.7.0.0.22.","AGETOP",80946,"REGISTRO DE PRESSAO C/CANOPLA CROMADA DIAM.3/4\"","Un    ",12,1,null,null,null,null,null,""]
["S",2,"S",0,2,7,0,0,0,0,0,"F","Serviço","Serviço","2.7.0.0.23.","SINAPI",89402,"TUBO, PVC, SOLDÁVEL, DN 25MM, INSTALADO EM RAMAL DE DISTRIBUIÇÃO DE ÁGUA - FORNECIMENTO E INSTALAÇÃO. AF_12/2014","M",45,1,null,null,null,null,null,"Referência: AGETOP - 81003"]
["S",2,"S",0,2,7,0,0,0,0,0,"F","Serviço","Serviço","2.7.0.0.24.","SINAPI",89447,"TUBO, PVC, SOLDÁVEL, DN 32MM, INSTALADO EM PRUMADA DE ÁGUA - FORNECIMENTO E INSTALAÇÃO. AF_12/2014","M",12,1,null,null,null,null,null,""]
[{"$f":"CHOOSE(1+LOG(1+2*(ORÇAMENTO.Nivel=\"Nível 1\")+4*(ORÇAMENTO.Nivel=\"Nível 2\")+8*(ORÇAMENTO.Nivel=\"Nível 3\")+16*(ORÇAMENTO.Nivel=\"Nível 4\")+32*(ORÇAMENTO.Nivel=\"Serviço\"),2),0,1,2,3,4,\"S\")","v":"S"},2,"S",0,2,7,0,0,{"$f":"IF(AND($C326<=4,$C326<>0),0,IF(AND($C326=\"S\",$Y326>0),OFFSET(I326,-1,0)+1,OFFSET(I326,-1,0)))","v":0},0,0,"F","Serviço","Serviço","2.7.0.0.25.","SINAPI",89449,"TUBO, PVC, SOLDÁVEL, DN 50MM, INSTALADO EM PRUMADA DE ÁGUA - FORNECIMENTO E INSTALAÇÃO. AF_12/2014","M",42,1,null,null,null,null,null,""]
["S",{"$f":"IF(OR(C327=\"s\",C327=0),OFFSET(B327,-1,0),C327)","v":2},"S",{"$f":"IF(OR(C327=\"S\",C327=0),0,IF(ISERROR(K327),J327,SMALL(J327:K327,1)))","v":0},2,7,0,0,0,0,0,"F","Serviço","Serviço","2.7.0.0.26.","AGETOP",81007,"TUBO SOLDAVEL PVC MARROM DIAMETRO 60 mm (2\")","m     ",12,1,null,null,null,null,null,""]
["S",2,{"$f":"IF(OFFSET(C328,-1,0)=\"L\",1,IF(OFFSET(C328,-1,0)=1,2,IF(OR(A328=\"s\",A328=0),\"S\",IF(AND(OFFSET(C328,-1,0)=2,A328=4),3,IF(AND(OR(OFFSET(C328,-1,0)=\"s\",OFFSET(C328,-1,0)=0),A328<>\"s\",A328>OFFSET(B328,-1,0)),OFFSET(B328,-1,0),A328)))))","v":"S"},0,{"$f":"IF($C328=1,OFFSET(E328,-1,0)+1,OFFSET(E328,-1,0))","v":2},{"$f":"IF($C328=1,0,IF($C328=2,OFFSET(F328,-1,0)+1,OFFSET(F328,-1,0)))","v":7},{"$f":"IF(AND($C328<=2,$C328<>0),0,IF($C328=3,OFFSET(G328,-1,0)+1,OFFSET(G328,-1,0)))","v":0},{"$f":"IF(AND($C328<=3,$C328<>0),0,IF($C328=4,OFFSET(H328,-1,0)+1,OFFSET(H328,-1,0)))","v":0},0,0,0,"F","Serviço","Serviço","2.7.0.0.27.","SINAPI",89538,"ADAPTADOR CURTO COM BOLSA E ROSCA PARA REGISTRO, PVC, SOLDÁVEL, DN 25MM X 3/4\u0094, INSTALADO EM PRUMADA DE ÁGUA - FORNECIMENTO E INSTALAÇÃO. AF_12/2014","UN",28,1,null,null,null,null,null,""]
["S",2,"S",0,2,7,0,0,0,0,0,"F","Serviço","Serviço","2.7.0.0.28.","AGETOP",81067,"ADAPTAD.SOLD.CURTO C/BOLSA E ROSCA P/REG.32X1\"","Un    ",4,1,null,null,null,null,null,""]
["S",2,"S",0,2,7,0,0,0,0,0,"F","Serviço","Serviço","2.7.0.0.29.","SINAPI",89596,"ADAPTADOR CURTO COM BOLSA E ROSCA PARA REGISTRO, PVC, SOLDÁVEL, DN 50MM X 1.1/2\u0094, INSTALADO EM PRUMADA DE ÁGUA - FORNECIMENTO E INSTALAÇÃO. AF_12/2014","UN",24,1,null,null,null,null,null,"Referência: AGETOP - 81069"]
["S",2,"S",0,2,7,0,0,0,0,0,"F","Serviço","Serviço","2.7.0.0.30.","SINAPI",89579,"LUVA DE REDUÇÃO, PVC, SOLDÁVEL, DN 50MM X 25MM, INSTALADO EM PRUMADA DE ÁGUA   FORNECIMENTO E INSTALAÇÃO. AF_12/2014","UN",8,1,null,null,null,null,null,""]
["S",2,"S",0,2,7,0,0,0,0,0,"F","Serviço","Serviço","2.7.0.0.31.","AGETOP",81184,"BUCHA DE REDUCAO SOLDAVEL LONGA 60 X 50 mm","Un    ",2,1,null,null,null,null,null,""]
["S",2,"S",0,2,7,0,0,0,0,0,"F","Serviço","Serviço","2.7.0.0.32.","SINAPI",89481,"JOELHO 90 GRAUS, PVC, SOLDÁVEL, DN 25MM, INSTALADO EM PRUMADA DE ÁGUA - FORNECIMENTO E INSTALAÇÃO. AF_12/2014","UN",20,1,null,null,null,null,null,""]
["S",2,"S",0,2,7,0,0,0,0,0,"F","Serviço","Serviço","2.7.0.0.33.","SINAPI",89413,"JOELHO 90 GRAUS, PVC, SOLDÁVEL, DN 32MM, INSTALADO EM RAMAL DE DISTRIBUIÇÃO DE ÁGUA - FORNECIMENTO E INSTALAÇÃO. AF_12/2014","UN",2,1,null,null,null,null,null,"Referência: AGETOP - 81322"]
["S",2,"S",0,2,7,0,0,0,0,0,"F","Serviço","Serviço","2.7.0.0.34.","AGETOP",81324,"JOELHO 90 GRAUS SOLDAVEL 50 mm (MARROM)","Un    ",12,1,null,null,null,null,null,""]
["S",2,"S",0,2,7,0,0,0,0,0,"F","Serviço","Serviço","2.7.0.0.35.","AGETOP",81360,"JOELHO RED.90 GRAUS SOLD.C/BUCHA LATAO 25X1/2\"","Un    ",18,1,null,null,null,null,null,""]
["S",2,"S",0,2,7,0,0,0,0,0,"F","Serviço","Serviço","2.7.0.0.36.","SINAPI",89501,"JOELHO 90 GRAUS, PVC, SOLDÁVEL, DN 50MM, INSTALADO EM PRUMADA DE ÁGUA - FORNECIMENTO E INSTALAÇÃO. AF_12/2014","UN",4,1,null,null,null,null,null,""]
["S",2,"S",0,2,7,0,0,0,0,0,"F","Serviço","Serviço","2.7.0.0.37.","SINAPI",89617,"TE, PVC, SOLDÁVEL, DN 25MM, INSTALADO EM PRUMADA DE ÁGUA - FORNECIMENTO E INSTALAÇÃO. AF_12/2014","UN",4,1,null,null,null,null,null,""]
["S",2,"S",0,2,7,0,0,0,0,0,"F","Serviço","Serviço","2.7.0.0.38.","SINAPI",89625,"TE, PVC, SOLDÁVEL, DN 50MM, INSTALADO EM PRUMADA DE ÁGUA - FORNECIMENTO E INSTALAÇÃO. AF_12/2014","UN",18,1,null,null,null,null,null,"Referência: AGETOP - 81405"]
["S",2,"S",0,2,7,0,0,0,0,0,"F","Serviço","Serviço","2.7.0.0.39.","AGETOP",81421,"TE REDUCAO 90 GRAUS SOLDAVEL 32 X 25 mm","Un    ",8,1,null,null,null,null,null,""]
["S",2,"S",0,2,7,0,0,0,0,0,"F","Serviço","Serviço","2.7.0.0.40.","SINAPI",89627,"TÊ DE REDUÇÃO, PVC, SOLDÁVEL, DN 50MM X 25MM, INSTALADO EM PRUMADA DE ÁGUA - FORNECIMENTO E INSTALAÇÃO. AF_12/2014","UN",2,1,null,null,null,null,null,"Referência: AGETOP - 81424"]
["S",2,"S",0,2,7,0,0,0,0,0,"F","Serviço","Serviço","2.7.0.0.41.","AGETOP",81425,"TE REDUCAO 90 GRAUS SOLDAVEL 50 X 32 mm","Un    ",4,1,null,null,null,null,null,""]
["S",2,"S",0,2,7,0,0,0,0,0,"F","Serviço","Serviço","2.7.0.0.42.","AGETOP",81445,"TE RED.SOLD.90GR.BUC.LATAO BOLSA CENT.25X25X1/2\"","Un    ",4,1,null,null,null,null,null,""]
["S",2,"S",0,2,7,0,0,0,{"$f":"IF(OR($C344=\"S\",$C344=0),0,MATCH(0,OFFSET($D344,1,$C344,ROW($C$522)-ROW($C344)),0))","v":0},{"$f":"IF(OR($C344=\"S\",$C344=0),0,MATCH(OFFSET($D344,0,$C344)+1,OFFSET($D344,1,$C344,ROW($C$522)-ROW($C344)),0))","v":0},"F","Serviço","Serviço","2.7.0.0.43.","AGETOP",81602,"BUCHA DE REDUCAO LONGA DIAM. 50 X 40 MM","Un    ",10,1,null,null,null,null,null,""]
["S",2,"S",0,2,7,0,0,0,0,0,"F","Serviço","Serviço","2.7.0.0.44.","AGETOP",81663,"CORPO CX. SIFONADA DIAM. 150 X 150 X 50","Un    ",2,1,null,null,null,null,null,""]
["S",2,"S",0,2,7,0,0,0,0,0,"F","Serviço","Serviço","2.7.0.0.45.","AGETOP",81664,"CORPO CX. SIFONADA DIAM. 150 X 185 X 75","Un    ",2,1,null,null,null,null,null,""]
["S",2,"S",0,2,7,0,0,0,0,0,"F","Serviço","Serviço","2.7.0.0.46.","AGETOP",81679,"CORPO RALO SIFONADO CONICO DIAM. 100 X 40","Un    ",12,1,null,null,null,null,null,""]
["S",2,"S",0,2,7,0,0,0,0,0,"F","Serviço","Serviço","2.7.0.0.47.","AGETOP",81770,"GRELHA QUADRADA BRANCA DIAM. 100 MM","Un    ",2,1,null,null,null,null,null,""]
["S",2,"S",0,2,7,0,0,0,0,0,"F","Serviço","Serviço","2.7.0.0.48.","AGETOP",81771,"GRELHA QUADRADA BRANCA DIAM. 150 MM","Un    ",2,1,null,null,null,null,null,""]
["S",2,"S",0,2,7,0,0,0,0,0,"F","Serviço","Serviço","2.7.0.0.49.","AGETOP",81885,"TERMINAL DE VENTILACAO DIAMETRO 50 MM","Un    ",5,1,null,null,null,null,null,""]
["S",2,"S",0,2,7,0,0,0,0,0,"F","Serviço","Serviço","2.7.0.0.50.","SINAPI",89726,"JOELHO 45 GRAUS, PVC, SERIE NORMAL, ESGOTO PREDIAL, DN 40 MM, JUNTA SOLDÁVEL, FORNECIDO E INSTALADO EM RAMAL DE DESCARGA OU RAMAL DE ESGOTO SANITÁRIO. AF_12/2014","UN",2,1,null,null,null,null,null,""]
["S",2,"S",0,2,7,0,0,0,0,0,"F","Serviço","Serviço","2.7.0.0.51.","SINAPI",89806,"JOELHO 45 GRAUS, PVC, SERIE NORMAL, ESGOTO PREDIAL, DN 75 MM, JUNTA ELÁSTICA, FORNECIDO E INSTALADO EM PRUMADA DE ESGOTO SANITÁRIO OU VENTILAÇÃO. AF_12/2014","UN",2,1,null,null,null,null,null,""]
["S",2,"S",0,2,7,0,0,0,0,0,"F","Serviço","Serviço","2.7.0.0.52.","SINAPI",89724,"JOELHO 90 GRAUS, PVC, SERIE NORMAL, ESGOTO PREDIAL, DN 40 MM, JUNTA SOLDÁVEL, FORNECIDO E INSTALADO EM RAMAL DE DESCARGA OU RAMAL DE ESGOTO SANITÁRIO. AF_12/2014","UN",6,1,null,null,null,null,null,""]
["S",2,"S",0,2,7,0,0,0,0,0,"F","Serviço","Serviço","2.7.0.0.53.","SINAPI",89731,"JOELHO 90 GRAUS, PVC, SERIE NORMAL, ESGOTO PREDIAL, DN 50 MM, JUNTA ELÁSTICA, FORNECIDO E INSTALADO EM RAMAL DE DESCARGA OU RAMAL DE ESGOTO SANITÁRIO. AF_12/2014","UN",10,1,null,null,null,null,null,""]
["S",2,"S",0,2,7,0,0,0,0,0,"F","Serviço","Serviço","2.7.0.0.54.","AGETOP",81938,"JOELHO 90 GRAUS DIAMETRO 100 MM","Un    ",8,1,null,null,null,null,null,""]
["S",2,"S",0,2,7,0,0,0,0,0,"F","Serviço","Serviço","2.7.0.0.55.","SINAPI",89806,"JOELHO 45 GRAUS, PVC, SERIE NORMAL, ESGOTO PREDIAL, DN 75 MM, JUNTA ELÁSTICA, FORNECIDO E INSTALADO EM PRUMADA DE ESGOTO SANITÁRIO OU VENTILAÇÃO. AF_12/2014","UN",6,1,null,null,null,null,null,""]
["S",2,"S",0,2,7,0,0,0,0,0,"F","Serviço","Serviço","2.7.0.0.56.","SINAPI",89785,"JUNÇÃO SIMPLES, PVC, SERIE NORMAL, ESGOTO PREDIAL, DN 50 X 50 MM, JUNTA ELÁSTICA, FORNECIDO E INSTALADO EM RAMAL DE DESCARGA OU RAMAL DE ESGOTO SANITÁRIO. AF_12/2014","UN",10,1,null,null,null,null,null,"Referência: AGETOP - 81970"]
["S",2,"S",0,2,7,0,0,0,0,0,"F","Serviço","Serviço","2.7.0.0.57.","SINAPI",89797,"JUNÇÃO SIMPLES, PVC, SERIE NORMAL, ESGOTO PREDIAL, DN 100 X 100 MM, JUNTA ELÁSTICA, FORNECIDO E INSTALADO EM RAMAL DE DESCARGA OU RAMAL DE ESGOTO SANITÁRIO. AF_12/2014","UN",6,1,null,null,null,null,null,"Referência: AGETOP - 81975"]
["S",2,"S",0,2,7,0,0,0,0,0,"F","Serviço","Serviço","2.7.0.0.58.","SINAPI",89752,"LUVA SIMPLES, PVC, SERIE NORMAL, ESGOTO PREDIAL, DN 40 MM, JUNTA SOLDÁVEL, FORNECIDO E INSTALADO EM RAMAL DE DESCARGA OU RAMAL DE ESGOTO SANITÁRIO. AF_12/2014","UN",12,1,null,null,null,null,null,"Referência: AGETOP - 82001"]
["S",2,"S",0,2,7,0,0,0,0,0,"F","Serviço","Serviço","2.7.0.0.59.","SINAPI",89753,"LUVA SIMPLES, PVC, SERIE NORMAL, ESGOTO PREDIAL, DN 50 MM, JUNTA ELÁSTICA, FORNECIDO E INSTALADO EM RAMAL DE DESCARGA OU RAMAL DE ESGOTO SANITÁRIO. AF_12/2014","UN",12,1,null,null,null,null,null,"Referência: AGETOP - 82002"]
["S",2,"S",0,2,7,0,0,0,0,0,"F","Serviço","Serviço","2.7.0.0.60.","SINAPI",89774,"LUVA SIMPLES, PVC, SERIE NORMAL, ESGOTO PREDIAL, DN 75 MM, JUNTA ELÁSTICA, FORNECIDO E INSTALADO EM RAMAL DE DESCARGA OU RAMAL DE ESGOTO SANITÁRIO. AF_12/2014","UN",2,1,null,null,null,null,null,"Referência: AGETOP - 82003"]
["S",2,"S",0,2,7,0,0,0,0,0,"F","Serviço","Serviço","2.7.0.0.61.","SINAPI",89778,"LUVA SIMPLES, PVC, SERIE NORMAL, ESGOTO PREDIAL, DN 100 MM, JUNTA ELÁSTICA, FORNECIDO E INSTALADO EM RAMAL DE DESCARGA OU RAMAL DE ESGOTO SANITÁRIO. AF_12/2014","UN",6,1,null,null,null,null,null,"Referência: AGETOP - 82004"]
["S",2,"S",0,2,7,0,0,0,0,0,"F","Serviço","Serviço","2.7.0.0.62.","AGETOP",82053,"PORTA GRELHA QUADRADO P/GREL.QUADRADA DIAM. 100 MM","Un    ",2,1,null,null,null,null,null,""]
["S",2,"S",0,2,7,0,0,0,0,0,"F","Serviço","Serviço","2.7.0.0.63.","AGETOP",82071,"PORTA GRELHA REDONDO BRANCO DIAM. 150 MM","Un    ",2,1,null,null,null,null,null,""]
["S",2,"S",0,2,7,0,0,0,0,0,"F","Serviço","Serviço","2.7.0.0.64.","SINAPI",89557,"REDUÇÃO EXCÊNTRICA, PVC, SERIE R, ÁGUA PLUVIAL, DN 100 X 75 MM, JUNTA ELÁSTICA, FORNECIDO E INSTALADO EM RAMAL DE ENCAMINHAMENTO. AF_12/2014","UN",2,1,null,null,null,null,null,"Referência: AGETOP - 82102"]
["S",2,"S",0,2,7,0,0,0,0,0,"F","Serviço","Serviço","2.7.0.0.65.","SINAPI",89825,"TE, PVC, SERIE NORMAL, ESGOTO PREDIAL, DN 50 X 50 MM, JUNTA ELÁSTICA, FORNECIDO E INSTALADO EM PRUMADA DE ESGOTO SANITÁRIO OU VENTILAÇÃO. AF_12/2014","UN",1,1,null,null,null,null,null,""]
["S",2,"S",0,2,7,0,0,0,0,0,"F","Serviço","Serviço","2.7.0.0.66.","AGETOP",82231,"TE SANITARIO DIAMETRO 75 X 50 MM","Un    ",2,1,null,null,null,null,null,""]
["S",2,"S",0,2,7,0,0,0,0,0,"F","Serviço","Serviço","2.7.0.0.67.","SINAPI",89771,"TUBO, CPVC, SOLDÁVEL, DN 42MM, INSTALADO EM PRUMADA DE ÁGUA \u0096 FORNECIMENTO E INSTALAÇÃO. AF_12/2014","M",21,1,null,null,null,null,null,""]
["S",2,"S",0,2,7,0,0,0,0,0,"F","Serviço","Serviço","2.7.0.0.68.","SINAPI",89798,"TUBO PVC, SERIE NORMAL, ESGOTO PREDIAL, DN 50 MM, FORNECIDO E INSTALADO EM PRUMADA DE ESGOTO SANITÁRIO OU VENTILAÇÃO. AF_12/2014","M",48,1,null,null,null,null,null,""]
["S",2,"S",0,2,7,0,0,0,0,0,"F","Serviço","Serviço","2.7.0.0.69.","SINAPI",89799,"TUBO PVC, SERIE NORMAL, ESGOTO PREDIAL, DN 75 MM, FORNECIDO E INSTALADO EM PRUMADA DE ESGOTO SANITÁRIO OU VENTILAÇÃO. AF_12/2014","M",9,1,null,null,null,null,null,""]
["S",2,"S",0,2,7,0,0,0,0,0,"F","Serviço","Serviço","2.7.0.0.70.","SINAPI",89800,"TUBO PVC, SERIE NORMAL, ESGOTO PREDIAL, DN 100 MM, FORNECIDO E INSTALADO EM PRUMADA DE ESGOTO SANITÁRIO OU VENTILAÇÃO. AF_12/2014","M",30,1,null,null,null,null,null,""]
[2,2,2,4,2,8,0,0,0,42,4,"F","Nível 2","Nível 2","2.8.","SINAPI",null,"ALVENARIAS E DIVISÓRIAS","-",null,1,null,null,null,null,null,""]
["S",2,"S",0,2,8,0,0,0,0,0,"F","Serviço","Serviço","2.8.0.0.1.","SINAPI",87503,"ALVENARIA DE VEDAÇÃO DE BLOCOS CERÂMICOS FURADOS NA HORIZONTAL DE 9X19X19CM (ESPESSURA 9CM) DE PAREDES COM ÁREA LÍQUIDA MAIOR OU IGUAL A 6M² SEM VÃOS E ARGAMASSA DE ASSENTAMENTO COM PREPARO EM BETONEIRA. AF_06/2014","M2",176,1,null,null,null,null,null,"Referência: AGETOP - 100201"]
["S",2,"S",0,2,8,0,0,0,0,0,"F","Serviço","Serviço","2.8.0.0.2.","SINAPI",72132,"ALVENARIA EM TIJOLO CERAMICO MACICO 5X10X20CM 1/2 VEZ (ESPESSURA 10CM), ASSENTADO COM ARGAMASSA TRACO 1:2:8 (CIMENTO, CAL E AREIA)","M2",39,1,null,null,null,null,null,"Referência: AGETOP - 100102"]
["S",2,"S",0,2,8,0,0,0,0,0,"F","Serviço","Serviço","2.8.0.0.3.","SINAPI",93202,"FIXAÇÃO (ENCUNHAMENTO) DE ALVENARIA DE VEDAÇÃO COM TIJOLO MACIÇO. AF_03/2016","M",60.4,1,null,null,null,null,null,"Referência: AGETOP - 100204"]
[2,2,2,2,2,9,0,0,0,38,2,"F","Nível 2","Nível 2","2.9.","SINAPI",null,"IMPERMEABILIZAÇÃO","-",null,1,null,null,null,null,null,""]
["S",2,"S",0,2,9,0,0,0,0,0,"F","Serviço","Serviço","2.9.0.0.1.","SINAPI",98562,"IMPERMEABILIZAÇÃO DE FLOREIRA OU VIGA BALDRAME COM ARGAMASSA DE CIMENTO E AREIA, COM ADITIVO IMPERMEABILIZANTE, E = 2 CM. AF_06/2018","M2",60.4,1,null,null,null,null,null,"Referência: AGETOP - 120902"]
[2,2,2,3,2,10,0,0,0,36,3,"F","Nível 2","Nível 2","2.10.","SINAPI",null,"ESTRUTURA DE MADEIRA","-",null,1,null,null,null,null,null,""]
["S",2,"S",0,2,10,0,0,0,0,0,"F","Serviço","Serviço","2.10.0.0.1.","AGETOP",140101,"ESTRUTURA-TELHA CERÂMICA V=3 A 7 M. C/FERRAGENS","m2    ",132.78,1,null,null,null,null,null,""]
["S",2,"S",0,2,10,0,0,0,0,0,"F","Serviço","Serviço","2.10.0.0.2.","AGETOP",140301,"TRATAMENTO P/ESTRUTURA DE TELHADO","m2    ",132.78,1,null,null,null,null,null,""]
[2,2,2,4,2,11,0,0,0,33,4,"F","Nível 2","Nível 2","2.11.","SINAPI",null,"COBERTURAS","-",null,1,null,null,null,null,null,""]
["S",2,"S",0,2,11,0,0,0,0,0,"F","Serviço","Serviço","2.11.0.0.1.","SINAPI",94445,"TELHAMENTO COM TELHA CERÂMICA CAPA-CANAL, TIPO PLAN, COM ATÉ 2 ÁGUAS, INCLUSO TRANSPORTE VERTICAL. AF_07/2019","M2",132.78,1,null,null,null,null,null,"Referência: AGETOP - 160401"]
["S",2,"S",0,2,11,0,0,0,0,0,"F","Serviço","Serviço","2.11.0.0.2.","SINAPI",94221,"CUMEEIRA PARA TELHA CERÂMICA EMBOÇADA COM ARGAMASSA TRAÇO 1:2:9 (CIMENTO, CAL E AREIA) PARA TELHADOS COM ATÉ 2 ÁGUAS, INCLUSO TRANSPORTE VERTICAL. AF_07/2019","M",11.02,1,null,null,null,null,null,""]
["S",2,"S",0,2,11,0,0,0,0,0,"F","Serviço","Serviço","2.11.0.0.3.","SINAPI",94224,"EMBOÇAMENTO COM ARGAMASSA TRAÇO 1:2:9 (CIMENTO, CAL E AREIA). AF_07/2019","M",47.04,1,null,null,null,null,null,"Referência: AGETOP - 160403"]
[2,2,2,4,2,12,0,0,0,29,4,"F","Nível 2","Nível 2","2.12.","SINAPI",null,"ESQUADRIAS METÁLICAS","-",null,1,null,null,null,null,null,""]
["S",2,"S",0,2,12,0,0,0,0,0,"F","Serviço","Serviço","2.12.0.0.1.","SINAPI","73933/4","PORTA DE FERRO DE ABRIR TIPO BARRA CHATA, COM REQUADRO E GUARNICAO COMPLETA","M2",6.72,1,null,null,null,null,null,"Referência: AGETOP - 180501"]
["S",2,"S",0,2,12,0,0,0,0,0,"F","Serviço","Serviço","2.12.0.0.2.","SINAPI","73933/4","PORTA DE FERRO DE ABRIR TIPO BARRA CHATA, COM REQUADRO E GUARNICAO COMPLETA","M2",7.56,1,null,null,null,null,null,"Referência: AGETOP - 180501"]
["S",2,"S",0,2,12,0,0,0,0,0,"F","Serviço","Serviço","2.12.0.0.3.","AGETOP",180381,"ESQ. MAXIMO AR CHAPA/VIDRO J3/J5/J6/J8 C/FERRAGENS","m2    ",17.28,1,null,null,null,null,null,""]
[2,2,2,5,2,13,0,0,0,25,5,"F","Nível 2","Nível 2","2.13.","SINAPI",null,"REVESTIMENTO DE PAREDE","-",null,1,null,null,null,null,null,""]
[{"$f":"CHOOSE(1+LOG(1+2*(ORÇAMENTO.Nivel=\"Nível 1\")+4*(ORÇAMENTO.Nivel=\"Nível 2\")+8*(ORÇAMENTO.Nivel=\"Nível 3\")+16*(ORÇAMENTO.Nivel=\"Nível 4\")+32*(ORÇAMENTO.Nivel=\"Serviço\"),2),0,1,2,3,4,\"S\")","v":"S"},2,"S",0,2,13,0,0,{"$f":"IF(AND($C390<=4,$C390<>0),0,IF(AND($C390=\"S\",$Y390>0),OFFSET(I390,-1,0)+1,OFFSET(I390,-1,0)))","v":0},0,0,"F","Serviço","Serviço","2.13.0.0.1.","SINAPI",87553,"EMBOÇO, PARA RECEBIMENTO DE CERÂMICA, EM ARGAMASSA TRAÇO 1:2:8, PREPARO MECÂNICO COM BETONEIRA 400L, APLICADO MANUALMENTE EM FACES INTERNAS DE PAREDES, PARA AMBIENTE COM ÁREA MAIOR QUE 10M2, ESPESSURA DE 10MM, COM EXECUÇÃO DE TALISCAS. AF_06/2014","M2",330.72,1,null,null,null,null,null,""]
["S",{"$f":"IF(OR(C391=\"s\",C391=0),OFFSET(B391,-1,0),C391)","v":2},"S",{"$f":"IF(OR(C391=\"S\",C391=0),0,IF(ISERROR(K391),J391,SMALL(J391:K391,1)))","v":0},2,13,0,0,0,0,0,"F","Serviço","Serviço","2.13.0.0.2.","SINAPI",87904,"CHAPISCO APLICADO EM ALVENARIA (COM PRESENÇA DE VÃOS) E ESTRUTURAS DE CONCRETO DE FACHADA, COM COLHER DE PEDREIRO.  ARGAMASSA TRAÇO 1:3 COM PREPARO MANUAL. AF_06/2014","M2",444.42,1,null,null,null,null,null,"Referência: AGETOP - 200101"]
["S",2,{"$f":"IF(OFFSET(C392,-1,0)=\"L\",1,IF(OFFSET(C392,-1,0)=1,2,IF(OR(A392=\"s\",A392=0),\"S\",IF(AND(OFFSET(C392,-1,0)=2,A392=4),3,IF(AND(OR(OFFSET(C392,-1,0)=\"s\",OFFSET(C392,-1,0)=0),A392<>\"s\",A392>OFFSET(B392,-1,0)),OFFSET(B392,-1,0),A392)))))","v":"S"},0,{"$f":"IF($C392=1,OFFSET(E392,-1,0)+1,OFFSET(E392,-1,0))","v":2},{"$f":"IF($C392=1,0,IF($C392=2,OFFSET(F392,-1,0)+1,OFFSET(F392,-1,0)))","v":13},{"$f":"IF(AND($C392<=2,$C392<>0),0,IF($C392=3,OFFSET(G392,-1,0)+1,OFFSET(G392,-1,0)))","v":0},{"$f":"IF(AND($C392<=3,$C392<>0),0,IF($C392=4,OFFSET(H392,-1,0)+1,OFFSET(H392,-1,0)))","v":0},0,0,0,"F","Serviço","Serviço","2.13.0.0.3.","SINAPI",87547,"MASSA ÚNICA, PARA RECEBIMENTO DE PINTURA, EM ARGAMASSA TRAÇO 1:2:8, PREPARO MECÂNICO COM BETONEIRA 400L, APLICADA MANUALMENTE EM FACES INTERNAS DE PAREDES, ESPESSURA DE 10MM, COM EXECUÇÃO DE TALISCAS. AF_06/2014","M2",113.7,1,null,null,null,null,null,""]
["S",2,"S",0,2,13,0,0,0,0,0,"F","Serviço","Serviço","2.13.0.0.4.","SINAPI",87273,"REVESTIMENTO CERÂMICO PARA PAREDES INTERNAS COM PLACAS TIPO ESMALTADA EXTRA DE DIMENSÕES 33X45 CM APLICADAS EM AMBIENTES DE ÁREA MAIOR QUE 5 M² NA ALTURA INTEIRA DAS PAREDES. AF_06/2014","M2",330.72,1,null,null,null,null,null,""]
[2,2,2,2,2,14,0,0,0,20,2,"F","Nível 2","Nível 2","2.14.","SINAPI",null,"VIDROS","-",null,1,null,null,null,null,null,""]
["S",2,"S",0,2,14,0,0,0,0,0,"F","Serviço","Serviço","2.14.0.0.1.","SINAPI",72117,"VIDRO LISO COMUM TRANSPARENTE, ESPESSURA 4MM","M2",6.72,1,null,null,null,null,null,"Referência: AGETOP - 190102"]
[2,2,2,5,2,15,0,0,0,18,5,"F","Nível 2","Nível 2","2.15.","SINAPI",null,"REVESTIMENTO DE PISO","-",null,1,null,null,null,null,null,""]
["S",2,"S",0,2,15,0,0,0,0,0,"F","Serviço","Serviço","2.15.0.0.1.","AGETOP",220100,"PASSEIO PROTECAO EM CONC.DESEMPEN.5 CM 1:2,5:3,5 ( INCLUSO ESPELHO DE 30CM/ESCAVAÇÃO/REATERRO/APILOAMENTO/ATERRO INTERNO)","m2    ",25.26,1,null,null,null,null,null,""]
["S",2,"S",0,2,15,0,0,0,0,0,"F","Serviço","Serviço","2.15.0.0.2.","AGETOP",220101,"LASTRO DE CONCRETO REGULARIZADO IMPERMEABILIZADO 1:3:6 ESP=5CM (BASE)","m2    ",123.49,1,null,null,null,null,null,""]
["S",2,"S",0,2,15,0,0,0,0,0,"F","Serviço","Serviço","2.15.0.0.3.","SINAPI",84191,"PISO EM GRANILITE, MARMORITE OU GRANITINA ESPESSURA 8 MM, INCLUSO JUNTAS DE DILATACAO PLASTICAS","M2",108.03,1,null,null,null,null,null,"Referência: AGETOP - 221101"]
["S",2,"S",0,2,15,0,0,0,0,0,"F","Serviço","Serviço","2.15.0.0.4.","AGETOP",221104,"RASPAGEM E APLICAÇÃO RESINA ACRÍLICA DUAS DEMÃOS","m2    ",108.03,1,null,null,null,null,null,""]
[2,2,2,3,2,16,0,0,0,13,3,"F","Nível 2","Nível 2","2.16.","SINAPI",null,"FERRAGENS","-",null,1,null,null,null,null,null,""]
["S",2,"S",0,2,16,0,0,0,0,0,"F","Serviço","Serviço","2.16.0.0.1.","AGETOP",230174,"BARRA DE APOIO EM AÇO INOX - 40 CM","un    ",4,1,null,null,null,null,null,""]
["S",2,"S",0,2,16,0,0,0,0,0,"F","Serviço","Serviço","2.16.0.0.2.","AGETOP",230176,"BARRA DE APOIO EM AÇO INOX - 80 CM ","un    ",4,1,null,null,null,null,null,""]
[2,2,2,6,2,17,0,0,0,10,6,"F","Nível 2","Nível 2","2.17.","SINAPI",null,"PINTURA","-",null,1,null,null,null,null,null,""]
["S",2,"S",0,2,17,0,0,0,0,0,"F","Serviço","Serviço","2.17.0.0.1.","SINAPI",88497,"APLICAÇÃO E LIXAMENTO DE MASSA LÁTEX EM PAREDES, DUAS DEMÃOS. AF_06/2014","M2",67,1,null,null,null,null,null,"Referência: AGETOP - 261300"]
["S",2,"S",0,2,17,0,0,0,0,0,"F","Serviço","Serviço","2.17.0.0.2.","SINAPI",88489,"APLICAÇÃO MANUAL DE PINTURA COM TINTA LÁTEX ACRÍLICA EM PAREDES, DUAS DEMÃOS. AF_06/2014","M2",113.7,1,null,null,null,null,null,"Referência: AGETOP - 261001"]
["S",2,"S",0,2,17,0,0,0,0,0,"F","Serviço","Serviço","2.17.0.0.3.","AGETOP",261304,"EMASSAMENTO ACRILICO 2 DEMAOS","m2    ",113.7,1,null,null,null,null,null,""]
["S",2,"S",0,2,17,0,0,0,{"$f":"IF(OR($C408=\"S\",$C408=0),0,MATCH(0,OFFSET($D408,1,$C408,ROW($C$522)-ROW($C408)),0))","v":0},{"$f":"IF(OR($C408=\"S\",$C408=0),0,MATCH(OFFSET($D408,0,$C408)+1,OFFSET($D408,1,$C408,ROW($C$522)-ROW($C408)),0))","v":0},"F","Serviço","Serviço","2.17.0.0.4.","SINAPI",88486,"APLICAÇÃO MANUAL DE PINTURA COM TINTA LÁTEX PVA EM TETO, DUAS DEMÃOS. AF_06/2014","M2",67,1,null,null,null,null,null,"Referência: AGETOP - 261307"]
["S",2,"S",0,2,17,0,0,0,0,0,"F","Serviço","Serviço","2.17.0.0.5.","SINAPI","74145/1","PINTURA ESMALTE FOSCO, DUAS DEMAOS, SOBRE SUPERFICIE METALICA, INCLUSO UMA DEMAO DE FUNDO ANTICORROSIVO. UTILIZACAO DE REVOLVER ( AR-COMPRIMIDO).","M2",63.12,1,null,null,null,null,null,"Referência: AGETOP - 261602"]
[2,2,2,4,2,18,0,0,0,4,{"$error":"#N/A"},"F","Nível 2","Nível 2","2.18.","SINAPI",null,"DIVERSOS","-",null,1,null,null,null,null,null,""]
["S",2,"S",0,2,18,0,0,0,0,0,"F","Serviço","Serviço","2.18.0.0.1.","AGETOP",270501,"LIMPEZA FINAL DE OBRA - (OBRAS CIVIS)","m2    ",98.23,1,null,null,null,null,null,""]
["S",2,"S",0,2,18,0,0,0,0,0,"F","Serviço","Serviço","2.18.0.0.2.","AGETOP",271608,"BANCADA DE GRANITO C/ESPELHO","m2    ",2.4,1,null,null,null,null,null,""]
["S",2,"S",0,2,18,0,0,0,0,0,"F","Serviço","Serviço","2.18.0.0.3.","AGETOP",271303,"BANCO DE CONCRETO POLIDO BASE EM ALVENARIA REBOCADA E PINTADA - PADRÃO AGETOP 2015","m     ",6,1,null,null,null,null,null,""]
[1,1,1,108,3,0,0,0,0,108,{"$error":"#N/A"},"F","Nível 1","Nível 1","3.","SINAPI",null,"PÁTIO MULTIUSO - PADRÃO SEDUC - OPÇÃO 03","UN",2,2,null,null,null,null,null,""]
[2,2,2,2,3,1,0,0,0,107,2,"F","Nível 2","Nível 2","3.1.","SINAPI",null,"SERVIÇOS PRELIMINARES","-",null,2,null,null,null,null,null,""]
["S",2,"S",0,3,1,0,0,0,0,0,"F","Serviço","Serviço","3.1.0.0.1.","AGETOP",20701,"LOCAÇÃO DA OBRA, EXECUÇÃO DE GABARITO SEM REAPROVEITAMENTO, INCLUSO PINTURA (FACE INTERNA DO RIPÃO 15CM) E PIQUETE COM TESTEMUNHA","m2    ",133.97999999999999,2,null,null,null,null,null,""]
[2,2,2,3,3,2,0,0,0,105,3,"F","Nível 2","Nível 2","3.2.","SINAPI",null,"TRANSPORTES","-",null,2,null,null,null,null,null,""]
["S",2,"S",0,3,2,0,0,0,0,0,"F","Serviço","Serviço","3.2.0.0.1.","SINAPI",72897,"CARGA MANUAL DE ENTULHO EM CAMINHAO BASCULANTE 6 M3","M3",9.3786000000000005,2,null,null,null,null,null,""]
["S",2,"S",0,3,2,0,0,0,0,0,"F","Serviço","Serviço","3.2.0.0.2.","SINAPI",72900,"TRANSPORTE DE ENTULHO COM CAMINHAO BASCULANTE 6 M3, RODOVIA PAVIMENTADA, DMT 0,5 A 1,0 KM","M3",9.3786000000000005,2,null,null,null,null,null,""]
[2,2,2,3,3,3,0,0,0,102,3,"F","Nível 2","Nível 2","3.3.","SINAPI",null,"SERVIÇO EM TERRA","-",null,2,null,null,null,null,null,""]
["S",2,"S",0,3,3,0,0,0,0,0,"F","Serviço","Serviço","3.3.0.0.1.","SINAPI",93358,"ESCAVAÇÃO MANUAL DE VALA COM PROFUNDIDADE MENOR OU IGUAL A 1,30 M. AF_03/2016","M3",6.6989999999999998,2,null,null,null,null,null,"Referência: AGETOP - 40101"]
["S",2,"S",0,3,3,0,0,0,0,0,"F","Serviço","Serviço","3.3.0.0.2.","AGETOP",41002,"APILOAMENTO","m2    ",133.97999999999999,2,null,null,null,null,null,""]
[2,2,2,11,3,4,0,0,0,99,11,"F","Nível 2","Nível 2","3.4.","SINAPI",null,"FUNDAÇÕES E SONDAGENS","-",null,2,null,null,null,null,null,""]
["S",2,"S",0,3,4,0,0,0,0,0,"F","Serviço","Serviço","3.4.0.0.1.","SINAPI",98230,"ESTACA BROCA DE CONCRETO, DIÂMETRO DE 30 CM, PROFUNDIDADE DE ATÉ 3 M, ESCAVAÇÃO MANUAL COM TRADO CONCHA, NÃO ARMADA. AF_03/2018","M",49,2,null,null,null,null,null,"Referência: AGETOP - 50302"]
["S",2,"S",0,3,4,0,0,0,0,0,"F","Serviço","Serviço","3.4.0.0.2.","SINAPI",96521,"ESCAVAÇÃO MECANIZADA PARA BLOCO DE COROAMENTO OU SAPATA, COM PREVISÃO DE FÔRMA, COM RETROESCAVADEIRA. AF_06/2017","M3",4.8600000000000003,2,null,null,null,null,null,""]
["S",2,"S",0,3,4,0,0,0,0,0,"F","Serviço","Serviço","3.4.0.0.3.","SINAPI",93382,"REATERRO MANUAL DE VALAS COM COMPACTAÇÃO MECANIZADA. AF_04/2016","M3",0.36,2,null,null,null,null,null,"Referência: AGETOP - 40904"]
["S",2,"S",0,3,4,0,0,0,0,0,"F","Serviço","Serviço","3.4.0.0.4.","SINAPI",96534,"FABRICAÇÃO, MONTAGEM E DESMONTAGEM DE FÔRMA PARA BLOCO DE COROAMENTO, EM MADEIRA SERRADA, E=25 MM, 4 UTILIZAÇÕES. AF_06/2017","M2",4.5,2,null,null,null,null,null,"Referência: AGETOP - 51009"]
["S",2,"S",0,3,4,0,0,0,0,0,"F","Serviço","Serviço","3.4.0.0.5.","SINAPI",94963,"CONCRETO FCK = 15MPA, TRAÇO 1:3,4:3,5 (CIMENTO/ AREIA MÉDIA/ BRITA 1)  - PREPARO MECÂNICO COM BETONEIRA 400 L. AF_07/2016","M3",0.23,2,null,null,null,null,null,""]
["S",2,"S",0,3,4,0,0,0,0,0,"F","Serviço","Serviço","3.4.0.0.6.","SINAPI",94964,"CONCRETO FCK = 20MPA, TRAÇO 1:2,7:3 (CIMENTO/ AREIA MÉDIA/ BRITA 1)  - PREPARO MECÂNICO COM BETONEIRA 400 L. AF_07/2016","M3",2.7,2,null,null,null,null,null,""]
["S",2,"S",0,3,4,0,0,0,0,0,"F","Serviço","Serviço","3.4.0.0.7.","SINAPI",92874,"LANÇAMENTO COM USO DE BOMBA, ADENSAMENTO E ACABAMENTO DE CONCRETO EM ESTRUTURAS. AF_12/2015","M3",2.93,2,null,null,null,null,null,""]
["S",2,"S",0,3,4,0,0,0,0,0,"F","Serviço","Serviço","3.4.0.0.8.","SINAPI",96544,"ARMAÇÃO DE BLOCO, VIGA BALDRAME OU SAPATA UTILIZANDO AÇO CA-50 DE 6,3 MM - MONTAGEM. AF_06/2017","KG",33,2,null,null,null,null,null,"Referência: AGETOP - 52003"]
["S",2,"S",0,3,4,0,0,0,0,0,"F","Serviço","Serviço","3.4.0.0.9.","SINAPI",96545,"ARMAÇÃO DE BLOCO, VIGA BALDRAME OU SAPATA UTILIZANDO AÇO CA-50 DE 8 MM - MONTAGEM. AF_06/2017","KG",148,2,null,null,null,null,null,"Referência: AGETOP - 52004"]
["S",2,"S",0,3,4,0,0,0,0,0,"F","Serviço","Serviço","3.4.0.0.10.","SINAPI",96543,"ARMAÇÃO DE BLOCO, VIGA BALDRAME E SAPATA UTILIZANDO AÇO CA-60 DE 5 MM - MONTAGEM. AF_06/2017","KG",26,2,null,null,null,null,null,"Referência: AGETOP - 52014"]
[2,2,2,8,3,5,0,0,0,88,8,"F","Nível 2","Nível 2","3.5.","SINAPI",null,"ESTRUTURA","-",null,2,null,null,null,null,null,""]
["S",2,"S",0,3,5,0,0,0,0,0,"F","Serviço","Serviço","3.5.0.0.1.","SINAPI",92415,"MONTAGEM E DESMONTAGEM DE FÔRMA DE PILARES RETANGULARES E ESTRUTURAS SIMILARES COM ÁREA MÉDIA DAS SEÇÕES MAIOR QUE 0,25 M², PÉ-DIREITO SIMPLES, EM CHAPA DE MADEIRA COMPENSADA RESINADA, 2 UTILIZAÇÕES. AF_12/2015","M2",40.270000000000003,2,null,null,null,null,null,""]
["S",2,"S",0,3,5,0,0,0,0,0,"F","Serviço","Serviço","3.5.0.0.2.","AGETOP",60192,"FORMA DE TABUA CINTA/PILAR SOBRE/ENTRE ALVENARIA U=8 VEZES","m2    ",93.44,2,null,null,null,null,null,""]
["S",2,"S",0,3,5,0,0,0,0,0,"F","Serviço","Serviço","3.5.0.0.3.","SINAPI",92777,"ARMAÇÃO DE PILAR OU VIGA DE UMA ESTRUTURA CONVENCIONAL DE CONCRETO ARMADO EM UMA EDIFICAÇÃO TÉRREA OU SOBRADO UTILIZANDO AÇO CA-50 DE 8,0 MM - MONTAGEM. AF_12/2015","KG",104,2,null,null,null,null,null,"Referência: AGETOP - 60304"]
["S",2,"S",0,3,5,0,0,0,0,0,"F","Serviço","Serviço","3.5.0.0.4.","SINAPI",92778,"ARMAÇÃO DE PILAR OU VIGA DE UMA ESTRUTURA CONVENCIONAL DE CONCRETO ARMADO EM UMA EDIFICAÇÃO TÉRREA OU SOBRADO UTILIZANDO AÇO CA-50 DE 10,0 MM - MONTAGEM. AF_12/2015","KG",295,2,null,null,null,null,null,"Referência: AGETOP - 60305"]
["S",2,"S",0,3,5,0,0,0,0,0,"F","Serviço","Serviço","3.5.0.0.5.","SINAPI",92775,"ARMAÇÃO DE PILAR OU VIGA DE UMA ESTRUTURA CONVENCIONAL DE CONCRETO ARMADO EM UMA EDIFICAÇÃO TÉRREA OU SOBRADO UTILIZANDO AÇO CA-60 DE 5,0 MM - MONTAGEM. AF_12/2015","KG",143,2,null,null,null,null,null,"Referência: AGETOP - 60314"]
["S",2,"S",0,3,5,0,0,0,0,0,"F","Serviço","Serviço","3.5.0.0.6.","SINAPI",94964,"CONCRETO FCK = 20MPA, TRAÇO 1:2,7:3 (CIMENTO/ AREIA MÉDIA/ BRITA 1)  - PREPARO MECÂNICO COM BETONEIRA 400 L. AF_07/2016","M3",5.08,2,null,null,null,null,null,""]
["S",2,"S",0,3,5,0,0,0,0,0,"F","Serviço","Serviço","3.5.0.0.7.","SINAPI",92874,"LANÇAMENTO COM USO DE BOMBA, ADENSAMENTO E ACABAMENTO DE CONCRETO EM ESTRUTURAS. AF_12/2015","M3",5.08,2,null,null,null,null,null,""]
[2,2,2,18,3,6,0,0,0,80,18,"F","Nível 2","Nível 2","3.6.","SINAPI",null,"INSTALAÇÕES ELÉTRICAS","-",null,2,null,null,null,null,null,""]
["S",2,"S",0,3,6,0,0,0,0,0,"F","Serviço","Serviço","3.6.0.0.1.","AGETOP",70351,"BRACADEIRA METALICA TIPO \"U\" DIAM. 3/4\"","Un    ",30,2,null,null,null,null,null,""]
["S",2,"S",0,3,6,0,0,0,0,0,"F","Serviço","Serviço","3.6.0.0.2.","AGETOP",70421,"BUCHA E ARRUELA METALICA DIAM. 3/4\"","PR    ",15,2,null,null,null,null,null,""]
["S",2,"S",0,3,6,0,0,0,0,0,"F","Serviço","Serviço","3.6.0.0.3.","SINAPI",91927,"CABO DE COBRE FLEXÍVEL ISOLADO, 2,5 MM², ANTI-CHAMA 0,6/1,0 KV, PARA CIRCUITOS TERMINAIS - FORNECIMENTO E INSTALAÇÃO. AF_12/2015","M",210,2,null,null,null,null,null,"Referência: AGETOP - 70581"]
["S",2,"S",0,3,6,0,0,0,0,0,"F","Serviço","Serviço","3.6.0.0.4.","SINAPI",91936,"CAIXA OCTOGONAL 4\" X 4\", PVC, INSTALADA EM LAJE - FORNECIMENTO E INSTALAÇÃO. AF_12/2015","UN",12,2,null,null,null,null,null,""]
["S",2,"S",0,3,6,0,0,0,0,0,"F","Serviço","Serviço","3.6.0.0.5.","SINAPI",91940,"CAIXA RETANGULAR 4\" X 2\" MÉDIA (1,30 M DO PISO), PVC, INSTALADA EM PAREDE - FORNECIMENTO E INSTALAÇÃO. AF_12/2015","UN",5,2,null,null,null,null,null,""]
["S",2,"S",0,3,6,0,0,0,0,0,"F","Serviço","Serviço","3.6.0.0.6.","SINAPI",95817,"CONDULETE DE PVC, TIPO X, PARA ELETRODUTO DE PVC SOLDÁVEL DN 25 MM (3/4''), APARENTE - FORNECIMENTO E INSTALAÇÃO. AF_11/2016","UN",5,2,null,null,null,null,null,""]
[{"$f":"CHOOSE(1+LOG(1+2*(ORÇAMENTO.Nivel=\"Nível 1\")+4*(ORÇAMENTO.Nivel=\"Nível 2\")+8*(ORÇAMENTO.Nivel=\"Nível 3\")+16*(ORÇAMENTO.Nivel=\"Nível 4\")+32*(ORÇAMENTO.Nivel=\"Serviço\"),2),0,1,2,3,4,\"S\")","v":"S"},2,"S",0,3,6,0,0,{"$f":"IF(AND($C449<=4,$C449<>0),0,IF(AND($C449=\"S\",$Y449>0),OFFSET(I449,-1,0)+1,OFFSET(I449,-1,0)))","v":0},0,0,"F","Serviço","Serviço","3.6.0.0.7.","SINAPI",91914,"CURVA 90 GRAUS PARA ELETRODUTO, PVC, ROSCÁVEL, DN 25 MM (3/4\"), PARA CIRCUITOS TERMINAIS, INSTALADA EM PAREDE - FORNECIMENTO E INSTALAÇÃO. AF_12/2015","UN",5,2,null,null,null,null,null,""]
["S",{"$f":"IF(OR(C450=\"s\",C450=0),OFFSET(B450,-1,0),C450)","v":2},"S",{"$f":"IF(OR(C450=\"S\",C450=0),0,IF(ISERROR(K450),J450,SMALL(J450:K450,1)))","v":0},3,6,0,0,0,0,0,"F","Serviço","Serviço","3.6.0.0.8.","SINAPI",93654,"DISJUNTOR MONOPOLAR TIPO DIN, CORRENTE NOMINAL DE 16A - FORNECIMENTO E INSTALAÇÃO. AF_04/2016","UN",4,2,null,null,null,null,null,""]
["S",2,{"$f":"IF(OFFSET(C451,-1,0)=\"L\",1,IF(OFFSET(C451,-1,0)=1,2,IF(OR(A451=\"s\",A451=0),\"S\",IF(AND(OFFSET(C451,-1,0)=2,A451=4),3,IF(AND(OR(OFFSET(C451,-1,0)=\"s\",OFFSET(C451,-1,0)=0),A451<>\"s\",A451>OFFSET(B451,-1,0)),OFFSET(B451,-1,0),A451)))))","v":"S"},0,{"$f":"IF($C451=1,OFFSET(E451,-1,0)+1,OFFSET(E451,-1,0))","v":3},{"$f":"IF($C451=1,0,IF($C451=2,OFFSET(F451,-1,0)+1,OFFSET(F451,-1,0)))","v":6},{"$f":"IF(AND($C451<=2,$C451<>0),0,IF($C451=3,OFFSET(G451,-1,0)+1,OFFSET(G451,-1,0)))","v":0},{"$f":"IF(AND($C451<=3,$C451<>0),0,IF($C451=4,OFFSET(H451,-1,0)+1,OFFSET(H451,-1,0)))","v":0},0,0,0,"F","Serviço","Serviço","3.6.0.0.9.","SINAPI",93671,"DISJUNTOR TRIPOLAR TIPO DIN, CORRENTE NOMINAL DE 32A - FORNECIMENTO E INSTALAÇÃO. AF_04/2016","UN",1,2,null,null,null,null,null,"Referência: AGETOP - 71173"]
["S",2,"S",0,3,6,0,0,0,0,0,"F","Serviço","Serviço","3.6.0.0.10.","SINAPI",91871,"ELETRODUTO RÍGIDO ROSCÁVEL, PVC, DN 25 MM (3/4\"), PARA CIRCUITOS TERMINAIS, INSTALADO EM PAREDE - FORNECIMENTO E INSTALAÇÃO. AF_12/2015","M",45,2,null,null,null,null,null,"Referência: AGETOP - 71201"]
["S",2,"S",0,3,6,0,0,0,0,0,"F","Serviço","Serviço","3.6.0.0.11.","SINAPI",91981,"INTERRUPTOR BIPOLAR (1 MÓDULO), 10A/250V, INCLUINDO SUPORTE E PLACA - FORNECIMENTO E INSTALAÇÃO. AF_09/2017","UN",3,2,null,null,null,null,null,""]
["S",2,"S",0,3,6,0,0,0,0,0,"F","Serviço","Serviço","3.6.0.0.12.","SINAPI",91967,"INTERRUPTOR SIMPLES (3 MÓDULOS), 10A/250V, INCLUINDO SUPORTE E PLACA - FORNECIMENTO E INSTALAÇÃO. AF_12/2015","UN",1,2,null,null,null,null,null,"Referência: AGETOP - 71442"]
["S",2,"S",0,3,6,0,0,0,0,0,"F","Serviço","Serviço","3.6.0.0.13.","SINAPI",97610,"LÂMPADA COMPACTA DE LED 10 W, BASE E27 - FORNECIMENTO E INSTALAÇÃO. AF_11/2017","UN",24,2,null,null,null,null,null,""]
["S",2,"S",0,3,6,0,0,0,0,0,"F","Serviço","Serviço","3.6.0.0.14.","SINAPI",97591,"LUMINÁRIA TIPO PLAFON REDONDO COM VIDRO FOSCO, DE SOBREPOR, COM 2 LÂMPADAS DE 15 W - FORNECIMENTO E INSTALAÇÃO. AF_11/2017","UN",12,2,null,null,null,null,null,""]
["S",2,"S",0,3,6,0,0,0,0,0,"F","Serviço","Serviço","3.6.0.0.15.","SINAPI",91884,"LUVA PARA ELETRODUTO, PVC, ROSCÁVEL, DN 25 MM (3/4\"), PARA CIRCUITOS TERMINAIS, INSTALADA EM PAREDE - FORNECIMENTO E INSTALAÇÃO. AF_12/2015","UN",15,2,null,null,null,null,null,"Referência: AGETOP - 71741"]
["S",2,"S",0,3,6,0,0,0,0,0,"F","Serviço","Serviço","3.6.0.0.16.","SINAPI",91996,"TOMADA MÉDIA DE EMBUTIR (1 MÓDULO), 2P+T 10 A, INCLUINDO SUPORTE E PLACA - FORNECIMENTO E INSTALAÇÃO. AF_12/2015","UN",3,2,null,null,null,null,null,"Referência: AGETOP - 72578"]
["S",2,"S",0,3,6,0,0,0,0,0,"F","Serviço","Serviço","3.6.0.0.17.","SINAPI",91997,"TOMADA MÉDIA DE EMBUTIR (1 MÓDULO), 2P+T 20 A, INCLUINDO SUPORTE E PLACA - FORNECIMENTO E INSTALAÇÃO. AF_12/2015","UN",1,2,null,null,null,null,null,""]
[2,2,2,31,3,7,0,0,0,62,31,"F","Nível 2","Nível 2","3.7.","SINAPI",null,"INSTALAÇÕES HIDROSSANITÁRIAS","-",null,2,null,null,null,null,null,""]
[3,3,3,10,3,7,1,0,0,30,10,"F","Nível 3","Nível 3","3.7.1.","SINAPI",null,"PELAS E ACESSÓRIOS","-",null,2,null,null,null,null,null,""]
["S",3,"S",0,3,7,1,0,0,0,0,"F","Serviço","Serviço","3.7.1.0.1.","AGETOP",81501,"ADESIVO PLASTICO - FRASCO 850 G","Un    ",2,2,null,null,null,null,null,""]
["S",3,"S",0,3,7,1,0,0,0,0,"F","Serviço","Serviço","3.7.1.0.2.","AGETOP",81504,"SOLUCAO LIMPADORA 1000 CM3","Un    ",2,2,null,null,null,null,null,""]
["S",3,"S",0,3,7,1,0,0,0,0,"F","Serviço","Serviço","3.7.1.0.3.","AGETOP",81825,"CAIXA DE PASSAGEM 60 X 60 CM SEM TAMPA","Un    ",1,2,null,null,null,null,null,""]
["S",3,"S",0,3,7,1,0,0,0,0,"F","Serviço","Serviço","3.7.1.0.4.","SINAPI",6171,"TAMPA DE CONCRETO ARMADO 60X60X5CM PARA CAIXA","UN",1,2,null,null,null,null,null,""]
["S",3,"S",0,3,7,1,0,0,0,0,"F","Serviço","Serviço","3.7.1.0.5.","SINAPI",86901,"CUBA DE EMBUTIR OVAL EM LOUÇA BRANCA, 35 X 50CM OU EQUIVALENTE - FORNECIMENTO E INSTALAÇÃO. AF_12/2013","UN",2,2,null,null,null,null,null,"Referência: AGETOP - 80587"]
["S",3,"S",0,3,7,1,0,0,{"$f":"IF(OR($C467=\"S\",$C467=0),0,MATCH(0,OFFSET($D467,1,$C467,ROW($C$522)-ROW($C467)),0))","v":0},{"$f":"IF(OR($C467=\"S\",$C467=0),0,MATCH(OFFSET($D467,0,$C467)+1,OFFSET($D467,1,$C467,ROW($C$522)-ROW($C467)),0))","v":0},"F","Serviço","Serviço","3.7.1.0.6.","AGETOP",80556,"LIGAÇÃO FLEXÍVEL PVC DIAM.1/2\" (ENGATE)","Un    ",2,2,null,null,null,null,null,""]
["S",3,"S",0,3,7,1,0,0,0,0,"F","Serviço","Serviço","3.7.1.0.7.","AGETOP",80562,"SIFAO FLEXIVEL UNIVERSAL ( SANFONADO) EM PVC PARA LAVATORIO","Un    ",2,2,null,null,null,null,null,""]
["S",3,"S",0,3,7,1,0,0,0,0,"F","Serviço","Serviço","3.7.1.0.8.","SINAPI",86877,"VÁLVULA EM METAL CROMADO 1.1/2\" X 1.1/2\" PARA TANQUE OU LAVATÓRIO, COM OU SEM LADRÃO - FORNECIMENTO E INSTALAÇÃO. AF_12/2013","UN",2,2,null,null,null,null,null,"Referência: AGETOP - 80580"]
["S",3,"S",0,3,7,1,0,0,0,0,"F","Serviço","Serviço","3.7.1.0.9.","AGETOP",80570,"TORNEIRA DE MESA PARA LAVATÓRIO DIÂMETRO DE 1/2\"","Un    ",2,2,null,null,null,null,null,""]
[3,3,3,12,3,7,2,0,0,20,12,"F","Nível 3","Nível 3","3.7.2.",null,null,"ÁGUA FRIA","-",null,2,null,null,null,null,null,""]
["S",3,"S",0,3,7,2,0,0,0,0,"F","Serviço","Serviço","3.7.2.0.1.","AGETOP",80927,"REGISTRO DE GAVETA C/CANOPLA DIAMETRO 1\"","Un    ",1,2,null,null,null,null,null,""]
["S",3,"S",0,3,7,2,0,0,0,0,"F","Serviço","Serviço","3.7.2.0.2.","SINAPI",89402,"TUBO, PVC, SOLDÁVEL, DN 25MM, INSTALADO EM RAMAL DE DISTRIBUIÇÃO DE ÁGUA - FORNECIMENTO E INSTALAÇÃO. AF_12/2014","M",3,2,null,null,null,null,null,"Referência: AGETOP - 81003"]
["S",3,"S",0,3,7,2,0,0,0,0,"F","Serviço","Serviço","3.7.2.0.3.","SINAPI",89447,"TUBO, PVC, SOLDÁVEL, DN 32MM, INSTALADO EM PRUMADA DE ÁGUA - FORNECIMENTO E INSTALAÇÃO. AF_12/2014","M",6,2,null,null,null,null,null,""]
["S",3,"S",0,3,7,2,0,0,0,0,"F","Serviço","Serviço","3.7.2.0.4.","SINAPI",94709,"ADAPTADOR COM FLANGES LIVRES, PVC, SOLDÁVEL, DN 32 MM X 1 , INSTALADO EM RESERVAÇÃO DE ÁGUA DE EDIFICAÇÃO QUE POSSUA RESERVATÓRIO DE FIBRA/FIBROCIMENTO   FORNECIMENTO E INSTALAÇÃO. AF_06/2016","UN",2,2,null,null,null,null,null,"Referência: AGETOP - 81042"]
["S",3,"S",0,3,7,2,0,0,0,0,"F","Serviço","Serviço","3.7.2.0.5.","SINAPI",96662,"BUCHA DE REDUÇÃO, PPR, 32 X 25, CLASSE PN 25, INSTALADO EM RAMAL DE DISTRIBUIÇÃO DE ÁGUA \u0096 FORNECIMENTO E INSTALAÇÃO . AF_06/2015","UN",1,2,null,null,null,null,null,""]
["S",3,"S",0,3,7,2,0,0,0,0,"F","Serviço","Serviço","3.7.2.0.6.","SINAPI",89481,"JOELHO 90 GRAUS, PVC, SOLDÁVEL, DN 25MM, INSTALADO EM PRUMADA DE ÁGUA - FORNECIMENTO E INSTALAÇÃO. AF_12/2014","UN",1,2,null,null,null,null,null,""]
["S",3,"S",0,3,7,2,0,0,0,0,"F","Serviço","Serviço","3.7.2.0.7.","AGETOP",81341,"JOELHO 90 GRAUS ROSCAVEL 1/2\" (MARROM)","Un    ",3,2,null,null,null,null,null,""]
["S",3,"S",0,3,7,2,0,0,0,0,"F","Serviço","Serviço","3.7.2.0.8.","AGETOP",81342,"JOELHO 90 GRAUS ROSCAVEL DIAMETRO 3/4\"","Un    ",1,2,null,null,null,null,null,""]
["S",3,"S",0,3,7,2,0,0,0,0,"F","Serviço","Serviço","3.7.2.0.9.","AGETOP",81322,"JOELHO 90 GRAUS SOLDAVEL DIAMETRO 32 MM (1\")","Un    ",20,2,null,null,null,null,null,""]
["S",3,"S",0,3,7,2,0,0,0,0,"F","Serviço","Serviço","3.7.2.0.10.","AGETOP",81421,"TE REDUCAO 90 GRAUS SOLDAVEL 32 X 25 mm","Un    ",2,2,null,null,null,null,null,""]
["S",3,"S",0,3,7,2,0,0,0,0,"F","Serviço","Serviço","3.7.2.0.11.","SINAPI",89617,"TE, PVC, SOLDÁVEL, DN 25MM, INSTALADO EM PRUMADA DE ÁGUA - FORNECIMENTO E INSTALAÇÃO. AF_12/2014","UN",1,2,null,null,null,null,null,""]
[3,3,3,8,3,7,3,0,0,8,{"$error":"#N/A"},"F","Nível 3","Nível 3","3.7.3.",null,null,"ESGOTO SANITÁRIO","-",null,2,null,null,null,null,null,""]
["S",3,"S",0,3,7,3,0,0,0,0,"F","Serviço","Serviço","3.7.3.0.1.","AGETOP",81663,"CORPO CX. SIFONADA DIAM. 150 X 150 X 50","Un    ",1,2,null,null,null,null,null,""]
["S",3,"S",0,3,7,3,0,0,0,0,"F","Serviço","Serviço","3.7.3.0.2.","AGETOP",81752,"GRELHA QUADRADA ACO INOX ROTATIVO DIAM.150 MM","Un    ",1,2,null,null,null,null,null,""]
["S",3,"S",0,3,7,3,0,0,0,0,"F","Serviço","Serviço","3.7.3.0.3.","SINAPI",89726,"JOELHO 45 GRAUS, PVC, SERIE NORMAL, ESGOTO PREDIAL, DN 40 MM, JUNTA SOLDÁVEL, FORNECIDO E INSTALADO EM RAMAL DE DESCARGA OU RAMAL DE ESGOTO SANITÁRIO. AF_12/2014","UN",2,2,null,null,null,null,null,""]
["S",3,"S",0,3,7,3,0,0,0,0,"F","Serviço","Serviço","3.7.3.0.4.","SINAPI",89724,"JOELHO 90 GRAUS, PVC, SERIE NORMAL, ESGOTO PREDIAL, DN 40 MM, JUNTA SOLDÁVEL, FORNECIDO E INSTALADO EM RAMAL DE DESCARGA OU RAMAL DE ESGOTO SANITÁRIO. AF_12/2014","UN",3,2,null,null,null,null,null,""]
["S",3,"S",0,3,7,3,0,0,0,0,"F","Serviço","Serviço","3.7.3.0.5.","AGETOP",81927,"JOELHO 90 GRAUS C/ANEL 40 mm ","Un    ",3,2,null,null,null,null,null,""]
["S",3,"S",0,3,7,3,0,0,0,0,"F","Serviço","Serviço","3.7.3.0.6.","SINAPI",89711,"TUBO PVC, SERIE NORMAL, ESGOTO PREDIAL, DN 40 MM, FORNECIDO E INSTALADO EM RAMAL DE DESCARGA OU RAMAL DE ESGOTO SANITÁRIO. AF_12/2014","M",6,2,null,null,null,null,null,"Referência: AGETOP - 82301"]
["S",3,"S",0,3,7,3,0,0,0,0,"F","Serviço","Serviço","3.7.3.0.7.","SINAPI",89798,"TUBO PVC, SERIE NORMAL, ESGOTO PREDIAL, DN 50 MM, FORNECIDO E INSTALADO EM PRUMADA DE ESGOTO SANITÁRIO OU VENTILAÇÃO. AF_12/2014","M",3,2,null,null,null,null,null,""]
[2,2,2,4,3,8,0,0,0,31,4,"F","Nível 2","Nível 2","3.8.","SINAPI",null,"ALVENARIAS E DIVISÓRIAS","-",null,2,null,null,null,null,null,""]
["S",2,"S",0,3,8,0,0,0,0,0,"F","Serviço","Serviço","3.8.0.0.1.","SINAPI",87471,"ALVENARIA DE VEDAÇÃO DE BLOCOS CERÂMICOS FURADOS NA VERTICAL DE 9X19X39CM (ESPESSURA 9CM) DE PAREDES COM ÁREA LÍQUIDA MENOR QUE 6M² SEM VÃOS E ARGAMASSA DE ASSENTAMENTO COM PREPARO EM BETONEIRA. AF_06/2014","M2",56.3,2,null,null,null,null,null,""]
["S",2,"S",0,3,8,0,0,0,0,0,"F","Serviço","Serviço","3.8.0.0.2.","SINAPI",93202,"FIXAÇÃO (ENCUNHAMENTO) DE ALVENARIA DE VEDAÇÃO COM TIJOLO MACIÇO. AF_03/2016","M",5.6,2,null,null,null,null,null,"Referência: AGETOP - 100204"]
["S",2,"S",0,3,8,0,0,0,0,0,"F","Serviço","Serviço","3.8.0.0.3.","SINAPI",95465,"COBOGO CERAMICO (ELEMENTO VAZADO), 9X20X20CM, ASSENTADO COM ARGAMASSA TRACO 1:4 DE CIMENTO E AREIA","M2",35.909999999999997,2,null,null,null,null,null,""]
[2,2,2,2,3,9,0,0,0,27,2,"F","Nível 2","Nível 2","3.9.","SINAPI",null,"IMPERMEABILIZAÇÃO","-",null,2,null,null,null,null,null,""]
["S",2,"S",0,3,9,0,0,0,0,0,"F","Serviço","Serviço","3.9.0.0.1.","SINAPI",98562,"IMPERMEABILIZAÇÃO DE FLOREIRA OU VIGA BALDRAME COM ARGAMASSA DE CIMENTO E AREIA, COM ADITIVO IMPERMEABILIZANTE, E = 2 CM. AF_06/2018","M2",40.35,2,null,null,null,null,null,"Referência: AGETOP - 120902"]
[2,2,2,2,3,10,0,0,0,25,2,"F","Nível 2","Nível 2","3.10.",null,null,"ESTRUTURAS METÁLICAS","-",null,2,null,null,null,null,null,""]
["S",2,"S",0,3,10,0,0,0,0,0,"F","Serviço","Serviço","3.10.0.0.1.","AGETOP",150103,"ESTRUTURA METÁLICA CONVENCIONAL EM AÇO DO TIPO USI SAC-300 COM FUNDO ANTICORROSIVO","Kg    ",2414.2600000000002,2,null,null,null,null,null,""]
[2,2,2,4,3,11,0,0,0,23,4,"F","Nível 2","Nível 2","3.11.",null,null,"COBERTURAS","-",null,2,null,null,null,null,null,""]
["S",2,"S",0,3,11,0,0,0,0,0,"F","Serviço","Serviço","3.11.0.0.1.","SINAPI",94445,"TELHAMENTO COM TELHA CERÂMICA CAPA-CANAL, TIPO PLAN, COM ATÉ 2 ÁGUAS, INCLUSO TRANSPORTE VERTICAL. AF_07/2019","M2",179.17,2,null,null,null,null,null,"Referência: AGETOP - 160401"]
["S",2,"S",0,3,11,0,0,0,0,0,"F","Serviço","Serviço","3.11.0.0.2.","SINAPI",94221,"CUMEEIRA PARA TELHA CERÂMICA EMBOÇADA COM ARGAMASSA TRAÇO 1:2:9 (CIMENTO, CAL E AREIA) PARA TELHADOS COM ATÉ 2 ÁGUAS, INCLUSO TRANSPORTE VERTICAL. AF_07/2019","M",21.85,2,null,null,null,null,null,""]
["S",2,"S",0,3,11,0,0,0,0,0,"F","Serviço","Serviço","3.11.0.0.3.","SINAPI",94224,"EMBOÇAMENTO COM ARGAMASSA TRAÇO 1:2:9 (CIMENTO, CAL E AREIA). AF_07/2019","M",60.5,2,null,null,null,null,null,"Referência: AGETOP - 160403"]
[2,2,2,5,3,12,0,0,0,19,5,"F","Nível 2","Nível 2","3.12.",null,null,"REVESTIMENTO DE PAREDE","-",null,2,null,null,null,null,null,""]
["S",2,"S",0,3,12,0,0,0,0,0,"F","Serviço","Serviço","3.12.0.0.1.","SINAPI",87879,"CHAPISCO APLICADO EM ALVENARIAS E ESTRUTURAS DE CONCRETO INTERNAS, COM COLHER DE PEDREIRO.  ARGAMASSA TRAÇO 1:3 COM PREPARO EM BETONEIRA 400L. AF_06/2014","M2",98.18,2,null,null,null,null,null,""]
["S",2,"S",0,3,12,0,0,0,0,0,"F","Serviço","Serviço","3.12.0.0.2.","SINAPI",87286,"ARGAMASSA TRAÇO 1:1:6 (EM VOLUME DE CIMENTO, CAL E AREIA MÉDIA ÚMIDA) PARA EMBOÇO/MASSA ÚNICA/ASSENTAMENTO DE ALVENARIA DE VEDAÇÃO, PREPARO MECÂNICO COM BETONEIRA 400 L. AF_08/2019","M3",3.15,2,null,null,null,null,null,""]
["S",2,"S",0,3,12,0,0,0,0,0,"F","Serviço","Serviço","3.12.0.0.3.","SINAPI",87336,"ARGAMASSA TRAÇO 1:2:8 (EM VOLUME DE CIMENTO, CAL E AREIA MÉDIA ÚMIDA) PARA EMBOÇO/MASSA ÚNICA/ASSENTAMENTO DE ALVENARIA DE VEDAÇÃO, PREPARO MECÂNICO COM MISTURADOR DE EIXO HORIZONTAL DE 600 KG. AF_08/2019","M3",2.9454000000000002,2,null,null,null,null,null,""]
["S",2,"S",0,3,12,0,0,0,0,0,"F","Serviço","Serviço","3.12.0.0.4.","SINAPI",87274,"REVESTIMENTO CERÂMICO PARA PAREDES INTERNAS COM PLACAS TIPO ESMALTADA EXTRA DE DIMENSÕES 33X45 CM APLICADAS EM AMBIENTES DE ÁREA MENOR QUE 5 M² A MEIA ALTURA DAS PAREDES. AF_06/2014","M2",3.15,2,null,null,null,null,null,"Referência: AGETOP - 201302"]
[2,2,2,6,3,13,0,0,0,14,6,"F","Nível 2","Nível 2","3.13.","SINAPI",null,"REVESTIMENTO DE PISO","-",null,2,null,null,null,null,null,""]
["S",2,"S",0,3,13,0,0,0,0,0,"F","Serviço","Serviço","3.13.0.0.1.","SINAPI",95241,"LASTRO DE CONCRETO MAGRO, APLICADO EM PISOS OU RADIERS, ESPESSURA DE 5 CM. AF_07/2016","M2",133.97999999999999,2,null,null,null,null,null,""]
["S",2,"S",0,3,13,0,0,0,0,0,"F","Serviço","Serviço","3.13.0.0.2.","SINAPI",84191,"PISO EM GRANILITE, MARMORITE OU GRANITINA ESPESSURA 8 MM, INCLUSO JUNTAS DE DILATACAO PLASTICAS","M2",133.97999999999999,2,null,null,null,null,null,"Referência: AGETOP - 221101"]
["S",2,"S",0,3,13,0,0,0,0,0,"F","Serviço","Serviço","3.13.0.0.3.","SINAPI","73850/1","RODAPE EM MARMORITE, ALTURA 10CM","M",24.5,2,null,null,null,null,null,""]
["S",2,"S",0,3,13,0,0,0,0,0,"F","Serviço","Serviço","3.13.0.0.4.","AGETOP",221104,"RASPAGEM E APLICAÇÃO RESINA ACRÍLICA DUAS DEMÃOS","m2    ",136.42999999999998,2,null,null,null,null,null,""]
[{"$f":"CHOOSE(1+LOG(1+2*(ORÇAMENTO.Nivel=\"Nível 1\")+4*(ORÇAMENTO.Nivel=\"Nível 2\")+8*(ORÇAMENTO.Nivel=\"Nível 3\")+16*(ORÇAMENTO.Nivel=\"Nível 4\")+32*(ORÇAMENTO.Nivel=\"Serviço\"),2),0,1,2,3,4,\"S\")","v":"S"},2,"S",0,3,13,0,0,{"$f":"IF(AND($C513<=4,$C513<>0),0,IF(AND($C513=\"S\",$Y513>0),OFFSET(I513,-1,0)+1,OFFSET(I513,-1,0)))","v":0},0,0,"F","Serviço","Serviço","3.13.0.0.5.","SINAPI",94992,"EXECUÇÃO DE PASSEIO (CALÇADA) OU PISO DE CONCRETO COM CONCRETO MOLDADO IN LOCO, FEITO EM OBRA, ACABAMENTO CONVENCIONAL, ESPESSURA 6 CM, ARMADO. AF_07/2016","M2",33.72,2,null,null,null,null,null,""]
[2,{"$f":"IF(OR(C514=\"s\",C514=0),OFFSET(B514,-1,0),C514)","v":2},2,{"$f":"IF(OR(C514=\"S\",C514=0),0,IF(ISERROR(K514),J514,SMALL(J514:K514,1)))","v":4},3,14,0,0,0,8,4,"F","Nível 2","Nível 2","3.14.",null,null,"PINTURA","-",null,2,null,null,null,null,null,""]
["S",2,{"$f":"IF(OFFSET(C515,-1,0)=\"L\",1,IF(OFFSET(C515,-1,0)=1,2,IF(OR(A515=\"s\",A515=0),\"S\",IF(AND(OFFSET(C515,-1,0)=2,A515=4),3,IF(AND(OR(OFFSET(C515,-1,0)=\"s\",OFFSET(C515,-1,0)=0),A515<>\"s\",A515>OFFSET(B515,-1,0)),OFFSET(B515,-1,0),A515)))))","v":"S"},0,{"$f":"IF($C515=1,OFFSET(E515,-1,0)+1,OFFSET(E515,-1,0))","v":3},{"$f":"IF($C515=1,0,IF($C515=2,OFFSET(F515,-1,0)+1,OFFSET(F515,-1,0)))","v":14},{"$f":"IF(AND($C515<=2,$C515<>0),0,IF($C515=3,OFFSET(G515,-1,0)+1,OFFSET(G515,-1,0)))","v":0},{"$f":"IF(AND($C515<=3,$C515<>0),0,IF($C515=4,OFFSET(H515,-1,0)+1,OFFSET(H515,-1,0)))","v":0},0,0,0,"F","Serviço","Serviço","3.14.0.0.1.","SINAPI","74133/1","EMASSAMENTO COM MASSA A OLEO, UMA DEMAO","M2",21.35,2,null,null,null,null,null,""]
["S",2,"S",0,3,14,0,0,0,0,0,"F","Serviço","Serviço","3.14.0.0.2.","SINAPI",88489,"APLICAÇÃO MANUAL DE PINTURA COM TINTA LÁTEX ACRÍLICA EM PAREDES, DUAS DEMÃOS. AF_06/2014","M2",53.7,2,null,null,null,null,null,"Referência: AGETOP - 261001"]
["S",2,"S",0,3,14,0,0,0,0,0,"F","Serviço","Serviço","3.14.0.0.3.","SINAPI",79464,"PINTURA A OLEO, 2 DEMAOS","M2",21.35,2,null,null,null,null,null,""]
[2,2,2,4,3,15,0,0,0,4,{"$error":"#N/A"},"F","Nível 2","Nível 2","3.15.",null,null,"DIVERSOS","-",null,2,null,null,null,null,null,""]
["S",2,"S",0,3,15,0,0,0,0,0,"F","Serviço","Serviço","3.15.0.0.1.","AGETOP",270501,"LIMPEZA FINAL DE OBRA - (OBRAS CIVIS)","m2    ",133.97999999999999,2,null,null,null,null,null,""]
["S",2,"S",0,3,15,0,0,0,0,0,"F","Serviço","Serviço","3.15.0.0.2.","AGETOP",271608,"BANCADA DE GRANITO C/ESPELHO","m2    ",1,2,null,null,null,null,null,""]
["S",2,"S",0,3,15,0,0,0,0,0,"F","Serviço","Serviço","3.15.0.0.3.","AGETOP",271303,"BANCO DE CONCRETO POLIDO BASE EM ALVENARIA REBOCADA E PINTADA - PADRÃO AGETOP 2015","m     ",15.75,2,null,null,null,null,null,""]
[-1,null,-1,null,0,0,0,0,0,null,null,"F"]
[null,null,null,null,null,null,null,null,null,null,null,"F",null,null,null,null,null,"OBS: OS QUANTITATIVOS DE MATERIAIS  DAS INSTALAÇÕES HIDROSSANITÁRIAS, ELÉTRICAS E ESPECIAIS SÃO FORNECIDOS PELOS PROFISSIONAIS RESPONSÁVEIS PELOS RESPECTIVOS PROJETOS.",null,null,null,null,null,"VALOR TOTAL",null,628742.41999999993]
[null,null,null,null,null,null,null,null,null,null,null,"F",null,null,null,null,null,null,null,null,null,null,null,"VALOR BDI (21,36%)",null,134284.54]
[null,null,null,null,null,null,null,null,null,null,null,"F",null,null,null,null,null,null,null,null,null,null,null,"TOTAL ORÇAMENTO",null,763026.96]
[null,null,null,null,null,null,null,null,null,null,null,"F"]
[null,null,null,null,null,null,null,null,null,null,null,"F",null,null,null,null,null,null,null,null,null,null,null,"CUSTO POR M2 ³",null,221.63749172156574]
[null,null,null,null,null,null,null,null,null,null,null,"F",null,null,null,null,null,null,null,null,null,null,null,"MATERIAL S/ BDI",null,427760.32]
[null,null,null,null,null,null,null,null,null,null,null,"F",null,null,null,null,null,null,null,null,null,null,null,"MÃO DE OBRA S/ BDI",null,200982.09999999992]
[null,null,null,null,null,null,null,null,null,null,null,"F"]
[null,null,null,null,null,null,null,null,null,null,null,"F",null,null,null,null,"(1) Conforme previsto pelo DECRETO Nº 7.983, DE 8 DE ABRIL DE 2013, os preços adotados são aqueles constantes dos sistemas de referência indicados. Justifica-se o uso dos preços destas composições de custos unitários devido ao seu valor ser menor à mediana de seus correspondentes na tabela SINAPI;"]
[null,null,null,null,null,null,null,null,null,null,null,"F",null,null,null,null,"(2) Optou-se pelo uso das composições de custos da AGETOP para itens não presentes na SINAPI;"]
[null,null,null,null,null,null,null,null,null,null,null,"F",null,null,null,null,"(3) Para itens da AGETOP, os vidros não estão inclusos nas esquadrias e já foram considerados os custos de contramarco para as esquadrias de alumínio;"]
[null,null,null,null,null,null,null,null,null,null,null,"F",null,null,null,null,"(4) Nos casos em que houver execução de granitina e omissão do item AGETOP 221102, considerou-se que o quantitativo para o rodapé, de altura igual a 7cm, foi incorporado na área de piso;"]
[null,null,null,null,null,null,null,null,null,null,null,"F",null,null,null,null,"(5) O custo unitário aproximado por metro quadrado é calculado dividindo-se o valor total do orçamento pela área total de construção."]
[null,null,null,null,null,null,null,null,null,null,null,"F"]
[null,null,null,null,null,null,null,null,null,null,null,"F"]
[]
[null,null,null,null,null,null,null,null,null,null,null,null,null,null,"SOMATÓRIO DE SERVIÇOS"]
[null,null,null,null,null,null,null,null,null,null,null,null,null,null,"ITEM","DESCRIÇÃO DOS SERVIÇOS",null,null,"PREÇO SEM BDI",null,null,null,null,"PREÇO COM BDI",null,null,"PARTICIPAÇÃO ( % )"]
[null,null,null,null,null,null,null,null,null,null,null,null,null,null,"a.","SERVIÇOS PRELIMINARES",null,null,{"$f":"SUMIF($R$19:$R$522,$P541,$Z$19:$Z$522)","v":0},null,null,null,null,{"$f":"ROUND(S541*(1+BDI.Taxa),2)","v":0},null,null,{"$f":"IFERROR(ROUND($X541*100/$Z$525,2),0)","v":0}]
[null,null,null,null,null,null,null,null,null,null,null,null,null,null,"b.","TRANSPORTES",null,null,0,null,null,null,null,0,null,null,0]
[null,null,null,null,null,null,null,null,null,null,null,null,null,null,"c.","SERVIÇO EM TERRA",null,null,0,null,null,null,null,0,null,null,0]
[null,null,null,null,null,null,null,null,null,null,null,null,null,null,"d.","FUNDAÇÕES E SONDAGENS",null,null,0,null,null,null,null,0,null,null,0]
[null,null,null,null,null,null,null,null,null,null,null,null,null,null,"e.","ESTRUTURA",null,null,0,null,null,null,null,0,null,null,0]
[null,null,null,null,null,null,null,null,null,null,null,null,null,null,"f.","INSTALAÇÕES ELÉTRICAS",null,null,0,null,null,null,null,0,null,null,0]
[null,null,null,null,null,null,null,null,null,null,null,null,null,null,"g.","INSTALAÇÕES HIDROSSANITÁRIAS",null,null,0,null,null,null,null,0,null,null,0]
[null,null,null,null,null,null,null,null,null,null,null,null,null,null,"h","INSTALAÇÕES ESPECIAIS",null,null,0,null,null,null,null,0,null,null,0]
[null,null,null,null,null,null,null,null,null,null,null,null,null,null,"i.","ALVENARIAS E DIVISÓRIAS",null,null,0,null,null,null,null,0,null,null,0]
[null,null,null,null,null,null,null,null,null,null,null,null,null,null,"j.","ALVENARIA AUTO-PORTANTE",null,null,0,null,null,null,null,0,null,null,0]
[null,null,null,null,null,null,null,null,null,null,null,null,null,null,"k.","IMPERMEABILIZAÇÃO",null,null,0,null,null,null,null,0,null,null,0]
[null,null,null,null,null,null,null,null,null,null,null,null,null,null,"l.","ISOLAMENTO TÉRMICO E ACÚSTICO",null,null,0,null,null,null,null,0,null,null,0]
[null,null,null,null,null,null,null,null,null,null,null,null,null,null,"m.","ESTRUTURA DE MADEIRA",null,null,0,null,null,null,null,0,null,null,0]
[null,null,null,null,null,null,null,null,null,null,null,null,null,null,"n.","ESTRUTURAS METÁLICAS",null,null,0,null,null,null,null,0,null,null,0]
[null,null,null,null,null,null,null,null,null,null,null,null,null,null,"o.","COBERTURAS",null,null,0,null,null,null,null,0,null,null,0]
[null,null,null,null,null,null,null,null,null,null,null,null,null,null,"p.","ESQUADRIAS DE MADEIRA",null,null,0,null,null,null,null,0,null,null,0]
[null,null,null,null,null,null,null,null,null,null,null,null,null,null,"q.","ESQUADRIAS METÁLICAS",null,null,0,null,null,null,null,{"$f":"ROUND(S557*(1+BDI.Taxa),2)","v":0},null,null,0]
[null,null,null,null,null,null,null,null,null,null,null,null,null,null,"r.","VIDROS",null,null,0,null,null,null,null,0,null,null,0]
[null,null,null,null,null,null,null,null,null,null,null,null,null,null,"s.","REVESTIMENTO DE PAREDE",null,null,0,null,null,null,null,0,null,null,0]
[null,null,null,null,null,null,null,null,null,null,null,null,null,null,"t.","FORROS",null,null,0,null,null,null,null,0,null,null,0]
[null,null,null,null,null,null,null,null,null,null,null,null,null,null,"u.","REVESTIMENTO DE PISO",null,null,0,null,null,null,null,0,null,null,0]
[null,null,null,null,null,null,null,null,null,null,null,null,null,null,"v.","FERRAGENS",null,null,0,null,null,null,null,0,null,null,0]
[null,null,null,null,null,null,null,null,null,null,null,null,null,null,"w.","MARCENARIA",null,null,0,null,null,null,null,0,null,null,0]
[null,null,null,null,null,null,null,null,null,null,null,null,null,null,"x.","ADMINISTRAÇÃO",null,null,0,null,null,null,null,0,null,null,0]
[null,null,null,null,null,null,null,null,null,null,null,null,null,null,"y.","PINTURA",null,null,0,null,null,null,null,{"$f":"ROUND(S565*(1+BDI.Taxa),2)","v":0},null,null,0]
[null,null,null,null,null,null,null,null,null,null,null,null,null,null,"z.","DIVERSOS",null,null,0,null,null,null,null,{"$f":"IF(S566>0,IF((SUM(X541:Y565)+ROUND(S566*(1+BDI.Taxa),2))<>X568,X568-SUM(X541:Y565),ROUND(S566*(1+BDI.Taxa),2)),0)","v":0},null,null,{"$f":"IF(S566>0,IF((SUM(AA541:AA565)+IFERROR(ROUND($X566*100/$Z$525,2),0))<>AA568,AA568-SUM(AA541:AA565),IFERROR(ROUND($X566*100/$Z$525,2),0)),0)","v":0}]
[null,null,null,null,null,null,null,null,null,null,null,null,null,null,"TOTAL GERAL DO ORÇAMENTO (R$)",null,null,null,{"$f":"SUM(S541:W566)","v":0},null,null,null,null,{"$f":"SUM(X541:Y566)","v":0},null,null,{"$f":"SUM(AA541:AA566)","v":0}]
[null,null,null,null,null,null,null,null,null,null,null,null,null,null,null,null,null,null,{"$f":"$Z$523","v":628742.41999999993},null,null,null,null,{"$f":"$Z$525","v":763026.96},null,null,100]
[null,null,null,null,null,null,null,null,null,null,null,null,null,null,null,null,null,null,"(TOTAL SEM BDI)",null,null,null,null,"(TOTAL COM BDI)",null,null,"(ARRED porcentagem)"]
[null,null,null,null,null,null,null,null,null,null,null,null,null,null,null,null,null,null,{"$f":"IF(AND(S567=S568,S567>0),\"OK\",\"ERRO\")","v":"ERRO"},null,null,null,null,{"$f":"IF(AND(X567=X568,X567>0),\"OK\",\"ERRO\")","v":"ERRO"},null,null,{"$f":"IF(AA567=100,\"OK\",\"ERRO\")","v":"ERRO"}]
[]
[]
[null,null,null,null,null,null,null,null,null,null,null,null,null,null,"RESUMO GERAL DO ORÇAMENTO"]
[null,null,null,null,null,null,null,null,null,null,null,null,null,null,"ITEM","DESCRIÇÃO DOS SERVIÇOS",null,null,"PREÇO SEM BDI",null,null,null,null,"PREÇO COM BDI",null,null,"PARTICIPAÇÃO ( % )"]
[null,null,null,null,null,null,null,null,null,null,null,null,null,null,"1.",{"$f":"IFERROR(VLOOKUP(O575,$O$19:$Y$522,4,FALSE),\"\")","v":"REFORMA"},null,null,{"$f":"IF(P576=\"\",$S$596-SUM(OFFSET($S$574:S574,0,0,COUNTA($S$574:S574),1)),SUMIF($R$19:$R$522,$P575,$Z$19:$Z$522))","v":0},null,null,null,null,{"$f":"IF(P576=\"\",$X$596-SUM(OFFSET($X$574:X574,0,0,COUNTA($X$574:X574),1)),ROUND(S575*(1+BDI.Taxa),2))","v":0},null,null,{"$f":"IF(P576=\"\",$AA$596-SUM(OFFSET($AA$574:AA574,0,0,COUNTA($AA$574:AA574),1)),ROUND(X575*100/ORÇAMENTO.TotalOrçamento,2))","v":0}]
[null,null,null,null,null,null,null,null,null,null,null,null,null,null,"2.","VESTIÁRIO PADRÃO SEDUC",null,null,{"$f":"IF(P577=\"\",$S$596-SUM(OFFSET($S$574:S575,0,0,COUNTA($S$574:S575),1)),SUMIF($R$19:$R$522,$P576,$Z$19:$Z$522))","v":0},null,null,null,null,{"$f":"IF(P577=\"\",$X$596-SUM(OFFSET($X$574:X575,0,0,COUNTA($X$574:X575),1)),ROUND(S576*(1+BDI.Taxa),2))","v":0},null,null,{"$f":"IF(P577=\"\",$AA$596-SUM(OFFSET($AA$574:AA575,0,0,COUNTA($AA$574:AA575),1)),ROUND(X576*100/ORÇAMENTO.TotalOrçamento,2))","v":0}]
[null,null,null,null,null,null,null,null,null,null,null,null,null,null,"3.","PÁTIO MULTIUSO - PADRÃO SEDUC - OPÇÃO 03",null,null,{"$f":"IF(P578=\"\",$S$596-SUM(OFFSET($S$574:S576,0,0,COUNTA($S$574:S576),1)),SUMIF($R$19:$R$522,$P577,$Z$19:$Z$522))","v":628742.41999999993},null,null,null,null,{"$f":"IF(P578=\"\",$X$596-SUM(OFFSET($X$574:X576,0,0,COUNTA($X$574:X576),1)),ROUND(S577*(1+BDI.Taxa),2))","v":763026.96},null,null,{"$f":"IF(P578=\"\",$AA$596-SUM(OFFSET($AA$574:AA576,0,0,COUNTA($AA$574:AA576),1)),ROUND(X577*100/ORÇAMENTO.TotalOrçamento,2))","v":100}]
[null,null,null,null,null,null,null,null,null,null,null,null,null,null,"4.","",null,null,{"$f":"IF(P579=\"\",$S$596-SUM(OFFSET($S$574:S577,0,0,COUNTA($S$574:S577),1)),SUMIF($R$19:$R$522,$P578,$Z$19:$Z$522))","v":0},null,null,null,null,{"$f":"IF(P579=\"\",$X$596-SUM(OFFSET($X$574:X577,0,0,COUNTA($X$574:X577),1)),ROUND(S578*(1+BDI.Taxa),2))","v":0},null,null,{"$f":"IF(P579=\"\",$AA$596-SUM(OFFSET($AA$574:AA577,0,0,COUNTA($AA$574:AA577),1)),ROUND(X578*100/ORÇAMENTO.TotalOrçamento,2))","v":0}]
[null,null,null,null,null,null,null,null,null,null,null,null,null,null,"5.","",null,null,{"$f":"IF(P580=\"\",$S$596-SUM(OFFSET($S$574:S578,0,0,COUNTA($S$574:S578),1)),SUMIF($R$19:$R$522,$P579,$Z$19:$Z$522))","v":0},null,null,null,null,{"$f":"IF(P580=\"\",$X$596-SUM(OFFSET($X$574:X578,0,0,COUNTA($X$574:X578),1)),ROUND(S579*(1+BDI.Taxa),2))","v":0},null,null,{"$f":"IF(P580=\"\",$AA$596-SUM(OFFSET($AA$574:AA578,0,0,COUNTA($AA$574:AA578),1)),ROUND(X579*100/ORÇAMENTO.TotalOrçamento,2))","v":0}]
[null,null,null,null,null,null,null,null,null,null,null,null,null,null,"6.","",null,null,{"$f":"IF(P581=\"\",$S$596-SUM(OFFSET($S$574:S579,0,0,COUNTA($S$574:S579),1)),SUMIF($R$19:$R$522,$P580,$Z$19:$Z$522))","v":0},null,null,null,null,{"$f":"IF(P581=\"\",$X$596-SUM(OFFSET($X$574:X579,0,0,COUNTA($X$574:X579),1)),ROUND(S580*(1+BDI.Taxa),2))","v":0},null,null,{"$f":"IF(P581=\"\",$AA$596-SUM(OFFSET($AA$574:AA579,0,0,COUNTA($AA$574:AA579),1)),ROUND(X580*100/ORÇAMENTO.TotalOrçamento,2))","v":0}]
[null,null,null,null,null,null,null,null,null,null,null,null,null,null,"7.","",null,null,{"$f":"IF(P582=\"\",$S$596-SUM(OFFSET($S$574:S580,0,0,COUNTA($S$574:S580),1)),SUMIF($R$19:$R$522,$P581,$Z$19:$Z$522))","v":0},null,null,null,null,{"$f":"IF(P582=\"\",$X$596-SUM(OFFSET($X$574:X580,0,0,COUNTA($X$574:X580),1)),ROUND(S581*(1+BDI.Taxa),2))","v":0},null,null,{"$f":"IF(P582=\"\",$AA$596-SUM(OFFSET($AA$574:AA580,0,0,COUNTA($AA$574:AA580),1)),ROUND(X581*100/ORÇAMENTO.TotalOrçamento,2))","v":0}]
[null,null,null,null,null,null,null,null,null,null,null,null,null,null,"8.","",null,null,{"$f":"IF(P583=\"\",$S$596-SUM(OFFSET($S$574:S581,0,0,COUNTA($S$574:S581),1)),SUMIF($R$19:$R$522,$P582,$Z$19:$Z$522))","v":0},null,null,null,null,{"$f":"IF(P583=\"\",$X$596-SUM(OFFSET($X$574:X581,0,0,COUNTA($X$574:X581),1)),ROUND(S582*(1+BDI.Taxa),2))","v":0},null,null,{"$f":"IF(P583=\"\",$AA$596-SUM(OFFSET($AA$574:AA581,0,0,COUNTA($AA$574:AA581),1)),ROUND(X582*100/ORÇAMENTO.TotalOrçamento,2))","v":0}]
[null,null,null,null,null,null,null,null,null,null,null,null,null,null,"9.","",null,null,{"$f":"IF(P584=\"\",$S$596-SUM(OFFSET($S$574:S582,0,0,COUNTA($S$574:S582),1)),SUMIF($R$19:$R$522,$P583,$Z$19:$Z$522))","v":0},null,null,null,null,{"$f":"IF(P584=\"\",$X$596-SUM(OFFSET($X$574:X582,0,0,COUNTA($X$574:X582),1)),ROUND(S583*(1+BDI.Taxa),2))","v":0},null,null,{"$f":"IF(P584=\"\",$AA$596-SUM(OFFSET($AA$574:AA582,0,0,COUNTA($AA$574:AA582),1)),ROUND(X583*100/ORÇAMENTO.TotalOrçamento,2))","v":0}]
[null,null,null,null,null,null,null,null,null,null,null,null,null,null,"10.","",null,null,{"$f":"IF(P585=\"\",$S$596-SUM(OFFSET($S$574:S583,0,0,COUNTA($S$574:S583),1)),SUMIF($R$19:$R$522,$P584,$Z$19:$Z$522))","v":0},null,null,null,null,{"$f":"IF(P585=\"\",$X$596-SUM(OFFSET($X$574:X583,0,0,COUNTA($X$574:X583),1)),ROUND(S584*(1+BDI.Taxa),2))","v":0},null,null,{"$f":"IF(P585=\"\",$AA$596-SUM(OFFSET($AA$574:AA583,0,0,COUNTA($AA$574:AA583),1)),ROUND(X584*100/ORÇAMENTO.TotalOrçamento,2))","v":0}]
[null,null,null,null,null,null,null,null,null,null,null,null,null,null,"11.","",null,null,{"$f":"IF(P586=\"\",$S$596-SUM(OFFSET($S$574:S584,0,0,COUNTA($S$574:S584),1)),SUMIF($R$19:$R$522,$P585,$Z$19:$Z$522))","v":0},null,null,null,null,{"$f":"IF(P586=\"\",$X$596-SUM(OFFSET($X$574:X584,0,0,COUNTA($X$574:X584),1)),ROUND(S585*(1+BDI.Taxa),2))","v":0},null,null,{"$f":"IF(P586=\"\",$AA$596-SUM(OFFSET($AA$574:AA584,0,0,COUNTA($AA$574:AA584),1)),ROUND(X585*100/ORÇAMENTO.TotalOrçamento,2))","v":0}]
[null,null,null,null,null,null,null,null,null,null,null,null,null,null,"12.","",null,null,{"$f":"IF(P587=\"\",$S$596-SUM(OFFSET($S$574:S585,0,0,COUNTA($S$574:S585),1)),SUMIF($R$19:$R$522,$P586,$Z$19:$Z$522))","v":0},null,null,null,null,{"$f":"IF(P587=\"\",$X$596-SUM(OFFSET($X$574:X585,0,0,COUNTA($X$574:X585),1)),ROUND(S586*(1+BDI.Taxa),2))","v":0},null,null,{"$f":"IF(P587=\"\",$AA$596-SUM(OFFSET($AA$574:AA585,0,0,COUNTA($AA$574:AA585),1)),ROUND(X586*100/ORÇAMENTO.TotalOrçamento,2))","v":0}]
[null,null,null,null,null,null,null,null,null,null,null,null,null,null,"13.","",null,null,{"$f":"IF(P588=\"\",$S$596-SUM(OFFSET($S$574:S586,0,0,COUNTA($S$574:S586),1)),SUMIF($R$19:$R$522,$P587,$Z$19:$Z$522))","v":0},null,null,null,null,{"$f":"IF(P588=\"\",$X$596-SUM(OFFSET($X$574:X586,0,0,COUNTA($X$574:X586),1)),ROUND(S587*(1+BDI.Taxa),2))","v":0},null,null,{"$f":"IF(P588=\"\",$AA$596-SUM(OFFSET($AA$574:AA586,0,0,COUNTA($AA$574:AA586),1)),ROUND(X587*100/ORÇAMENTO.TotalOrçamento,2))","v":0}]
[null,null,null,null,null,null,null,null,null,null,null,null,null,null,"14.","",null,null,{"$f":"IF(P589=\"\",$S$596-SUM(OFFSET($S$574:S587,0,0,COUNTA($S$574:S587),1)),SUMIF($R$19:$R$522,$P588,$Z$19:$Z$522))","v":0},null,null,null,null,{"$f":"IF(P589=\"\",$X$596-SUM(OFFSET($X$574:X587,0,0,COUNTA($X$574:X587),1)),ROUND(S588*(1+BDI.Taxa),2))","v":0},null,null,{"$f":"IF(P589=\"\",$AA$596-SUM(OFFSET($AA$574:AA587,0,0,COUNTA($AA$574:AA587),1)),ROUND(X588*100/ORÇAMENTO.TotalOrçamento,2))","v":0}]
[null,null,null,null,null,null,null,null,null,null,null,null,null,null,"15.","",null,null,{"$f":"IF(P590=\"\",$S$596-SUM(OFFSET($S$574:S588,0,0,COUNTA($S$574:S588),1)),SUMIF($R$19:$R$522,$P589,$Z$19:$Z$522))","v":0},null,null,null,null,{"$f":"IF(P590=\"\",$X$596-SUM(OFFSET($X$574:X588,0,0,COUNTA($X$574:X588),1)),ROUND(S589*(1+BDI.Taxa),2))","v":0},null,null,{"$f":"IF(P590=\"\",$AA$596-SUM(OFFSET($AA$574:AA588,0,0,COUNTA($AA$574:AA588),1)),ROUND(X589*100/ORÇAMENTO.TotalOrçamento,2))","v":0}]
[null,null,null,null,null,null,null,null,null,null,null,null,null,null,"16.","",null,null,{"$f":"IF(P591=\"\",$S$596-SUM(OFFSET($S$574:S589,0,0,COUNTA($S$574:S589),1)),SUMIF($R$19:$R$522,$P590,$Z$19:$Z$522))","v":0},null,null,null,null,{"$f":"IF(P591=\"\",$X$596-SUM(OFFSET($X$574:X589,0,0,COUNTA($X$574:X589),1)),ROUND(S590*(1+BDI.Taxa),2))","v":0},null,null,{"$f":"IF(P591=\"\",$AA$596-SUM(OFFSET($AA$574:AA589,0,0,COUNTA($AA$574:AA589),1)),ROUND(X590*100/ORÇAMENTO.TotalOrçamento,2))","v":0}]
[null,null,null,null,null,null,null,null,null,null,null,null,null,null,"17.","",null,null,{"$f":"IF(P592=\"\",$S$596-SUM(OFFSET($S$574:S590,0,0,COUNTA($S$574:S590),1)),SUMIF($R$19:$R$522,$P591,$Z$19:$Z$522))","v":0},null,null,null,null,{"$f":"IF(P592=\"\",$X$596-SUM(OFFSET($X$574:X590,0,0,COUNTA($X$574:X590),1)),ROUND(S591*(1+BDI.Taxa),2))","v":0},null,null,{"$f":"IF(P592=\"\",$AA$596-SUM(OFFSET($AA$574:AA590,0,0,COUNTA($AA$574:AA590),1)),ROUND(X591*100/ORÇAMENTO.TotalOrçamento,2))","v":0}]
[null,null,null,null,null,null,null,null,null,null,null,null,null,null,"18.","",null,null,{"$f":"IF(P593=\"\",$S$596-SUM(OFFSET($S$574:S591,0,0,COUNTA($S$574:S591),1)),SUMIF($R$19:$R$522,$P592,$Z$19:$Z$522))","v":0},null,null,null,null,{"$f":"IF(P593=\"\",$X$596-SUM(OFFSET($X$574:X591,0,0,COUNTA($X$574:X591),1)),ROUND(S592*(1+BDI.Taxa),2))","v":0},null,null,{"$f":"IF(P593=\"\",$AA$596-SUM(OFFSET($AA$574:AA591,0,0,COUNTA($AA$574:AA591),1)),ROUND(X592*100/ORÇAMENTO.TotalOrçamento,2))","v":0}]
[null,null,null,null,null,null,null,null,null,null,null,null,null,null,"19.","",null,null,{"$f":"IF(P594=\"\",$S$596-SUM(OFFSET($S$574:S592,0,0,COUNTA($S$574:S592),1)),SUMIF($R$19:$R$522,$P593,$Z$19:$Z$522))","v":0},null,null,null,null,{"$f":"IF(P594=\"\",$X$596-SUM(OFFSET($X$574:X592,0,0,COUNTA($X$574:X592),1)),ROUND(S593*(1+BDI.Taxa),2))","v":0},null,null,{"$f":"IF(P594=\"\",$AA$596-SUM(OFFSET($AA$574:AA592,0,0,COUNTA($AA$574:AA592),1)),ROUND(X593*100/ORÇAMENTO.TotalOrçamento,2))","v":0}]
[null,null,null,null,null,null,null,null,null,null,null,null,null,null,"20.","",null,null,{"$f":"IF(P595=\"\",$S$596-SUM(OFFSET($S$574:S593,0,0,COUNTA($S$574:S593),1)),SUMIF($R$19:$R$522,$P594,$Z$19:$Z$522))","v":0},null,null,null,null,{"$f":"IF(P595=\"\",$X$596-SUM(OFFSET($X$574:X593,0,0,COUNTA($X$574:X593),1)),ROUND(S594*(1+BDI.Taxa),2))","v":0},null,null,{"$f":"IF(P595=\"\",$AA$596-SUM(OFFSET($AA$574:AA593,0,0,COUNTA($AA$574:AA593),1)),ROUND(X594*100/ORÇAMENTO.TotalOrçamento,2))","v":0}]
[null,null,null,null,null,null,null,null,null,null,null,null,null,null,"TOTAL GERAL DO ORÇAMENTO (R$)",null,null,null,{"$f":"SUM(S575:W594)","v":628742.41999999993},null,null,null,null,{"$f":"SUM(X575:Y594)","v":763026.96},null,null,{"$f":"SUM(AA575:AA594)","v":100}]
[null,null,null,null,null,null,null,null,null,null,null,null,null,null,null,null,null,null,{"$f":"$Z$523","v":628742.41999999993},null,null,null,null,{"$f":"$Z$525","v":763026.96},null,null,100]
[null,null,null,null,null,null,null,null,null,null,null,null,null,null,null,null,null,null,"(TOTAL SEM BDI)",null,null,null,null,"(TOTAL COM BDI)",null,null,"(ARRED porcentagem)"]
[null,null,null,null,null,null,null,null,null,null,null,null,null,null,null,null,null,null,{"$f":"IF(AND(S595=S596,S595>0),\"OK\",\"ERRO\")","v":"OK"},null,null,null,null,{"$f":"IF(AND(X595=X596,X595>0),\"OK\",\"ERRO\")","v":"OK"},null,null,{"$f":"IF(AND(AA595=100,S575<>0),\"OK\",\"ERRO\")","v":"ERRO"}]

{"sheet":"Resumo ","index":1,"n_rows":39,"n_cols":9,"rows_kept":39,"cut":false,"hidden":false,"merged":[[13,0,14,0],[15,2,15,5],[16,2,16,5],[17,2,17,5],[18,2,18,5],[14,1,14,8],[0,1,0,8],[36,1,36,5],[2,1,2,5],[3,1,3,5],[5,1,5,5],[6,1,6,5],[8,1,8,5],[9,1,9,5],[11,3,11,5],[12,3,12,5],[10,1,10,8],[11,6,11,8],[12,6,12,8],[19,2,19,5],[20,2,20,5],[21,2,21,5],[31,2,31,5],[1,1,1,8],[2,6,2,8],[3,6,3,8],[4,1,4,8],[5,6,5,8],[6,6,6,8],[7,1,7,8],[8,6,8,8],[9,6,9,8],[13,1,13,8],[11,1,11,2],[12,1,12,2],[42,3,42,7],[41,3,41,7],[38,1,38,8],[22,2,22,5],[23,2,23,5],[24,2,24,5],[25,2,25,5],[26,2,26,5],[32,2,32,5],[33,2,33,5],[34,2,34,5],[35,2,35,5],[27,2,27,5],[28,2,28,5],[29,2,29,5],[30,2,30,5]]}
[]
[]
[null,"UNIDADE ESCOLAR",null,null,null,null,"CÓDIGO INEP"]
[null,{"$f":"Orçamento!$O$4","v":"CENTRO DE ENSINO EM PERÍODO INTEGRAL POLIVALENTE ANTÔNIO C PANIAGO"},null,null,null,null,{"$f":"Orçamento!X4","v":52053385}]
[]
[null,"OBRA",null,null,null,null,"CIDADE"]
[null,{"$f":"Orçamento!$O$7","v":"REFORMA E AMPLIAÇÃO"},null,null,null,null,{"$f":"Orçamento!$X$7","v":"MINEIROS"}]
[]
[null,"ENDEREÇO",null,null,null,null,"CRE"]
[null,{"$f":"Orçamento!$R$10","v":"RUA 6 A, MARTINS, CEP:75832-028"},null,null,null,null,{"$f":"Orçamento!$O$10","v":"MINEIROS"}]
[]
[null,"REFERÊNCIA",null,"DATA",null,null,"ÁREA TOTAL CONSTRUÍDA (M²)"]
[null,{"$f":"CONCATENATE(\"AGETOP E SINAPI - \",Orçamento!$Y$10)","v":"AGETOP E SINAPI - ONERADA"},null,{"$f":"Orçamento!$S$7","v":"2020-04-23"},null,null,{"$f":"Orçamento!$S$13","v":3442.6800000000003}]
["FILTRO"]
[null,"RESUMO GERAL DO ORÇAMENTO"]
["↓","ITEM","DESCRIÇÃO DOS SERVIÇOS",null,null,null,"PREÇO SEM BDI","PREÇO COM BDI","PARTICIP. (%)"]
[{"$f":"IF(G17>0,\"F\",\"\")","v":""},"1.",{"$f":"Orçamento!$P575","v":"REFORMA"},null,null,null,{"$f":"IFERROR(Orçamento!S575,\"-\")","v":0},{"$f":"IFERROR(Orçamento!X575,\"\")","v":0},{"$f":"Orçamento!AA575","v":0}]
[{"$f":"IF(G18>0,\"F\",\"\")","v":""},"2.",{"$f":"Orçamento!$P576","v":"VESTIÁRIO PADRÃO SEDUC"},null,null,null,{"$f":"IFERROR(Orçamento!S576,\"-\")","v":0},{"$f":"IFERROR(Orçamento!X576,\"\")","v":0},{"$f":"Orçamento!AA576","v":0}]
["F","3.",{"$f":"Orçamento!$P577","v":"PÁTIO MULTIUSO - PADRÃO SEDUC - OPÇÃO 03"},null,null,null,{"$f":"IFERROR(Orçamento!S577,\"-\")","v":628742.41999999993},{"$f":"IFERROR(Orçamento!X577,\"\")","v":763026.96},{"$f":"Orçamento!AA577","v":100}]
["","4.",{"$f":"Orçamento!$P578","v":""},null,null,null,{"$f":"IFERROR(Orçamento!S578,\"-\")","v":0},{"$f":"IFERROR(Orçamento!X578,\"\")","v":0},{"$f":"Orçamento!AA578","v":0}]
["","5.",{"$f":"Orçamento!$P579","v":""},null,null,null,{"$f":"IFERROR(Orçamento!S579,\"-\")","v":0},{"$f":"IFERROR(Orçamento!X579,\"\")","v":0},{"$f":"Orçamento!AA579","v":0}]
["","6.",{"$f":"Orçamento!$P580","v":""},null,null,null,{"$f":"IFERROR(Orçamento!S580,\"-\")","v":0},{"$f":"IFERROR(Orçamento!X580,\"\")","v":0},{"$f":"Orçamento!AA580","v":0}]
["","7.",{"$f":"Orçamento!$P581","v":""},null,null,null,{"$f":"IFERROR(Orçamento!S581,\"-\")","v":0},{"$f":"IFERROR(Orçamento!X581,\"\")","v":0},{"$f":"Orçamento!AA581","v":0}]
["","8.",{"$f":"Orçamento!$P582","v":""},null,null,null,{"$f":"IFERROR(Orçamento!S582,\"-\")","v":0},{"$f":"IFERROR(Orçamento!X582,\"\")","v":0},{"$f":"Orçamento!AA582","v":0}]
["","9.",{"$f":"Orçamento!$P583","v":""},null,null,null,{"$f":"IFERROR(Orçamento!S583,\"-\")","v":0},{"$f":"IFERROR(Orçamento!X583,\"\")","v":0},{"$f":"Orçamento!AA583","v":0}]
["","10.",{"$f":"Orçamento!$P584","v":""},null,null,null,{"$f":"IFERROR(Orçamento!S584,\"-\")","v":0},{"$f":"IFERROR(Orçamento!X584,\"\")","v":0},{"$f":"Orçamento!AA584","v":0}]
["","11.",{"$f":"Orçamento!$P585","v":""},null,null,null,{"$f":"IFERROR(Orçamento!S585,\"-\")","v":0},{"$f":"IFERROR(Orçamento!X585,\"\")","v":0},{"$f":"Orçamento!AA585","v":0}]
["","12.",{"$f":"Orçamento!$P586","v":""},null,null,null,{"$f":"IFERROR(Orçamento!S586,\"-\")","v":0},{"$f":"IFERROR(Orçamento!X586,\"\")","v":0},{"$f":"Orçamento!AA586","v":0}]
["","13.",{"$f":"Orçamento!$P587","v":""},null,null,null,{"$f":"IFERROR(Orçamento!S587,\"-\")","v":0},{"$f":"IFERROR(Orçamento!X587,\"\")","v":0},{"$f":"Orçamento!AA587","v":0}]
["","14.",{"$f":"Orçamento!$P588","v":""},null,null,null,{"$f":"IFERROR(Orçamento!S588,\"-\")","v":0},{"$f":"IFERROR(Orçamento!X588,\"\")","v":0},{"$f":"Orçamento!AA588","v":0}]
["","15.",{"$f":"Orçamento!$P589","v":""},null,null,null,{"$f":"IFERROR(Orçamento!S589,\"-\")","v":0},{"$f":"IFERROR(Orçamento!X589,\"\")","v":0},{"$f":"Orçamento!AA589","v":0}]
["","16.",{"$f":"Orçamento!$P590","v":""},null,null,null,{"$f":"IFERROR(Orçamento!S590,\"-\")","v":0},{"$f":"IFERROR(Orçamento!X590,\"\")","v":0},{"$f":"Orçamento!AA590","v":0}]
["","17.",{"$f":"Orçamento!$P591","v":""},null,null,null,{"$f":"IFERROR(Orçamento!S591,\"-\")","v":0},{"$f":"IFERROR(Orçamento!X591,\"\")","v":0},{"$f":"Orçamento!AA591","v":0}]
["","18.",{"$f":"Orçamento!$P592","v":""},null,null,null,{"$f":"IFERROR(Orçamento!S592,\"-\")","v":0},{"$f":"IFERROR(Orçamento!X592,\"\")","v":0},{"$f":"Orçamento!AA592","v":0}]
["","19.",{"$f":"Orçamento!$P593","v":""},null,null,null,{"$f":"IFERROR(Orçamento!S593,\"-\")","v":0},{"$f":"IFERROR(Orçamento!X593,\"\")","v":0},{"$f":"Orçamento!AA593","v":0}]
["","20.",{"$f":"Orçamento!$P594","v":""},null,null,null,{"$f":"IFERROR(Orçamento!S594,\"-\")","v":0},{"$f":"IFERROR(Orçamento!X594,\"\")","v":0},{"$f":"Orçamento!AA594","v":0}]
["F","TOTAL GERAL DO ORÇAMENTO (R$)",null,null,null,null,{"$f":"SUM(G17:G36)","v":628742.41999999993},763026.96,{"$f":"SUM(I17:I36)","v":100}]
["F"]
["F"]

{"sheet":"Somatório","index":2,"n_rows":45,"n_cols":6,"rows_kept":45,"cut":false,"hidden":false,"merged":[[13,0,14,0],[42,1,42,2],[44,1,44,5],[47,3,47,5],[48,3,48,5],[13,1,13,5],[9,1,9,3],[9,4,9,5],[11,1,11,2],[11,4,11,5],[12,1,12,2],[12,4,12,5],[0,1,0,5],[14,1,14,5],[2,1,2,3],[2,4,2,5],[3,1,3,3],[3,4,3,5],[5,1,5,3],[5,4,5,5],[6,1,6,3],[6,4,6,5],[8,1,8,3],[8,4,8,5],[1,1,1,5],[4,1,4,5],[7,1,7,5],[10,1,10,5]]}
[]
[]
[null,"UNIDADE ESCOLAR",null,null,"CÓDIGO INEP"]
[null,{"$f":"Orçamento!$O$4","v":"CENTRO DE ENSINO EM PERÍODO INTEGRAL POLIVALENTE ANTÔNIO C PANIAGO"},null,null,{"$f":"Orçamento!X4","v":52053385}]
[]
[null,"OBRA",null,null,"CIDADE"]
[null,{"$f":"Orçamento!$O$7","v":"REFORMA E AMPLIAÇÃO"},null,null,{"$f":"Orçamento!$X$7","v":"MINEIROS"}]
[]
[null,"ENDEREÇO",null,null,"CRE"]
[null,{"$f":"Orçamento!$R$10","v":"RUA 6 A, MARTINS, CEP:75832-028"},null,null,{"$f":"Orçamento!$O$10","v":"MINEIROS"}]
[]
[null,"REFERÊNCIA",null,"DATA","ÁREA TOTAL CONSTRUÍDA (M²)"]
[null,{"$f":"CONCATENATE(\"AGETOP E SINAPI - \",Orçamento!$Y$10)","v":"AGETOP E SINAPI - ONERADA"},null,{"$f":"Orçamento!$S$7","v":"2020-04-23"},{"$f":"Orçamento!$S$13","v":3442.6800000000003}]
["FILTRO"]
[null,"SOMATÓRIO DE SERVIÇOS"]
["↓","ITEM","DESCRIÇÃO DOS SERVIÇOS","PREÇO SEM BDI (R$)","PREÇO COM BDI (R$)","PARTIC.  ( % )"]
[{"$f":"IF(D17>0,\"F\",\"\")","v":""},"a.",{"$f":"Orçamento!P541","v":"SERVIÇOS PRELIMINARES"},{"$f":"Orçamento!S541","v":0},{"$f":"Orçamento!X541","v":0},{"$f":"Orçamento!AA541","v":0}]
[{"$f":"IF(D18>0,\"F\",\"\")","v":""},"b.",{"$f":"Orçamento!P542","v":"TRANSPORTES"},{"$f":"Orçamento!S542","v":0},{"$f":"Orçamento!X542","v":0},{"$f":"Orçamento!AA542","v":0}]
["","c.",{"$f":"Orçamento!P543","v":"SERVIÇO EM TERRA"},{"$f":"Orçamento!S543","v":0},{"$f":"Orçamento!X543","v":0},{"$f":"Orçamento!AA543","v":0}]
["","d.",{"$f":"Orçamento!P544","v":"FUNDAÇÕES E SONDAGENS"},{"$f":"Orçamento!S544","v":0},{"$f":"Orçamento!X544","v":0},{"$f":"Orçamento!AA544","v":0}]
["","e.",{"$f":"Orçamento!P545","v":"ESTRUTURA"},{"$f":"Orçamento!S545","v":0},{"$f":"Orçamento!X545","v":0},{"$f":"Orçamento!AA545","v":0}]
["","f.",{"$f":"Orçamento!P546","v":"INSTALAÇÕES ELÉTRICAS"},{"$f":"Orçamento!S546","v":0},{"$f":"Orçamento!X546","v":0},{"$f":"Orçamento!AA546","v":0}]
["","g.",{"$f":"Orçamento!P547","v":"INSTALAÇÕES HIDROSSANITÁRIAS"},{"$f":"Orçamento!S547","v":0},{"$f":"Orçamento!X547","v":0},{"$f":"Orçamento!AA547","v":0}]
["","h",{"$f":"Orçamento!P548","v":"INSTALAÇÕES ESPECIAIS"},{"$f":"Orçamento!S548","v":0},{"$f":"Orçamento!X548","v":0},{"$f":"Orçamento!AA548","v":0}]
["","i.",{"$f":"Orçamento!P549","v":"ALVENARIAS E DIVISÓRIAS"},{"$f":"Orçamento!S549","v":0},{"$f":"Orçamento!X549","v":0},{"$f":"Orçamento!AA549","v":0}]
["","j.",{"$f":"Orçamento!P550","v":"ALVENARIA AUTO-PORTANTE"},{"$f":"Orçamento!S550","v":0},{"$f":"Orçamento!X550","v":0},{"$f":"Orçamento!AA550","v":0}]
["","k.",{"$f":"Orçamento!P551","v":"IMPERMEABILIZAÇÃO"},{"$f":"Orçamento!S551","v":0},{"$f":"Orçamento!X551","v":0},{"$f":"Orçamento!AA551","v":0}]
["","l.",{"$f":"Orçamento!P552","v":"ISOLAMENTO TÉRMICO E ACÚSTICO"},{"$f":"Orçamento!S552","v":0},{"$f":"Orçamento!X552","v":0},{"$f":"Orçamento!AA552","v":0}]
["","m.",{"$f":"Orçamento!P553","v":"ESTRUTURA DE MADEIRA"},{"$f":"Orçamento!S553","v":0},{"$f":"Orçamento!X553","v":0},{"$f":"Orçamento!AA553","v":0}]
["","n.",{"$f":"Orçamento!P554","v":"ESTRUTURAS METÁLICAS"},{"$f":"Orçamento!S554","v":0},{"$f":"Orçamento!X554","v":0},{"$f":"Orçamento!AA554","v":0}]
["","o.",{"$f":"Orçamento!P555","v":"COBERTURAS"},{"$f":"Orçamento!S555","v":0},{"$f":"Orçamento!X555","v":0},{"$f":"Orçamento!AA555","v":0}]
["","p.",{"$f":"Orçamento!P556","v":"ESQUADRIAS DE MADEIRA"},{"$f":"Orçamento!S556","v":0},{"$f":"Orçamento!X556","v":0},{"$f":"Orçamento!AA556","v":0}]
["","q.",{"$f":"Orçamento!P557","v":"ESQUADRIAS METÁLICAS"},{"$f":"Orçamento!S557","v":0},{"$f":"Orçamento!X557","v":0},{"$f":"Orçamento!AA557","v":0}]
["","r.",{"$f":"Orçamento!P558","v":"VIDROS"},{"$f":"Orçamento!S558","v":0},{"$f":"Orçamento!X558","v":0},{"$f":"Orçamento!AA558","v":0}]
["","s.",{"$f":"Orçamento!P559","v":"REVESTIMENTO DE PAREDE"},{"$f":"Orçamento!S559","v":0},{"$f":"Orçamento!X559","v":0},{"$f":"Orçamento!AA559","v":0}]
["","t.",{"$f":"Orçamento!P560","v":"FORROS"},{"$f":"Orçamento!S560","v":0},{"$f":"Orçamento!X560","v":0},{"$f":"Orçamento!AA560","v":0}]
["","u.",{"$f":"Orçamento!P561","v":"REVESTIMENTO DE PISO"},{"$f":"Orçamento!S561","v":0},{"$f":"Orçamento!X561","v":0},{"$f":"Orçamento!AA561","v":0}]
["","v.",{"$f":"Orçamento!P562","v":"FERRAGENS"},{"$f":"Orçamento!S562","v":0},{"$f":"Orçamento!X562","v":0},{"$f":"Orçamento!AA562","v":0}]
["","w.",{"$f":"Orçamento!P563","v":"MARCENARIA"},{"$f":"Orçamento!S563","v":0},{"$f":"Orçamento!X563","v":0},{"$f":"Orçamento!AA563","v":0}]
["","x.",{"$f":"Orçamento!P564","v":"ADMINISTRAÇÃO"},{"$f":"Orçamento!S564","v":0},{"$f":"Orçamento!X564","v":0},{"$f":"Orçamento!AA564","v":0}]
["","y.",{"$f":"Orçamento!P565","v":"PINTURA"},{"$f":"Orçamento!S565","v":0},{"$f":"Orçamento!X565","v":0},{"$f":"Orçamento!AA565","v":0}]
["","z.",{"$f":"Orçamento!P566","v":"DIVERSOS"},{"$f":"Orçamento!S566","v":0},{"$f":"Orçamento!X566","v":0},{"$f":"Orçamento!AA566","v":0}]
["F","TOTAL GERAL DO ORÇAMENTO",null,{"$f":"SUM(D17:D42)","v":0},{"$f":"SUM(E17:E42)","v":0},{"$f":"SUM(F17:F42)","v":0}]
[]
[null,"(*) Para itens da AGETOP, os vidros não estão inclusos nas esquadrias e já foram considerados os custos de contramarco para as esquadrias de alumínio;"]

{"sheet":"Cronog_90_Dias","index":3,"n_rows":99,"n_cols":18,"rows_kept":99,"cut":false,"hidden":false,"merged":[[91,9,91,12],[92,9,92,12],[93,9,93,12],[94,9,94,12],[95,9,95,12],[73,9,73,12],[74,9,74,12],[76,9,76,12],[77,9,77,12],[79,9,79,12],[80,9,80,12],[82,9,82,12],[83,9,83,12],[85,9,85,12],[59,9,59,12],[61,9,61,12],[62,9,62,12],[64,9,64,12],[65,9,65,12],[67,9,67,12],[68,9,68,12],[70,9,70,12],[71,9,71,12],[40,9,40,12],[41,9,41,12],[43,9,43,12],[44,9,44,12],[46,9,46,12],[47,9,47,12],[49,9,49,12],[50,9,50,12],[52,9,52,12],[12,9,12,12],[13,9,13,12],[14,9,14,12],[16,9,16,12],[17,9,17,12],[19,9,19,12],[20,9,20,12],[22,9,22,12],[23,9,23,12],[12,0,13,0],[9,0,11,0],[11,1,11,17],[92,1,92,2],[92,5,92,8],[92,13,92,16],[93,1,93,2],[93,5,93,8],[93,13,93,16],[74,13,74,16],[74,5,74,8],[68,13,68,16],[70,5,70,8],[70,13,70,16],[59,5,59,8],[71,1,73,2],[71,4,73,4],[71,5,71,8],[71,13,71,16],[73,5,73,8],[73,13,73,16],[59,13,59,16],[61,5,61,8],[61,13,61,16],[94,1,94,2],[94,5,94,8],[94,13,94,16],[76,5,76,8],[76,13,76,16],[77,5,77,8],[77,13,77,16],[79,5,79,8],[79,13,79,16],[80,5,80,8],[80,13,80,16],[82,5,82,8],[82,13,82,16],[77,3,79,3],[80,3,82,3],[86,1,88,2],[80,4,82,4],[83,3,85,3],[77,1,79,2],[77,4,79,4],[80,1,82,2],[86,9,86,12],[88,9,88,12],[89,9,89,12],[95,1,95,2],[95,5,95,8],[95,13,95,16],[97,1,97,4],[98,1,98,17],[86,13,86,16],[88,5,88,8],[88,13,88,16],[85,5,85,8],[85,13,85,16],[89,1,91,2],[89,4,91,4],[89,5,89,8],[89,13,89,16],[91,5,91,8],[91,13,91,16],[89,3,91,3],[86,4,88,4],[86,5,86,8],[86,3,88,3],[83,1,85,2],[83,4,85,4],[83,5,83,8],[83,13,83,16],[68,5,68,8],[65,5,65,8],[65,13,65,16],[67,5,67,8],[67,13,67,16],[65,3,67,3],[62,13,62,16],[64,5,64,8],[64,13,64,16],[62,5,62,8],[53,13,53,16],[55,5,55,8],[55,13,55,16],[50,5,50,8],[50,13,50,16],[52,5,52,8],[52,13,52,16],[56,13,56,16],[58,5,58,8],[58,13,58,16],[53,5,53,8],[56,5,56,8],[53,9,53,12],[55,9,55,12],[56,9,56,12],[58,9,58,12],[44,13,44,16],[46,5,46,8],[46,13,46,16],[47,1,49,2],[47,4,49,4],[47,5,47,8],[47,13,47,16],[49,5,49,8],[49,13,49,16],[44,5,44,8],[47,3,49,3],[44,3,46,3],[44,1,46,2],[44,4,46,4],[35,13,35,16],[37,5,37,8],[37,13,37,16],[35,3,37,3],[40,13,40,16],[38,3,40,3],[38,13,38,16],[41,1,43,2],[41,4,43,4],[41,5,41,8],[41,13,41,16],[43,5,43,8],[43,13,43,16],[41,3,43,3],[35,5,35,8],[38,5,38,8],[40,5,40,8],[35,1,37,2],[35,4,37,4],[38,1,40,2],[38,4,40,4],[35,9,35,12],[37,9,37,12],[38,9,38,12],[29,13,29,16],[31,5,31,8],[31,13,31,16],[32,1,34,2],[32,4,34,4],[32,5,32,8],[32,13,32,16],[34,5,34,8],[34,13,34,16],[32,3,34,3],[29,5,29,8],[29,1,31,2],[29,4,31,4],[29,3,31,3],[29,9,29,12],[31,9,31,12],[32,9,32,12],[34,9,34,12],[23,13,23,16],[25,5,25,8],[25,13,25,16],[26,1,28,2],[26,4,28,4],[26,5,26,8],[26,13,26,16],[28,5,28,8],[28,13,28,16],[23,3,25,3],[23,1,25,2],[23,4,25,4],[23,5,23,8],[26,3,28,3],[25,9,25,12],[26,9,26,12],[28,9,28,12],[20,4,22,4],[20,5,20,8],[20,13,20,16],[22,5,22,8],[22,13,22,16],[20,3,22,3],[14,3,16,3],[17,3,19,3],[14,4,16,4],[14,5,14,8],[14,13,14,16],[16,5,16,8],[16,13,16,16],[65,1,67,2],[68,3,70,3],[62,3,64,3],[68,1,70,2],[56,3,58,3],[65,4,67,4],[74,3,76,3],[50,4,52,4],[74,4,76,4],[56,1,58,2],[56,4,58,4],[50,3,52,3],[53,3,55,3],[68,4,70,4],[62,1,64,2],[62,4,64,4],[59,3,61,3],[53,1,55,2],[53,4,55,4],[59,1,61,2],[59,4,61,4],[74,1,76,2],[10,1,10,17],[9,8,9,17],[8,8,8,17],[3,8,3,17],[6,8,6,17],[5,8,5,17],[2,8,2,17],[50,1,52,2],[71,3,73,3],[12,17,13,17],[13,1,13,2],[13,5,13,8],[13,13,13,16],[12,3,13,3],[12,13,12,16],[14,1,16,2],[12,5,12,8],[17,1,19,2],[17,4,19,4],[17,5,17,8],[17,13,17,16],[19,5,19,8],[19,13,19,16],[20,1,22,2],[0,1,0,17],[2,1,2,7],[3,1,3,7],[5,1,5,7],[6,1,6,7],[8,1,8,7],[9,1,9,7],[1,1,1,17],[7,1,7,17],[4,1,4,17]]}
[]
[]
[null,"UNIDADE ESCOLAR",null,null,null,null,null,null,"PRAZO"]
[null,{"$f":"Orçamento!$O$4","v":"CENTRO DE ENSINO EM PERÍODO INTEGRAL POLIVALENTE ANTÔNIO C PANIAGO"},null,null,null,null,null,null,"90 DIAS CORRIDOS"]
[]
[null,"OBRA",null,null,null,null,null,null,"DATA"]
[null,{"$f":"Orçamento!$O$7","v":"REFORMA E AMPLIAÇÃO"},null,null,null,null,null,null,{"$f":"Orçamento!$S$7","v":"2020-04-23"}]
[]
[null,"LOCAL",null,null,null,null,null,null,"ÁREA TOTAL CONSTRUÍDA (M²)"]
["FILTRO",{"$f":"Orçamento!$X$7","v":"MINEIROS"},null,null,null,null,null,null,{"$f":"Orçamento!$S$13","v":3442.6800000000003}]
[]
[null,"CRONOGRAMA - FÍSICO FINANCEIRO"]
["↓","CUSTO TOTAL:",{"$f":"D93","v":0},"VALOR","Dias:",30,null,null,null,60,null,null,null,90,null,null,null,"TOTAL"]
[null,"DESCRIÇÃO DOS SERVIÇOS",null,null,"%","1ª PARCELA",null,null,null,"2ª PARCELA",null,null,null,"3ª PARCELA"]
[{"$f":"IF(D15>0,\"F\",\"\")","v":""},"SERVIÇOS PRELIMINARES",null,{"$f":"Orçamento!X541","v":0},{"$f":"Orçamento!AA541","v":0},{"$f":"ROUND(F17*$D$15,2)","v":0},null,null,null,{"$f":"ROUND(J17*$D$15,2)","v":0},null,null,null,{"$f":"ROUND(N17*$D$15,2)","v":0},null,null,null,{"$f":"SUM(F15:Q15)","v":0}]
[{"$f":"IF(A15=\"F\",A15,\"\")","v":""}]
[{"$f":"IF(A16=\"F\",A16,\"\")","v":""},null,null,null,null,1,null,null,null,0,null,null,null,{"$f":"1-F17-J17","v":0},null,null,null,{"$f":"IFERROR(E15/100,\"\")","v":0}]
[{"$f":"IF(D18>0,\"F\",\"\")","v":""},"TRANSPORTES",null,{"$f":"Orçamento!X542","v":0},{"$f":"Orçamento!AA542","v":0},{"$f":"ROUND(F20*$D$18,2)","v":0},null,null,null,{"$f":"ROUND(J20*$D$18,2)","v":0},null,null,null,{"$f":"ROUND(N20*$D$18,2)","v":0},null,null,null,{"$f":"SUM(F18:Q18)","v":0}]
[{"$f":"IF(A18=\"F\",A18,\"\")","v":""}]
[{"$f":"IF(A19=\"F\",A19,\"\")","v":""},null,null,null,null,0,null,null,null,{"$f":"1-B20","v":1},null,null,null,{"$f":"1-F20-J20","v":0},null,null,null,{"$f":"IFERROR(E18/100,\"\")","v":0}]
[{"$f":"IF(D21>0,\"F\",\"\")","v":""},"SERVIÇO EM TERRA",null,{"$f":"Orçamento!X543","v":0},{"$f":"Orçamento!AA543","v":0},{"$f":"ROUND(F23*$D$21,2)","v":0},null,null,null,{"$f":"ROUND(J23*$D$21,2)","v":0},null,null,null,{"$f":"ROUND(N23*$D$21,2)","v":0},null,null,null,{"$f":"SUM(F21:Q21)","v":0}]
[{"$f":"IF(A21=\"F\",A21,\"\")","v":""}]
[{"$f":"IF(A22=\"F\",A22,\"\")","v":""},null,null,null,null,1,null,null,null,0,null,null,null,{"$f":"1-F23-J23","v":0},null,null,null,{"$f":"IFERROR(E21/100,\"\")","v":0}]
[{"$f":"IF(D24>0,\"F\",\"\")","v":""},"FUNDAÇÕES E SONDAGENS",null,{"$f":"Orçamento!X544","v":0},{"$f":"Orçamento!AA544","v":0},{"$f":"ROUND(F26*$D$24,2)","v":0},null,null,null,{"$f":"ROUND(J26*$D$24,2)","v":0},null,null,null,{"$f":"ROUND(N26*$D$24,2)","v":0},null,null,null,{"$f":"SUM(F24:Q24)","v":0}]
[{"$f":"IF(A24=\"F\",A24,\"\")","v":""}]
[{"$f":"IF(A25=\"F\",A25,\"\")","v":""},null,null,null,null,1,null,null,null,0,null,null,null,{"$f":"1-F26-J26","v":0},null,null,null,{"$f":"IFERROR(E24/100,\"\")","v":0}]
[{"$f":"IF(D27>0,\"F\",\"\")","v":""},"ESTRUTURA",null,{"$f":"Orçamento!X545","v":0},{"$f":"Orçamento!AA545","v":0},{"$f":"ROUND(F29*$D$27,2)","v":0},null,null,null,{"$f":"ROUND(J29*$D$27,2)","v":0},null,null,null,{"$f":"ROUND(N29*$D$27,2)","v":0},null,null,null,{"$f":"SUM(F27:Q27)","v":0}]
[{"$f":"IF(A27=\"F\",A27,\"\")","v":""}]
[{"$f":"IF(A28=\"F\",A28,\"\")","v":""},null,null,null,null,0.61,null,null,null,0.39,null,null,null,{"$f":"1-F29-J29","v":0},null,null,null,{"$f":"IFERROR(E27/100,\"\")","v":0}]
[{"$f":"IF(D30>0,\"F\",\"\")","v":""},"INST.ELET/TELEFÔNICA/CABEAMENTO ESTRUTURADO",null,{"$f":"Orçamento!X546","v":0},{"$f":"Orçamento!AA546","v":0},{"$f":"ROUND(F32*$D$30,2)","v":0},null,null,null,{"$f":"ROUND(J32*$D$30,2)","v":0},null,null,null,{"$f":"ROUND(N32*$D$30,2)","v":0},null,null,null,{"$f":"SUM(F30:Q30)","v":0}]
[{"$f":"IF(A30=\"F\",A30,\"\")","v":""}]
[{"$f":"IF(A31=\"F\",A31,\"\")","v":""},null,null,null,null,0.18,null,null,null,0.7,null,null,null,{"$f":"1-F32-J32","v":0.12000000000000011},null,null,null,{"$f":"IFERROR(E30/100,\"\")","v":0}]
[{"$f":"IF(D33>0,\"F\",\"\")","v":""},"INSTALAÇÕES HIDROSSANITÁRIAS",null,{"$f":"Orçamento!X547","v":0},{"$f":"Orçamento!AA547","v":0},{"$f":"ROUND(F35*$D$33,2)","v":0},null,null,null,{"$f":"ROUND(J35*$D$33,2)","v":0},null,null,null,{"$f":"ROUND(N35*$D$33,2)","v":0},null,null,null,{"$f":"SUM(F33:Q33)","v":0}]
[{"$f":"IF(A33=\"F\",A33,\"\")","v":""}]
[{"$f":"IF(A34=\"F\",A34,\"\")","v":""},null,null,null,null,0.18,null,null,null,0.7,null,null,null,{"$f":"1-F35-J35","v":0.12000000000000011},null,null,null,{"$f":"IFERROR(E33/100,\"\")","v":0}]
[{"$f":"IF(D36>0,\"F\",\"\")","v":""},"INSTALAÇÕES ESPECIAIS",null,{"$f":"Orçamento!X548","v":0},{"$f":"Orçamento!AA548","v":0},{"$f":"ROUND(F38*$D$36,2)","v":0},null,null,null,{"$f":"ROUND(J38*$D$36,2)","v":0},null,null,null,{"$f":"ROUND(N38*$D$36,2)","v":0},null,null,null,{"$f":"SUM(F36:Q36)","v":0}]
[{"$f":"IF(A36=\"F\",A36,\"\")","v":""}]
[{"$f":"IF(A37=\"F\",A37,\"\")","v":""},null,null,null,null,0,null,null,null,{"$f":"1-B38","v":1},null,null,null,{"$f":"1-F38-J38","v":0},null,null,null,{"$f":"IFERROR(E36/100,\"\")","v":0}]
[{"$f":"IF(D39>0,\"F\",\"\")","v":""},"ALVENARIA E DIVISÓRIAS",null,{"$f":"Orçamento!X549","v":0},{"$f":"Orçamento!AA549","v":0},{"$f":"ROUND(F41*$D$39,2)","v":0},null,null,null,{"$f":"ROUND(J41*$D$39,2)","v":0},null,null,null,{"$f":"ROUND(N41*$D$39,2)","v":0},null,null,null,{"$f":"SUM(F39:Q39)","v":0}]
[{"$f":"IF(A39=\"F\",A39,\"\")","v":""}]
[{"$f":"IF(A40=\"F\",A40,\"\")","v":""},null,null,null,null,0,null,null,null,{"$f":"1-B41","v":1},null,null,null,{"$f":"1-F41-J41","v":0},null,null,null,{"$f":"IFERROR(E39/100,\"\")","v":0}]
[{"$f":"IF(D42>0,\"F\",\"\")","v":""},"ALVENARIA AUTO-PORTANTE",null,{"$f":"Orçamento!X550","v":0},{"$f":"Orçamento!AA550","v":0},{"$f":"ROUND(F44*$D$42,2)","v":0},null,null,null,{"$f":"ROUND(J44*$D$42,2)","v":0},null,null,null,{"$f":"ROUND(N44*$D$42,2)","v":0},null,null,null,{"$f":"SUM(F42:Q42)","v":0}]
[{"$f":"IF(A42=\"F\",A42,\"\")","v":""}]
[{"$f":"IF(A43=\"F\",A43,\"\")","v":""},null,null,null,null,1,null,null,null,{"$f":"1-B44","v":1},null,null,null,{"$f":"1-F44","v":0},null,null,null,{"$f":"IFERROR(E42/100,\"\")","v":0}]
[{"$f":"IF(D45>0,\"F\",\"\")","v":""},"IMPERMEABILIZAÇÃO",null,{"$f":"Orçamento!X551","v":0},{"$f":"Orçamento!AA551","v":0},{"$f":"ROUND(F47*$D$45,2)","v":0},null,null,null,{"$f":"ROUND(J47*$D$45,2)","v":0},null,null,null,{"$f":"ROUND(N47*$D$45,2)","v":0},null,null,null,{"$f":"SUM(F45:Q45)","v":0}]
[{"$f":"IF(A45=\"F\",A45,\"\")","v":""}]
[{"$f":"IF(A46=\"F\",A46,\"\")","v":""},null,null,null,null,0.85,null,null,null,0.15,null,null,null,{"$f":"1-F47-J47","v":0},null,null,null,{"$f":"IFERROR(E45/100,\"\")","v":0}]
[{"$f":"IF(D48>0,\"F\",\"\")","v":""},"ISOLAMENTO TÉRMICO E ACÚSTICO",null,{"$f":"Orçamento!X552","v":0},{"$f":"Orçamento!AA552","v":0},{"$f":"ROUND(F50*$D$48,2)","v":0},null,null,null,{"$f":"ROUND(J50*$D$48,2)","v":0},null,null,null,{"$f":"ROUND(N50*$D$48,2)","v":0},null,null,null,{"$f":"SUM(F48:Q48)","v":0}]
[{"$f":"IF(A48=\"F\",A48,\"\")","v":""}]
[{"$f":"IF(A49=\"F\",A49,\"\")","v":""},null,null,null,null,0.5,null,null,null,{"$f":"1-B50","v":1},null,null,null,{"$f":"1-F50","v":0.5},null,null,null,{"$f":"IFERROR(E48/100,\"\")","v":0}]
[{"$f":"IF(D51>0,\"F\",\"\")","v":""},"ESTRUTURA DE MADEIRA",null,{"$f":"Orçamento!X553","v":0},{"$f":"Orçamento!AA553","v":0},{"$f":"ROUND(F53*$D$51,2)","v":0},null,null,null,{"$f":"ROUND(J53*$D$51,2)","v":0},null,null,null,{"$f":"ROUND(N53*$D$51,2)","v":0},null,null,null,{"$f":"SUM(F51:Q51)","v":0}]
[{"$f":"IF(A51=\"F\",A51,\"\")","v":""}]
[{"$f":"IF(A52=\"F\",A52,\"\")","v":""},null,null,null,null,0.35,null,null,null,0.65,null,null,null,{"$f":"1-F53-J53","v":0},null,null,null,{"$f":"IFERROR(E51/100,\"\")","v":0}]
[{"$f":"IF(D54>0,\"F\",\"\")","v":""},"ESTRUTURA METÁLICA",null,{"$f":"Orçamento!X554","v":0},{"$f":"Orçamento!AA554","v":0},{"$f":"ROUND(F56*$D$54,2)","v":0},null,null,null,{"$f":"ROUND(J56*$D$54,2)","v":0},null,null,null,{"$f":"ROUND(N56*$D$54,2)","v":0},null,null,null,{"$f":"SUM(F54:Q54)","v":0}]
[{"$f":"IF(A54=\"F\",A54,\"\")","v":""}]
[{"$f":"IF(A55=\"F\",A55,\"\")","v":""},null,null,null,null,0.38,null,null,null,0.62,null,null,null,{"$f":"1-F56-J56","v":0},null,null,null,{"$f":"IFERROR(E54/100,\"\")","v":0}]
[{"$f":"IF(D57>0,\"F\",\"\")","v":""},"COBERTURAS",null,{"$f":"Orçamento!X555","v":0},{"$f":"Orçamento!AA555","v":0},{"$f":"ROUND(F59*$D$57,2)","v":0},null,null,null,{"$f":"ROUND(J59*$D$57,2)","v":0},null,null,null,{"$f":"ROUND(N59*$D$57,2)","v":0},null,null,null,{"$f":"SUM(F57:Q57)","v":0}]
[{"$f":"IF(A57=\"F\",A57,\"\")","v":""}]
[{"$f":"IF(A58=\"F\",A58,\"\")","v":""},null,null,null,null,0,null,null,null,0.28000000000000003,null,null,null,{"$f":"1-F59-J59","v":0.72},null,null,null,{"$f":"IFERROR(E57/100,\"\")","v":0}]
[{"$f":"IF(D60>0,\"F\",\"\")","v":""},"ESQUADRIAS DE MADEIRA",null,{"$f":"Orçamento!X556","v":0},{"$f":"Orçamento!AA556","v":0},{"$f":"ROUND(F62*$D$60,2)","v":0},null,null,null,{"$f":"ROUND(J62*$D$60,2)","v":0},null,null,null,{"$f":"ROUND(N62*$D$60,2)","v":0},null,null,null,{"$f":"SUM(F60:Q60)","v":0}]
[{"$f":"IF(A60=\"F\",A60,\"\")","v":""}]
[{"$f":"IF(A61=\"F\",A61,\"\")","v":""},null,null,null,null,0.54,null,null,null,{"$f":"1-B62","v":1},null,null,null,{"$f":"1-F62","v":0.45999999999999996},null,null,null,{"$f":"IFERROR(E60/100,\"\")","v":0}]
[{"$f":"IF(D63>0,\"F\",\"\")","v":""},"ESQUADRIAS METÁLICAS",null,{"$f":"Orçamento!X557","v":0},{"$f":"Orçamento!AA557","v":0},{"$f":"ROUND(F65*$D$63,2)","v":0},null,null,null,{"$f":"ROUND(J65*$D$63,2)","v":0},null,null,null,{"$f":"ROUND(N65*$D$63,2)","v":0},null,null,null,{"$f":"SUM(F63:Q63)","v":0}]
[{"$f":"IF(A63=\"F\",A63,\"\")","v":""}]
[{"$f":"IF(A64=\"F\",A64,\"\")","v":""},null,null,null,null,0,null,null,null,0.68,null,null,null,{"$f":"1-F65-J65","v":0.31999999999999995},null,null,null,{"$f":"IFERROR(E63/100,\"\")","v":0}]
[{"$f":"IF(D66>0,\"F\",\"\")","v":""},"VIDROS",null,{"$f":"Orçamento!X558","v":0},{"$f":"Orçamento!AA558","v":0},{"$f":"ROUND(F68*$D$66,2)","v":0},null,null,null,{"$f":"ROUND(J68*$D$66,2)","v":0},null,null,null,{"$f":"ROUND(N68*$D$66,2)","v":0},null,null,null,{"$f":"SUM(F66:Q66)","v":0}]
[{"$f":"IF(A66=\"F\",A66,\"\")","v":""}]
[{"$f":"IF(A67=\"F\",A67,\"\")","v":""},null,null,null,null,0,null,null,null,0,null,null,null,{"$f":"1-F68-J68","v":1},null,null,null,{"$f":"IFERROR(E66/100,\"\")","v":0}]
[{"$f":"IF(D69>0,\"F\",\"\")","v":""},"REVESTIMENTO DE PAREDE",null,{"$f":"Orçamento!X559","v":0},{"$f":"Orçamento!AA559","v":0},{"$f":"ROUND(F71*$D$69,2)","v":0},null,null,null,{"$f":"ROUND(J71*$D$69,2)","v":0},null,null,null,{"$f":"ROUND(N71*$D$69,2)","v":0},null,null,null,{"$f":"SUM(F69:Q69)","v":0}]
[{"$f":"IF(A69=\"F\",A69,\"\")","v":""}]
[{"$f":"IF(A70=\"F\",A70,\"\")","v":""},null,null,null,null,0,null,null,null,0.56999999999999995,null,null,null,{"$f":"1-F71-J71","v":0.43000000000000005},null,null,null,{"$f":"IFERROR(E69/100,\"\")","v":0}]
[{"$f":"IF(D72>0,\"F\",\"\")","v":""},"FORROS",null,{"$f":"Orçamento!X560","v":0},{"$f":"Orçamento!AA560","v":0},{"$f":"ROUND(F74*$D$72,2)","v":0},null,null,null,{"$f":"ROUND(J74*$D$72,2)","v":0},null,null,null,{"$f":"ROUND(N74*$D$72,2)","v":0},null,null,null,{"$f":"SUM(F72:Q72)","v":0}]
[{"$f":"IF(A72=\"F\",A72,\"\")","v":""}]
[{"$f":"IF(A73=\"F\",A73,\"\")","v":""},null,null,null,null,0,null,null,null,0,null,null,null,{"$f":"1-F74-J74","v":1},null,null,null,{"$f":"IFERROR(E72/100,\"\")","v":0}]
[{"$f":"IF(D75>0,\"F\",\"\")","v":""},"REVESTIMENTO DE PISO",null,{"$f":"Orçamento!X561","v":0},{"$f":"Orçamento!AA561","v":0},{"$f":"ROUND(F77*$D$75,2)","v":0},null,null,null,{"$f":"ROUND(J77*$D$75,2)","v":0},null,null,null,{"$f":"ROUND(N77*$D$75,2)","v":0},null,null,null,{"$f":"SUM(F75:Q75)","v":0}]
[{"$f":"IF(A75=\"F\",A75,\"\")","v":""}]
[{"$f":"IF(A76=\"F\",A76,\"\")","v":""},null,null,null,null,0,null,null,null,0.78,null,null,null,{"$f":"1-F77-J77","v":0.21999999999999997},null,null,null,{"$f":"IFERROR(E75/100,\"\")","v":0}]
[{"$f":"IF(D78>0,\"F\",\"\")","v":""},"FERRAGENS",null,{"$f":"Orçamento!X562","v":0},{"$f":"Orçamento!AA562","v":0},{"$f":"ROUND(F80*$D$78,2)","v":0},null,null,null,{"$f":"ROUND(J80*$D$78,2)","v":0},null,null,null,{"$f":"ROUND(N80*$D$78,2)","v":0},null,null,null,{"$f":"SUM(F78:Q78)","v":0}]
[{"$f":"IF(A78=\"F\",A78,\"\")","v":""}]
[{"$f":"IF(A79=\"F\",A79,\"\")","v":""},null,null,null,null,0,null,null,null,0,null,null,null,{"$f":"1-F80-J80","v":1},null,null,null,{"$f":"IFERROR(E78/100,\"\")","v":0}]
[{"$f":"IF(D81>0,\"F\",\"\")","v":""},"MARCENARIA",null,{"$f":"Orçamento!X563","v":0},{"$f":"Orçamento!AA563","v":0},{"$f":"ROUND(F83*$D$81,2)","v":0},null,null,null,{"$f":"ROUND(J83*$D$81,2)","v":0},null,null,null,{"$f":"ROUND(N83*$D$81,2)","v":0},null,null,null,{"$f":"SUM(F81:Q81)","v":0}]
[{"$f":"IF(A81=\"F\",A81,\"\")","v":""}]
[{"$f":"IF(A82=\"F\",A82,\"\")","v":""},null,null,null,null,0.4,null,null,null,{"$f":"1-B83","v":1},null,null,null,{"$f":"1-F83","v":0.6},null,null,null,{"$f":"IFERROR(E81/100,\"\")","v":0}]
[{"$f":"IF(D84>0,\"F\",\"\")","v":""},"ADMINISTRAÇÃO - MENSALISTAS",null,{"$f":"Orçamento!X564","v":0},{"$f":"Orçamento!AA564","v":0},{"$f":"ROUND(F86*$D$84,2)","v":0},null,null,null,{"$f":"ROUND(J86*$D$84,2)","v":0},null,null,null,{"$f":"ROUND(N86*$D$84,2)","v":0},null,null,null,{"$f":"SUM(F84:Q84)","v":0}]
[{"$f":"IF(A84=\"F\",A84,\"\")","v":""}]
[{"$f":"IF(A85=\"F\",A85,\"\")","v":""},null,null,null,null,0.4,null,null,null,0.3,null,null,null,{"$f":"1-F86-J86","v":0.3},null,null,null,{"$f":"IFERROR(E84/100,\"\")","v":0}]
[{"$f":"IF(D87>0,\"F\",\"\")","v":""},"PINTURA",null,{"$f":"Orçamento!X565","v":0},{"$f":"Orçamento!AA565","v":0},{"$f":"ROUND(F89*$D$87,2)","v":0},null,null,null,{"$f":"ROUND(J89*$D$87,2)","v":0},null,null,null,{"$f":"ROUND(N89*$D$87,2)","v":0},null,null,null,{"$f":"SUM(F87:Q87)","v":0}]
[{"$f":"IF(A87=\"F\",A87,\"\")","v":""}]
[{"$f":"IF(A88=\"F\",A88,\"\")","v":""},null,null,null,null,0,null,null,null,0.47,null,null,null,{"$f":"1-F89-J89","v":0.53},null,null,null,{"$f":"IFERROR(E87/100,\"\")","v":0}]
[{"$f":"IF(D90>0,\"F\",\"\")","v":""},"DIVERSOS",null,{"$f":"Orçamento!X566","v":0},{"$f":"Orçamento!AA566","v":0},{"$f":"ROUND(F92*$D$90,2)","v":0},null,null,null,{"$f":"ROUND(J92*$D$90,2)","v":0},null,null,null,{"$f":"ROUND(N92*$D$90,2)","v":0},null,null,null,{"$f":"SUM(F90:Q90)","v":0}]
[{"$f":"IF(A90=\"F\",A90,\"\")","v":""}]
[{"$f":"IF(A91=\"F\",A91,\"\")","v":""},null,null,null,null,0,null,null,null,0,null,null,null,{"$f":"1-F92-J92","v":1},null,null,null,{"$f":"IFERROR(E90/100,\"\")","v":0}]
["F","CUSTO DO ORÇAMENTO",null,{"$f":"SUM(D15:D92)","v":0},{"$f":"SUM(E15:E92)","v":0},{"$f":"F15+F18+F21+F24+F27+F30+F33+F36+F39+F42+F45+F48+F51+F54+F57+F60+F63+F66+F69+F72+F75+F78+F81+F84+F87+F90","v":0},null,null,null,{"$f":"J15+J18+J21+J24+J27+J30+J33+J36+J39+J42+J45+J48+J51+J54+J57+J60+J63+J66+J69+J72+J75+J78+J81+J84+J87+J90","v":0},null,null,null,{"$f":"N15+N18+N21+N24+N27+N30+N33+N36+N39+N42+N45+N48+N51+N54+N57+N60+N63+N66+N69+N72+N75+N78+N81+N84+N87+N90","v":0},null,null,null,{"$f":"R15+R18+R21+R24+R27+R30+R33+R36+R39+R42+R45+R48+R51+R54+R57+R60+R63+R66+R69+R72+R75+R78+R81+R84+R87+R90","v":0}]
["F","PERCENTUAIS:",null,null,null,{"$f":"IFERROR(F93/D93,\"\")","v":""},null,null,null,{"$f":"IFERROR(J93/D93,\"\")","v":""},null,null,null,{"$f":"IFERROR(N93/D93,\"\")","v":""},null,null,null,{"$f":"SUM(F94:Q94)","v":0}]
["F","TOTAIS ACUMULADOS:",null,null,null,{"$f":"F93","v":0},null,null,null,{"$f":"F95+J93","v":0},null,null,null,{"$f":"J95+N93","v":0}]
["F","PERCENTUAIS  ACUMULADOS:",null,null,null,{"$f":"F94","v":""},null,null,null,{"$f":"IFERROR(F96+J94,\"\")","v":""},null,null,null,{"$f":"IFERROR(J96+N94,\"\")","v":""}]
["F"]
["F","OBSERVAÇÕES:"]
["F","Os pagamentos somente poderão ser efetuados mediante medição e atesto pelos técnicos da Secretaria da Educação. "]

{"sheet":"Composição BDI","index":4,"n_rows":45,"n_cols":9,"rows_kept":45,"cut":false,"hidden":false,"merged":[[18,5,18,8],[17,0,17,3],[16,0,16,3],[44,0,44,3],[42,0,42,3],[43,0,43,3],[18,0,18,3],[36,0,36,3],[39,0,39,3],[38,0,38,3],[40,0,40,3],[29,0,29,2],[32,0,32,3],[33,0,33,3],[34,0,34,3],[35,0,35,3],[0,0,0,3],[2,0,2,3],[3,0,3,3],[1,0,1,3],[5,0,5,3],[4,0,4,3],[12,0,12,3],[13,0,13,3],[14,0,14,3],[15,0,15,3],[6,0,6,3],[8,0,8,3],[7,0,7,3],[9,0,9,3],[11,0,11,3],[10,0,10,3]]}
[]
[]
["UNIDADE ESCOLAR"]
[{"$f":"Orçamento!$O$4","v":"CENTRO DE ENSINO EM PERÍODO INTEGRAL POLIVALENTE ANTÔNIO C PANIAGO"}]
[]
["OBRA"]
[{"$f":"Orçamento!$O$7","v":"REFORMA E AMPLIAÇÃO"}]
[]
["ENDEREÇO"]
[{"$f":"Orçamento!$R$10","v":"RUA 6 A, MARTINS, CEP:75832-028"}]
[]
["CIDADE"]
[{"$f":"Orçamento!$X$7","v":"MINEIROS"}]
[]
["CRE"]
[{"$f":"Orçamento!$O$10","v":"MINEIROS"}]
[]
["DETALHAMENTO DA COMPOSIÇÃO DE BDI"]
["COMPOSIÇÃO BDI PARA OBRAS CIVIS",null,null,null,null,"BDI CONSTRUÇÃO E REFORMA"]
["DESCRIÇÃO","COEF.","TAXA % (a.m)","% no preço de venda",null,"Situação","1º Quartil","Médio","3º Quartil"]
["1) COFINS",1,0.03,{"$f":"C21","v":0.03},null,{"$f":"IF(OR(C21<G21,C21>I21),\"FORA DO INTERVALO\",\"OK\")","v":"OK"},0.03,0.03,0.03]
["2) PIS",1,6.4999999999999997E-3,{"$f":"C22","v":6.4999999999999997E-3},null,{"$f":"IF(OR(C22<G22,C22>I22),\"FORA DO INTERVALO\",\"OK\")","v":"OK"},6.4999999999999997E-3,6.4999999999999997E-3,6.4999999999999997E-3]
["3) ISSQN",1,0.03,{"$f":"C23*B23","v":0.03},null,"OK",0.02,3.5000000000000003E-2,0.05]
["4) CPRB",1,0,{"$f":"C24","v":0},null,"FORA DO INTERVALO",4.4999999999999998E-2,4.4999999999999998E-2,4.4999999999999998E-2]
["5) Administração Central",1,0.04,0.04,null,"OK",0.03,0.04,5.5E-2]
["6) Despesas Financeiras",1,5.5999999999999999E-3,5.5999999999999999E-3,null,"FORA DO INTERVALO",5.8999999999999999E-3,1.23E-2,1.3899999999999999E-2]
["7) Seguros + Garantias",1,1.1999999999999999E-3,1.1999999999999999E-3,null,"FORA DO INTERVALO",8.0000000000000002E-3,8.0000000000000002E-3,0.01]
["8) Risco",1,9.7000000000000003E-3,9.7000000000000003E-3,null,"OK",9.7000000000000003E-3,1.2699999999999999E-2,1.2699999999999999E-2]
["9) Lucro",1,7.1999999999999995E-2,7.1999999999999995E-2,null,"OK",6.1600000000000002E-2,7.3999999999999996E-2,8.9599999999999999E-2]
["BDI - FINAL",null,null,{"$f":"(((1+D25+D27+D28)*(1+D26)*(1+D29))/(1-(D21+D22+D23+D24))-1)","v":0.21357639301553344},null,"FORA DO INTERVALO",0.2034,0.22120000000000001,0.25]
[]
["Notas:"]
["(1) e (2) Alíquota definida por lei."]
["(3) Alíquota e base de cálculo definidas pela legislação municipal."]
["(4) Alíquota definida pelas leis 12.546/11, 12844/13 e 13.161/15 (CPRB – contribuição previdenciária sobre a receita bruta)."]
["(5) Valores definidos a partir dos limites no Acórdão nº 2.622/2013 - TCU – Plenário. Valores entre o 1º e 3º quartis."]
["(6) Valor calculado pela expressão matemática do acórdão 2.369/2011 – TCU – Plenário e disponibilizado pela AGETOP em dezembro de 2018. (Foi utilizado para o cálculo a média da Taxa SELIC no período de 11/2017 a 10/2018)"]
[]
["(7) Valores definidos pela AGETOP a partir dos limites no Acórdão nº 2.622/2013 - TCU – Plenário. Valores médios. \n\nObservação da AGETOP: (Seguros contra erros de execução, incêndio e explosão, danos da natureza (vendaval, destelhamento, alagamento, inundação, desmoronamento, geadas etc.), emprego de material defeituoso ou inadequado, roubo e/ou furto qualificado, quebra de equipamentos, desmoronamento de estrutura, nas modalidades de Obras Civis em Construção (OCC); Instalação e Montagem (IM); e Obras Civis em Construção e Instalação e Montagem (OCC/IM). Bem como coberturas adicionais para ampliação dessas coberturas básicas, como: cobertura de responsabilidade civil geral, cobertura de responsabilidade civil cruzada, cobertura de despesas extraordinárias, cobertura de tumultos, cobertura de desentulho do local, cobertura de riscos do fabricante, dentre outras, incluindo o seguro de vida em grupo regido pela convenção coletiva dos trabalhadores na indústria da construção civil). A partir de 24/02/2015 por intermédio da Portaria 449/2015 a Presidência da AGETOP, na pessoa do Senhor Jayme Eduardo Rincon, determinou a exclusão dos valores referentes aos Seguros de Risco de Engenharia e Responsabilidade Civil do Profissional na composição do cálculo do B.D.I.."]
["(8) Valores definidos a partir dos limites no Acórdão nº 2.622/2013 - TCU – Plenário. Valores entre 1º e 3° quartis."]
["(9) Valores definidos a partir dos limites definidos no Acórdão nº 2.622/2013 - TCU – Plenário. Valores adotados e praticados no mercado ( “ ex ante ” ) ou aqueles entre os 1º e 3º quartis."]
[]
["(*) A fórmula para estipulação da taxa de BDI estimado adotado é a mesma que foi aplicada para a obtenção das tabelas contidas no Acórdão n. 2.622/2013 – TCUPlenário"]
[]
["Obs.: Para obras com valores superiores a R$ 20.000.000,00 sugere-se recalcular o BDI, dimensionando as taxas de administração central e lucro para patamares inferiores ao estipulado acima."]

{"sheet":"Relatório CENTRAL","index":5,"n_rows":40,"n_cols":5,"rows_kept":40,"cut":false,"hidden":false,"merged":[[11,1,11,4],[39,1,39,2],[9,0,11,0],[0,1,0,4],[6,3,6,4],[9,3,9,4],[1,1,1,4],[2,1,2,2],[2,3,2,4],[3,1,3,2],[3,3,3,4],[4,1,4,4],[5,1,5,2],[5,3,5,4],[6,1,6,2],[7,1,7,4],[8,1,8,2],[8,3,8,4],[9,1,9,2],[10,1,10,4]]}
[]
[]
[null,"UNIDADE ESCOLAR",null,"CIDADE"]
[null,{"$f":"Orçamento!$O$4","v":"CENTRO DE ENSINO EM PERÍODO INTEGRAL POLIVALENTE ANTÔNIO C PANIAGO"},null,{"$f":"Orçamento!$X$7","v":"MINEIROS"}]
[]
[null,"OBRA",null,"CRE"]
[null,{"$f":"Orçamento!$O$7","v":"REFORMA E AMPLIAÇÃO"},null,{"$f":"Orçamento!$O$10","v":"MINEIROS"}]
[]
[null,"ENDEREÇO",null,"DATA"]
["FILTRO",{"$f":"Orçamento!$R$10","v":"RUA 6 A, MARTINS, CEP:75832-028"},null,{"$f":"Orçamento!$S$7","v":"2020-04-23"}]
[]
[null,"RELATÓRIO CENTRAL"]
["↓","CÓDIGO","ETAPA","PREÇO  (R$) C/ BDI","PARTIC  ( % )"]
[{"$f":"IF(D14>0,\"F\",\"\")","v":""},{"$f":"Orçamento!O541","v":"a."},{"$f":"Orçamento!P541","v":"SERVIÇOS PRELIMINARES"},{"$f":"Orçamento!X541","v":0},{"$f":"Orçamento!AA541","v":0}]
[{"$f":"IF(D15>0,\"F\",\"\")","v":""},{"$f":"Orçamento!O542","v":"b."},{"$f":"Orçamento!P542","v":"TRANSPORTES"},{"$f":"Orçamento!X542","v":0},{"$f":"Orçamento!AA542","v":0}]
["",{"$f":"Orçamento!O543","v":"c."},{"$f":"Orçamento!P543","v":"SERVIÇO EM TERRA"},{"$f":"Orçamento!X543","v":0},{"$f":"Orçamento!AA543","v":0}]
["",{"$f":"Orçamento!O544","v":"d."},{"$f":"Orçamento!P544","v":"FUNDAÇÕES E SONDAGENS"},{"$f":"Orçamento!X544","v":0},{"$f":"Orçamento!AA544","v":0}]
["",{"$f":"Orçamento!O545","v":"e."},{"$f":"Orçamento!P545","v":"ESTRUTURA"},{"$f":"Orçamento!X545","v":0},{"$f":"Orçamento!AA545","v":0}]
["",{"$f":"Orçamento!O546","v":"f."},{"$f":"Orçamento!P546","v":"INSTALAÇÕES ELÉTRICAS"},{"$f":"Orçamento!X546","v":0},{"$f":"Orçamento!AA546","v":0}]
["",{"$f":"Orçamento!O547","v":"g."},{"$f":"Orçamento!P547","v":"INSTALAÇÕES HIDROSSANITÁRIAS"},{"$f":"Orçamento!X547","v":0},{"$f":"Orçamento!AA547","v":0}]
["",{"$f":"Orçamento!O548","v":"h"},{"$f":"Orçamento!P548","v":"INSTALAÇÕES ESPECIAIS"},{"$f":"Orçamento!X548","v":0},{"$f":"Orçamento!AA548","v":0}]
["",{"$f":"Orçamento!O549","v":"i."},{"$f":"Orçamento!P549","v":"ALVENARIAS E DIVISÓRIAS"},{"$f":"Orçamento!X549","v":0},{"$f":"Orçamento!AA549","v":0}]
["",{"$f":"Orçamento!O550","v":"j."},{"$f":"Orçamento!P550","v":"ALVENARIA AUTO-PORTANTE"},{"$f":"Orçamento!X550","v":0},{"$f":"Orçamento!AA550","v":0}]
["",{"$f":"Orçamento!O551","v":"k."},{"$f":"Orçamento!P551","v":"IMPERMEABILIZAÇÃO"},{"$f":"Orçamento!X551","v":0},{"$f":"Orçamento!AA551","v":0}]
["",{"$f":"Orçamento!O552","v":"l."},{"$f":"Orçamento!P552","v":"ISOLAMENTO TÉRMICO E ACÚSTICO"},{"$f":"Orçamento!X552","v":0},{"$f":"Orçamento!AA552","v":0}]
["",{"$f":"Orçamento!O553","v":"m."},{"$f":"Orçamento!P553","v":"ESTRUTURA DE MADEIRA"},{"$f":"Orçamento!X553","v":0},{"$f":"Orçamento!AA553","v":0}]
["",{"$f":"Orçamento!O554","v":"n."},{"$f":"Orçamento!P554","v":"ESTRUTURAS METÁLICAS"},{"$f":"Orçamento!X554","v":0},{"$f":"Orçamento!AA554","v":0}]
["",{"$f":"Orçamento!O555","v":"o."},{"$f":"Orçamento!P555","v":"COBERTURAS"},{"$f":"Orçamento!X555","v":0},{"$f":"Orçamento!AA555","v":0}]
["",{"$f":"Orçamento!O556","v":"p."},{"$f":"Orçamento!P556","v":"ESQUADRIAS DE MADEIRA"},{"$f":"Orçamento!X556","v":0},{"$f":"Orçamento!AA556","v":0}]
["",{"$f":"Orçamento!O557","v":"q."},{"$f":"Orçamento!P557","v":"ESQUADRIAS METÁLICAS"},{"$f":"Orçamento!X557","v":0},{"$f":"Orçamento!AA557","v":0}]
["",{"$f":"Orçamento!O558","v":"r."},{"$f":"Orçamento!P558","v":"VIDROS"},{"$f":"Orçamento!X558","v":0},{"$f":"Orçamento!AA558","v":0}]
["",{"$f":"Orçamento!O559","v":"s."},{"$f":"Orçamento!P559","v":"REVESTIMENTO DE PAREDE"},{"$f":"Orçamento!X559","v":0},{"$f":"Orçamento!AA559","v":0}]
["",{"$f":"Orçamento!O560","v":"t."},{"$f":"Orçamento!P560","v":"FORROS"},{"$f":"Orçamento!X560","v":0},{"$f":"Orçamento!AA560","v":0}]
["",{"$f":"Orçamento!O561","v":"u."},{"$f":"Orçamento!P561","v":"REVESTIMENTO DE PISO"},{"$f":"Orçamento!X561","v":0},{"$f":"Orçamento!AA561","v":0}]
["",{"$f":"Orçamento!O562","v":"v."},{"$f":"Orçamento!P562","v":"FERRAGENS"},{"$f":"Orçamento!X562","v":0},{"$f":"Orçamento!AA562","v":0}]
["",{"$f":"Orçamento!O563","v":"w."},{"$f":"Orçamento!P563","v":"MARCENARIA"},{"$f":"Orçamento!X563","v":0},{"$f":"Orçamento!AA563","v":0}]
["",{"$f":"Orçamento!O564","v":"x."},{"$f":"Orçamento!P564","v":"ADMINISTRAÇÃO"},{"$f":"Orçamento!X564","v":0},{"$f":"Orçamento!AA564","v":0}]
["",{"$f":"Orçamento!O565","v":"y."},{"$f":"Orçamento!P565","v":"PINTURA"},{"$f":"Orçamento!X565","v":0},{"$f":"Orçamento!AA565","v":0}]
["",{"$f":"Orçamento!O566","v":"z."},{"$f":"Orçamento!P566","v":"DIVERSOS"},{"$f":"Orçamento!X566","v":0},{"$f":"Orçamento!AA566","v":0}]
["F","TOTAL GERAL DO ORÇAMENTO (R$) C/BDI",null,{"$f":"SUM(D14:D39)","v":0},{"$f":"SUM(E14:E39)","v":0}]

{"sheet":"Parc Maior Relev","index":6,"n_rows":22,"n_cols":7,"rows_kept":22,"cut":false,"hidden":false,"merged":[[0,1,0,6],[11,1,11,6],[1,1,1,6],[2,1,2,3],[2,4,2,6],[3,1,3,3],[3,4,3,6],[4,1,4,6],[5,1,5,3],[5,4,5,6],[9,1,9,3],[9,4,9,6],[10,1,10,6],[6,1,6,3],[6,4,6,6],[7,1,7,6],[10,0,12,0],[8,1,8,3],[8,4,8,6],[22,3,22,7],[20,1,20,6]]}
[]
[]
[null,"UNIDADE ESCOLAR",null,null,"CÓDIGO INEP"]
[null,{"$f":"Orçamento!$O$4","v":"CENTRO DE ENSINO EM PERÍODO INTEGRAL POLIVALENTE ANTÔNIO C PANIAGO"},null,null,{"$f":"Orçamento!$X$4","v":52053385}]
[]
[null,"OBRA",null,null,"CIDADE"]
[null,{"$f":"Orçamento!$O$7","v":"REFORMA E AMPLIAÇÃO"},null,null,{"$f":"Orçamento!$X$7","v":"MINEIROS"}]
[]
[null,"CRE",null,null,"ÁREA TOTAL CONSTRUÍDA (M²)"]
[null,{"$f":"Orçamento!$O$10","v":"MINEIROS"},null,null,{"$f":"Orçamento!$S$13","v":3442.6800000000003}]
["FILTRO"]
[null,"PARCELA DE MAIOR RELEVÂNCIA"]
[null,"CÓDIGO","SERVIÇO","DESCRIÇÃO","UNID","QUANT","PARC. MAIOR RELEV (100%)"]
[{"$f":"IF(F14>0,\"F\",\"\")","v":"F"},70000,"SUBESTAÇÃO","SUBESTAÇÃO","KVA",112.5,{"$f":"F14","v":112.5}]
[null,"CÓDIGO","SERVIÇO","DESCRIÇÃO","UNID","QUANT","PARC. MAIOR RELEV (50%)"]
[{"$f":"IF(F16>0,\"F\",\"\")","v":""},160000,"COBERTURAS","TELHA CERÂMICA","M2",{"$f":"Orçamento!V382+Orçamento!V500","v":0},{"$f":"F16*0.5","v":0}]
[{"$f":"IF(F17>0,\"F\",\"\")","v":""},220000,"REVESTIMENTO DE PISO","GRANITINA","M2",{"$f":"Orçamento!V213+Orçamento!V399+Orçamento!V510","v":0},{"$f":"F17*0.5","v":0}]
["",null,{"$f":"IFERROR(VLOOKUP(B18,Orçamento!$O$541:$P$566,2,FALSE),\"(inserir código ao lado)\")","v":"(inserir código ao lado)"},null,{"$f":"IFERROR(VLOOKUP($D18,Orçamento!$R$522:$Y$522,2,FALSE),\"-\")","v":"-"},{"$f":"SUMIF(Orçamento!$R$522:$R$522,'Parc Maior Relev'!D18,Orçamento!$T$522:$T$522)","v":0},0]
["",null,{"$f":"IFERROR(VLOOKUP(B19,Orçamento!$O$541:$P$566,2,FALSE),\"(inserir código ao lado)\")","v":"(inserir código ao lado)"},null,{"$f":"IFERROR(VLOOKUP($D19,Orçamento!$R$522:$Y$522,2,FALSE),\"-\")","v":"-"},{"$f":"SUMIF(Orçamento!$R$522:$R$522,'Parc Maior Relev'!D19,Orçamento!$T$522:$T$522)","v":0},0]
["F"]
["F","(*) Para os fins do inciso I dp § 1º do Art. 30 da Lei Federal 8.666/93, são consideradas parcelas de maior relevância técnica as execuções apresentadas"]
["F"]

{"sheet":"Composições","index":7,"n_rows":372,"n_cols":10,"rows_kept":372,"cut":false,"hidden":false,"merged":[[15,0,15,9],[13,0,13,2],[13,3,13,6],[1,0,1,9],[3,7,3,9],[4,7,4,9],[6,7,6,9],[7,7,7,9],[6,0,6,6],[10,8,10,9],[13,8,13,9],[14,0,14,9],[8,0,8,9],[5,0,5,9],[2,0,2,9],[0,0,0,8],[10,0,10,2],[10,3,10,6],[11,0,11,9],[12,0,12,2],[12,3,12,6],[12,7,12,8],[7,0,7,6],[9,0,9,2],[9,3,9,6],[9,7,9,8],[3,0,3,6],[4,0,4,6],[16,5,17,5],[16,6,16,7],[16,8,16,9],[22,1,22,7],[26,1,26,7],[16,0,17,0],[16,1,17,1],[16,2,17,2],[16,3,17,3],[16,4,17,4],[28,5,29,5],[28,6,28,7],[28,8,28,9],[34,1,34,7],[38,1,38,7],[28,0,29,0],[28,1,29,1],[28,2,29,2],[28,3,29,3],[28,4,29,4],[40,5,41,5],[40,6,40,7],[40,8,40,9],[46,1,46,7],[50,1,50,7],[40,0,41,0],[40,1,41,1],[40,2,41,2],[40,3,41,3],[40,4,41,4],[52,5,53,5],[52,6,52,7],[52,8,52,9],[57,1,57,7],[60,1,60,7],[52,0,53,0],[52,1,53,1],[52,2,53,2],[52,3,53,3],[52,4,53,4],[62,5,63,5],[62,6,62,7],[62,8,62,9],[67,1,67,7],[70,1,70,7],[62,0,63,0],[62,1,63,1],[62,2,63,2],[62,3,63,3],[62,4,63,4],[72,5,73,5],[72,6,72,7],[72,8,72,9],[78,1,78,7],[82,1,82,7],[72,0,73,0],[72,1,73,1],[72,2,73,2],[72,3,73,3],[72,4,73,4],[84,5,85,5],[84,6,84,7],[84,8,84,9],[90,1,90,7],[94,1,94,7],[84,0,85,0],[84,1,85,1],[84,2,85,2],[84,3,85,3],[84,4,85,4],[96,5,97,5],[96,6,96,7],[96,8,96,9],[102,1,102,7],[106,1,106,7],[96,0,97,0],[96,1,97,1],[96,2,97,2],[96,3,97,3],[96,4,97,4],[108,5,109,5],[108,6,108,7],[108,8,108,9],[114,1,114,7],[118,1,118,7],[108,0,109,0],[108,1,109,1],[108,2,109,2],[108,3,109,3],[108,4,109,4],[120,5,121,5],[120,6,120,7],[120,8,120,9],[126,1,126,7],[130,1,130,7],[120,0,121,0],[120,1,121,1],[120,2,121,2],[120,3,121,3],[120,4,121,4],[132,5,133,5],[132,6,132,7],[132,8,132,9],[138,1,138,7],[142,1,142,7],[132,0,133,0],[132,1,133,1],[132,2,133,2],[132,3,133,3],[132,4,133,4],[144,5,145,5],[144,6,144,7],[144,8,144,9],[150,1,150,7],[154,1,154,7],[144,0,145,0],[144,1,145,1],[144,2,145,2],[144,3,145,3],[144,4,145,4],[156,5,157,5],[156,6,156,7],[156,8,156,9],[160,1,160,7],[164,1,164,7],[156,0,157,0],[156,1,157,1],[156,2,157,2],[156,3,157,3],[156,4,157,4],[166,5,167,5],[166,6,166,7],[166,8,166,9],[172,1,172,7],[179,1,179,7],[166,0,167,0],[166,1,167,1],[166,2,167,2],[166,3,167,3],[166,4,167,4],[181,5,182,5],[181,6,181,7],[181,8,181,9],[187,1,187,7],[191,1,191,7],[181,0,182,0],[181,1,182,1],[181,2,182,2],[181,3,182,3],[181,4,182,4],[193,5,194,5],[193,6,193,7],[193,8,193,9],[199,1,199,7],[203,1,203,7],[193,0,194,0],[193,1,194,1],[193,2,194,2],[193,3,194,3],[193,4,194,4],[205,5,206,5],[205,6,205,7],[205,8,205,9],[211,1,211,7],[215,1,215,7],[205,0,206,0],[205,1,206,1],[205,2,206,2],[205,3,206,3],[205,4,206,4],[217,5,218,5],[217,6,217,7],[217,8,217,9],[223,1,223,7],[227,1,227,7],[217,0,218,0],[217,1,218,1],[217,2,218,2],[217,3,218,3],[217,4,218,4],[229,5,230,5],[229,6,229,7],[229,8,229,9],[235,1,235,7],[239,1,239,7],[229,0,230,0],[229,1,230,1],[229,2,230,2],[229,3,230,3],[229,4,230,4],[241,5,242,5],[241,6,241,7],[241,8,241,9],[247,1,247,7],[251,1,251,7],[241,0,242,0],[241,1,242,1],[241,2,242,2],[241,3,242,3],[241,4,242,4],[253,5,254,5],[253,6,253,7],[253,8,253,9],[259,1,259,7],[263,1,263,7],[253,0,254,0],[253,1,254,1],[253,2,254,2],[253,3,254,3],[253,4,254,4],[265,5,266,5],[265,6,265,7],[265,8,265,9],[271,1,271,7],[275,1,275,7],[265,0,266,0],[265,1,266,1],[265,2,266,2],[265,3,266,3],[265,4,266,4],[277,5,278,5],[277,6,277,7],[277,8,277,9],[283,1,283,7],[287,1,287,7],[277,0,278,0],[277,1,278,1],[277,2,278,2],[277,3,278,3],[277,4,278,4],[289,5,290,5],[289,6,289,7],[289,8,289,9],[295,1,295,7],[299,1,299,7],[289,0,290,0],[289,1,290,1],[289,2,290,2],[289,3,290,3],[289,4,290,4],[301,5,302,5],[301,6,301,7],[301,8,301,9],[307,1,307,7],[311,1,311,7],[301,0,302,0],[301,1,302,1],[301,2,302,2],[301,3,302,3],[301,4,302,4],[313,5,314,5],[313,6,313,7],[313,8,313,9],[319,1,319,7],[323,1,323,7],[313,0,314,0],[313,1,314,1],[313,2,314,2],[313,3,314,3],[313,4,314,4],[325,5,326,5],[325,6,325,7],[325,8,325,9],[331,1,331,7],[335,1,335,7],[325,0,326,0],[325,1,326,1],[325,2,326,2],[325,3,326,3],[325,4,326,4],[337,5,338,5],[337,6,337,7],[337,8,337,9],[343,1,343,7],[347,1,347,7],[337,0,338,0],[337,1,338,1],[337,2,338,2],[337,3,338,3],[337,4,338,4],[349,5,350,5],[349,6,349,7],[349,8,349,9],[355,1,355,7],[359,1,359,7],[349,0,350,0],[349,1,350,1],[349,2,350,2],[349,3,350,3],[349,4,350,4],[361,5,362,5],[361,6,361,7],[361,8,361,9],[367,1,367,7],[371,1,371,7],[361,0,362,0],[361,1,362,1],[361,2,362,2],[361,3,362,3],[361,4,362,4]]}
[]
[]
[]
["UNIDADE ESCOLAR",null,null,null,null,null,null,"CÓDIGO INEP"]
[{"$f":"Orçamento!$O$4","v":"CENTRO DE ENSINO EM PERÍODO INTEGRAL POLIVALENTE ANTÔNIO C PANIAGO"},null,null,null,null,null,null,{"$f":"Orçamento!$X$4","v":52053385}]
[]
["OBRA",null,null,null,null,null,null,"CIDADE"]
[{"$f":"Orçamento!$O$7","v":"REFORMA E AMPLIAÇÃO"},null,null,null,null,null,null,{"$f":"Orçamento!$X$7","v":"MINEIROS"}]
[]
["CRE",null,null,"ENDEREÇO",null,null,null,"REFERÊNCIA AGETOP"]
[{"$f":"Orçamento!$O$10","v":"MINEIROS"},null,null,{"$f":"Orçamento!$R$10","v":"RUA 6 A, MARTINS, CEP:75832-028"},null,null,null,{"$f":"Orçamento!$X$10","v":"DEZ/18"},{"$f":"Orçamento!$Y$10","v":"ONERADA"}]
[]
["DATA",null,null,"ÁREA TOTAL CONSTRUÍDA (M²)",null,null,null,"REFERÊNCIA SINAPI"]
[{"$f":"Orçamento!$S$7","v":"2020-04-23"},null,null,{"$f":"Orçamento!$S$13","v":3442.6800000000003},null,null,null,{"$f":"Orçamento!$X$13","v":"AGO/19"},{"$f":"Orçamento!$Y$13","v":"ONERADA"}]
[]
["COMPOSIÇÕES DE CUSTOS UNITÁRIOS - SEE-GO"]
[17,"FONTE","CÓDIGO","DESCRIÇÃO","UNIDADE","COEFIC.","CUSTO UNITÁRIO",null,"CUSTO  TOTAL (A) + (B) + (C) + (D) + (E)"]
[null,null,null,null,null,null,"DESONERADO","NÃO DESONER.","DESONERADO","NÃO DESONER."]
[null,"COMPOSIÇÃO","COMP 017_SEE","REDUCAO GIRATÓRIA TIPO STORZ LATAO P/ INST. PREDIAL COMBATE A INCENDIO ENGATE RAPIDO 2.1/2\" X 1.1/2\"","UN ",null,"-","-",99.14,99.69]
[null,"AGETOP_I",8,"AJUDANTE","h     ",0.16,8.1999999999999993,9.51,1.31,1.52]
[null,"AGETOP_I",11,"ENCANADOR","h     ",0.16,13.4,15.53,2.14,2.48]
[null,null,null,"","",null,0,0,0,0]
[null,"MÃO DE OBRA (B) - TOTAL",null,null,null,null,null,null,3.45,4]
[null,"SINAPI_I",20972,"REDUCAO FIXA TIPO STORZ, ENGATE RAPIDO 2.1/2\" X 1.1/2\", EM LATAO, PARA INSTALACAO PREDIAL COMBATE A INCENDIO PREDIAL                                                                                                                                                                                                                                                                                                                                                                                      ","UN    ",1,95.69,95.69,95.69,95.69]
[null,null,null,"","",null,0,0,0,0]
[null,null,null,"","",null,0,0,0,0]
[null,"MATERIAL (C) - TOTAL",null,null,null,null,null,null,95.69,95.69]
[]
[18,"FONTE","CÓDIGO","DESCRIÇÃO","UNIDADE","COEFIC.","CUSTO UNITÁRIO",null,"CUSTO  TOTAL (A) + (B) + (C) + (D) + (E)"]
[null,null,null,null,null,null,"DESONERADO","NÃO DESONER.","DESONERADO","NÃO DESONER."]
[null,"COMPOSIÇÃO","COMP 018_SEE","CHAVE DUPLA P/ CONEXÕES TIPO STORZ EM LATÃO ENGATE RÁPIDO 1 1/2\" X 2 1/2\"","UN ",null,"-","-",14.76,15.08]
[null,"AGETOP_I",11,"ENCANADOR","h     ",0.15,13.4,15.53,2.0099999999999998,2.33]
[null,null,null,"","",null,0,0,0,0]
[null,null,null,"","",null,0,0,0,0]
[null,"MÃO DE OBRA (B) - TOTAL",null,null,null,null,null,null,2.0099999999999998,2.33]
[null,"SINAPI_I",20971,"CHAVE DUPLA PARA CONEXOES TIPO STORZ, ENGATE RAPIDO 1 1/2\" X 2 1/2\", EM LATAO, PARA INSTALACAO PREDIAL COMBATE A INCENDIO                                                                                                                                                                                                                                                                                                                                                                                 ","UN    ",1,12.75,12.75,12.75,12.75]
[null,null,null,"","",null,0,0,0,0]
[null,null,null,"","",null,0,0,0,0]
[null,"MATERIAL (C) - TOTAL",null,null,null,null,null,null,12.75,12.75]
[]
[87,"FONTE","CÓDIGO","DESCRIÇÃO","UNIDADE","COEFIC.","CUSTO UNITÁRIO",null,"CUSTO  TOTAL (A) + (B) + (C) + (D) + (E)"]
[null,null,null,null,null,null,"DESONERADO","NÃO DESONER.","DESONERADO","NÃO DESONER."]
[null,"COMPOSIÇÃO","COMP 087_SEE","REGISTRO DE GAVETA COM HASTE ASCENDENTE DE BRONZE 2 1/2\"","UN ",null,null,null,257.29999999999995,261.26]
[null,"AGETOP_I",8,"AJUDANTE","h     ",1.1499999999999999,8.1999999999999993,9.51,9.43,10.94]
[null,"AGETOP_I",11,"ENCANADOR","h     ",1.1499999999999999,13.4,15.53,15.41,17.86]
[null,null,null,"","",null,0,0,0,0]
[null,"MÃO DE OBRA (B) - TOTAL",null,null,null,null,null,null,24.84,28.799999999999997]
[null,"AGETOP_I","H689","FITA VEDAROSCA 12 MM","m",2.82,0.28000000000000003,0.28000000000000003,0.79,0.79]
[null,"COTAÇÃO","COT 017_SEE","REGISTRO DE GAVETA COM HASTE ASCENDENTE DE BRONZE 2 1/2\"","UN ",1,231.66666666666666,231.66666666666666,231.67,231.67]
[null,null,null,"","",null,0,0,0,0]
[null,"MATERIAL (C) - TOTAL",null,null,null,null,null,null,232.45999999999998,232.45999999999998]
[]
[30,"FONTE","CÓDIGO","DESCRIÇÃO","UNIDADE","COEFIC.","CUSTO UNITÁRIO",null,"CUSTO  TOTAL (A) + (B) + (C) + (D) + (E)"]
[null,null,null,null,null,null,"DESONERADO","NÃO DESONER.","DESONERADO","NÃO DESONER."]
[null,"COMPOSIÇÃO","COMP 030_SEE","COTOVELO DE FERRO GALV. 90° X 2 1/2\"","UN ",null,null,null,69.16,72.33]
[null,"AGETOP_I",8,"AJUDANTE","h     ",0.92,8.1999999999999993,9.51,7.54,8.75]
[null,"AGETOP_I",11,"ENCANADOR","h     ",0.92,13.4,15.53,12.33,14.29]
[null,"MÃO DE OBRA (B) - TOTAL",null,null,null,null,null,null,19.87,23.04]
[null,"SINAPI_I",3470,"COTOVELO 90 GRAUS DE FERRO GALVANIZADO, COM ROSCA BSP, DE 2 1/2\"                                                                                                                                                                                                                                                                                                                                                                                                                                          ","UN    ",1,48.73,48.73,48.73,48.73]
[null,"AGETOP_I","H689","FITA VEDAROSCA 12 MM","m",2,0.28000000000000003,0.28000000000000003,0.56000000000000005,0.56000000000000005]
[null,"MATERIAL (C) - TOTAL",null,null,null,null,null,null,49.29,49.29]
[]
[77,"FONTE","CÓDIGO","DESCRIÇÃO","UNIDADE","COEFIC.","CUSTO UNITÁRIO",null,"CUSTO  TOTAL (A) + (B) + (C) + (D) + (E)"]
[null,null,null,null,null,null,"DESONERADO","NÃO DESONER.","DESONERADO","NÃO DESONER."]
[null,"COMPOSIÇÃO","COMP 077_SEE","UNIAO FERRO GALV C/ASSENTO CONICO BRONZE 2 1/2\"","UN ",null,null,null,148.30000000000001,149.66999999999999]
[null,"AGETOP_I",8,"AJUDANTE","h     ",0.4,8.1999999999999993,9.51,3.28,3.8]
[null,"AGETOP_I",11,"ENCANADOR","h     ",0.4,13.4,15.53,5.36,6.21]
[null,"MÃO DE OBRA (B) - TOTAL",null,null,null,null,null,null,8.64,10.01]
[null,"AGETOP_I","H689","FITA VEDAROSCA 12 MM","m",2.4,0.28000000000000003,0.28000000000000003,0.67,0.67]
[null,"SINAPI_I",12427,"UNIAO COM ASSENTO CONICO DE BRONZE, DIAMETRO 2 1/2\"                                                                                                                                                                                                                                                                                                                                                                                                                                                       ","UN    ",1,138.99,138.99,138.99,138.99]
[null,"MATERIAL (C) - TOTAL",null,null,null,null,null,null,139.66,139.66]
[]
[347,"FONTE","CÓDIGO","DESCRIÇÃO","UNIDADE","COEFIC.","CUSTO UNITÁRIO",null,"CUSTO  TOTAL (A) + (B) + (C) + (D) + (E)"]
[null,null,null,null,null,null,"DESONERADO","NÃO DESONER.","DESONERADO","NÃO DESONER."]
[null,"COMPOSIÇÃO","COMP 347_SEE","ADAPTADOR PVC SOLDAVEL, COM FLANGES LIVRES, 75 MM X 2 1/2\", PARA CAIXA D' AGUA","UN ",null,null,null,121.10000000000001,121.57000000000001]
[null,"AGETOP_I",11,"ENCANADOR","h     ",0.14000000000000001,13.4,15.53,1.88,2.17]
[null,"AGETOP_I",8,"AJUDANTE","h     ",0.14000000000000001,8.1999999999999993,9.51,1.1499999999999999,1.33]
[null,null,null,"","",null,0,0,0,0]
[null,"MÃO DE OBRA (B) - TOTAL",null,null,null,null,null,null,3.03,3.5]
[null,"SINAPI_I",83,"ADAPTADOR PVC SOLDAVEL, COM FLANGES LIVRES, 75 MM X 2  1/2\", PARA CAIXA D' AGUA                                                                                                                                                                                                                                                                                                                                                                                                                           ","UN    ",1,117.54,117.54,117.54,117.54]
[null,"AGETOP_I","H689","FITA VEDAROSCA 12 MM","m",1.88,0.28000000000000003,0.28000000000000003,0.53,0.53]
[null,null,null,"","",null,0,0,0,0]
[null,"MATERIAL (C) - TOTAL",null,null,null,null,null,null,118.07000000000001,118.07000000000001]
[]
[22,"FONTE","CÓDIGO","DESCRIÇÃO","UNIDADE","COEFIC.","CUSTO UNITÁRIO",null,"CUSTO  TOTAL (A) + (B) + (C) + (D) + (E)"]
[null,null,null,null,null,null,"DESONERADO","NÃO DESONER.","DESONERADO","NÃO DESONER."]
[null,"COMPOSIÇÃO","COMP 022_SEE","TAMPÃO FOFO 40X50CM C/INSCRIÇÃO ","UN ",null,"-","-",199.82999999999998,200.15]
[null,"AGETOP_I",11,"ENCANADOR","h     ",0.15,13.4,15.53,2.0099999999999998,2.33]
[null,null,null,"","",null,0,0,0,0]
[null,null,null,"","",null,0,0,0,0]
[null,"MÃO DE OBRA (B) - TOTAL",null,null,null,null,null,null,2.0099999999999998,2.33]
[null,"SINAPI_I",11293,"TAMPAO FOFO SIMPLES COM BASE, CLASSE A15 CARGA MAX 1,5 T, 400 X 500 MM, COM INSCRICAO INCENDIO                                                                                                                                                                                                                                                                                                                                                                                                            ","UN    ",1,197.82,197.82,197.82,197.82]
[null,null,null,"","",null,0,0,0,0]
[null,null,null,"","",null,0,0,0,0]
[null,"MATERIAL (C) - TOTAL",null,null,null,null,null,null,197.82,197.82]
[]
[546,"FONTE","CÓDIGO","DESCRIÇÃO","UNID ","COEFIC.","CUSTO UNITÁRIO",null,"CUSTO  TOTAL (A) + (B) + (C) + (D) + (E)"]
[null,null,null,null,null,null,"DESONERADO","NÃO DESONER.","DESONERADO","NÃO DESONER."]
[null,"COMPOSIÇÃO","COMP 546_SEE","BUJÃO DE REBORDO 2.1/2\"","UN ","-","-","-",16.509999999999998,16.760000000000002]
[null,"AGETOP_I",8,"AJUDANTE","h     ",7.0000000000000007E-2,8.1999999999999993,9.51,0.56999999999999995,0.67]
[null,"AGETOP_I",11,"ENCANADOR","h     ",7.0000000000000007E-2,13.4,15.53,0.94,1.0900000000000001]
[null,null,null,"","",null,0,0,0,0]
[null,"MÃO DE OBRA (B) - TOTAL",null,null,null,null,null,null,1.5099999999999998,1.7600000000000002]
[null,"COTAÇÃO","COT 286_SEE","BUJÃO DE REBORDO 2.1/2\"","UN ",1,15,15,15,15]
[null,null,null,"","",null,0,0,0,0]
[null,null,null,"","",null,0,0,0,0]
[null,"MATERIAL (C) - TOTAL",null,null,null,null,null,null,15,15]
[]
[186,"FONTE","CÓDIGO","DESCRIÇÃO","UNIDADE","COEFIC.","CUSTO UNITÁRIO",null,"CUSTO  TOTAL (A) + (B) + (C) + (D) + (E)"]
[null,null,null,null,null,null,"DESONERADO","NÃO DESONER.","DESONERADO","NÃO DESONER."]
[null,"COMPOSIÇÃO","COMP 186_SEE","BOTOEIRA BOMBA DE INCÊNDIO C/ MARTELO CONVENCIONAL/ ANALÓGICA","UN ",null,null,null,85.1,88.539999999999992]
[null,"AGETOP_I",8,"AJUDANTE","h     ",1,8.1999999999999993,9.51,8.1999999999999993,9.51]
[null,"AGETOP_I",12,"ELETRICISTA","h     ",1,13.4,15.53,13.4,15.53]
[null,null,null,"","",null,0,0,0,0]
[null,"MÃO DE OBRA (B) - TOTAL",null,null,null,null,null,null,21.6,25.04]
[null,"COTAÇÃO","COT 088_SEE","BOTOEIRA BOMBA DE INCÊNDIO C/ MARTELO CONVENCIONAL/ ANALÓGICA","UN",1,63.5,63.5,63.5,63.5]
[null,null,null,"","",null,0,0,0,0]
[null,null,null,"","",null,0,0,0,0]
[null,"MATERIAL (C) - TOTAL",null,null,null,null,null,null,63.5,63.5]
[]
[188,"FONTE","CÓDIGO","DESCRIÇÃO","UNIDADE","COEFIC.","CUSTO UNITÁRIO",null,"CUSTO  TOTAL (A) + (B) + (C) + (D) + (E)"]
[null,null,null,null,null,null,"DESONERADO","NÃO DESONER.","DESONERADO","NÃO DESONER."]
[null,"COMPOSIÇÃO","COMP 188_SEE","ACIONADOR MANUAL DE ALARME","UN ",null,null,null,100.61,103.36]
[null,"AGETOP_I",8,"AJUDANTE","h     ",0.8,8.1999999999999993,9.51,6.56,7.61]
[null,"AGETOP_I",12,"ELETRICISTA","h     ",0.8,13.4,15.53,10.72,12.42]
[null,null,null,"","",null,0,0,0,0]
[null,"MÃO DE OBRA (B) - TOTAL",null,null,null,null,null,null,17.28,20.03]
[null,"COTAÇÃO","COT 090_SEE","ACIONADOR MANUAL DE ALARME","UN",1,83.333333333333329,83.333333333333329,83.33,83.33]
[null,null,null,"","",null,0,0,0,0]
[null,null,null,"","",null,0,0,0,0]
[null,"MATERIAL (C) - TOTAL",null,null,null,null,null,null,83.33,83.33]
[]
[190,"FONTE","CÓDIGO","DESCRIÇÃO","UNIDADE","COEFIC.","CUSTO UNITÁRIO",null,"CUSTO  TOTAL (A) + (B) + (C) + (D) + (E)"]
[null,null,null,null,null,null,"DESONERADO","NÃO DESONER.","DESONERADO","NÃO DESONER."]
[null,"COMPOSIÇÃO","COMP 190_SEE","CENTRAL DE DETECÇÃO E ALARME DE 40 SETORES COM BATERIA","UN ",null,null,null,1136.1300000000001,1163.6500000000001]
[null,"AGETOP_I",8,"AJUDANTE","h     ",8,8.1999999999999993,9.51,65.599999999999994,76.08]
[null,"AGETOP_I",12,"ELETRICISTA","h     ",8,13.4,15.53,107.2,124.24]
[null,null,null,"","",null,0,0,0,0]
[null,"MÃO DE OBRA (B) - TOTAL",null,null,null,null,null,null,172.8,200.32]
[null,"COTAÇÃO","COT 092_SEE","CENTRAL DE DETECÇÃO E ALARME DE 40 SETORES COM BATERIA (PREÇO MÉDIO)","UN",1,963.33333333333337,963.33333333333337,963.33,963.33]
[null,null,null,"","",null,0,0,0,0]
[null,null,null,"","",null,0,0,0,0]
[null,"MATERIAL (C) - TOTAL",null,null,null,null,null,null,963.33,963.33]
[]
[24,"FONTE","CÓDIGO","DESCRIÇÃO","UNIDADE","COEFIC.","CUSTO UNITÁRIO",null,"CUSTO  TOTAL (A) + (B) + (C) + (D) + (E)"]
[null,null,null,null,null,null,"DESONERADO","NÃO DESONER.","DESONERADO","NÃO DESONER."]
[null,"COMPOSIÇÃO","COMP 024_SEE","SINALIZADOR FOTOLUMINESCENTE PARA EXTINTOR","UN ",null,"-","-",24.109999999999996,24.229999999999997]
[null,"AGETOP_I",5,"SERVENTE","h     ",0.09,8.1999999999999993,9.51,0.74,0.86]
[null,null,null,"","",null,0,0,0,0]
[null,null,null,"","",null,0,0,0,0]
[null,"MÃO DE OBRA (B) - TOTAL",null,null,null,null,null,null,0.74,0.86]
[null,"AGETOP_I",3070,"BUCHA DE NYLON S-6","un",2,0.04,0.04,0.08,0.08]
[null,"AGETOP_I",3393,"PARAFUSO P/BUCHA S-6","un",2,0.08,0.08,0.16,0.16]
[null,"SINAPI_I",37556,"PLACA DE SINALIZACAO DE SEGURANCA CONTRA INCENDIO, FOTOLUMINESCENTE, QUADRADA, *20 X 20* CM, EM PVC *2* MM ANTI-CHAMAS (SIMBOLOS, CORES E PICTOGRAMAS CONFORME NBR 13434)                                                                                                                                                                                                                                                                                                                                 ","UN    ",1,23.13,23.13,23.13,23.13]
[null,"MATERIAL (C) - TOTAL",null,null,null,null,null,null,23.369999999999997,23.369999999999997]
[]
[25,"FONTE","CÓDIGO","DESCRIÇÃO","UNIDADE","COEFIC.","CUSTO UNITÁRIO",null,"CUSTO  TOTAL (A) + (B) + (C) + (D) + (E)"]
[null,null,null,null,null,null,"DESONERADO","NÃO DESONER.","DESONERADO","NÃO DESONER."]
[null,"COMPOSIÇÃO","COMP 025_SEE","SINALIZADOR FOTOLUMINESCENTE DE EMERGÊNCIA","UN ",null,"-","-",24.109999999999996,24.229999999999997]
[null,"AGETOP_I",5,"SERVENTE","h     ",0.09,8.1999999999999993,9.51,0.74,0.86]
[null,"MÃO DE OBRA (B) - TOTAL",null,null,null,null,null,null,0.74,0.86]
[null,"AGETOP_I",3070,"BUCHA DE NYLON S-6","un",2,0.04,0.04,0.08,0.08]
[null,"AGETOP_I",3393,"PARAFUSO P/BUCHA S-6","un",2,0.08,0.08,0.16,0.16]
[null,"SINAPI_I",37556,"PLACA DE SINALIZACAO DE SEGURANCA CONTRA INCENDIO, FOTOLUMINESCENTE, QUADRADA, *20 X 20* CM, EM PVC *2* MM ANTI-CHAMAS (SIMBOLOS, CORES E PICTOGRAMAS CONFORME NBR 13434)                                                                                                                                                                                                                                                                                                                                 ","UN    ",1,23.13,23.13,23.13,23.13]
[null,"MATERIAL (C) - TOTAL",null,null,null,null,null,null,23.369999999999997,23.369999999999997]
[]
[277,"FONTE","CÓDIGO","DESCRIÇÃO","UNIDADE","COEFIC.","CUSTO UNITÁRIO",null,"CUSTO  TOTAL (A) + (B) + (C) + (D) + (E)"]
[null,null,null,null,null,null,"DESONERADO","NÃO DESONER.","DESONERADO","NÃO DESONER."]
[null,"COMPOSIÇÃO","COMP 277_SEE","MARCAÇÃO NO PISO - 1X1 M PARA EXTINTOR","M2",null,null,null,28.81,28.88]
[null,"AGETOP_I",5,"SERVENTE","h     ",3.3300000000000003E-2,8.1999999999999993,9.51,0.27,0.32]
[null,null,null,"","",null,0,0,0,0]
[null,null,null,"","",null,0,0,0,0]
[null,"MÃO DE OBRA (B) - TOTAL",null,null,null,null,null,null,0.27,0.32]
[null,"SINAPI_I",5318,"SOLVENTE DILUENTE A BASE DE AGUARRAS                                                                                                                                                                                                                                                                                                                                                                                                                                                                      ","L     ",0.13,11.78,11.78,1.53,1.53]
[null,"SINAPI",5824,"CAMINHÃO TOCO, PBT 16.000 KG, CARGA ÚTIL MÁX. 10.685 KG, DIST. ENTRE EIXOS 4,8 M, POTÊNCIA 189 CV, INCLUSIVE CARROCERIA FIXA ABERTA DE MADEIRA P/ TRANSPORTE GERAL DE CARGA SECA, DIMEN. APROX. 2,5 X 7,00 X 0,50 M - CHP DIURNO. AF_06/2014","CHP",3.3E-3,135.91,139.12,0.45,0.46]
[null,"SINAPI_I",7343,"TINTA A BASE DE RESINA ACRILICA, PARA SINALIZACAO HORIZONTAL VIARIA (NBR 11862)                                                                                                                                                                                                                                                                                                                                                                                                                           ","L     ",0.6,11.38,11.38,6.83,6.83]
[null,"SINAPI_I",7348,"TINTA ACRILICA PREMIUM PARA PISO                                                                                                                                                                                                                                                                                                                                                                                                                                                                          ","L     ",0.03,12.4,12.4,0.37,0.37]
[null,"SINAPI_I",25972,"MICROESFERAS DE VIDRO PARA SINALIZACAO HORIZONTAL VIARIA, TIPO I-B (PREMIX) - NBR 16184                                                                                                                                                                                                                                                                                                                                                                                                                   ","KG    ",2.14,8.8800000000000008,8.8800000000000008,19,19]
[null,"SINAPI",95133,"MÁQUINA DEMARCADORA DE FAIXA DE TRÁFEGO À FRIO, AUTOPROPELIDA, POTÊNCIA 38 HP - CHP DIURNO. AF_07/2016","CHP",3.3E-3,109.81,113.39,0.36,0.37]
[null,"MATERIAL (C) - TOTAL",null,null,null,null,null,null,28.54,28.56]
[]
[235,"FONTE","CÓDIGO","DESCRIÇÃO","UNIDADE","COEFIC.","CUSTO UNITÁRIO",null,"CUSTO  TOTAL (A) + (B) + (C) + (D) + (E)"]
[null,null,null,null,null,null,"DESONERADO","NÃO DESONER.","DESONERADO","NÃO DESONER."]
[null,"COMPOSIÇÃO","COMP 235_SEE","PLACA DE SINALIZAÇÃO EM PVC COD 01 - (300X300) PROIBIDO FUMAR","UN ",null,null,null,24.109999999999996,24.229999999999997]
[null,"AGETOP_I",5,"SERVENTE","h     ",0.09,8.1999999999999993,9.51,0.74,0.86]
[null,null,null,"","",null,0,0,0,0]
[null,null,null,"","",null,0,0,0,0]
[null,"MÃO DE OBRA (B) - TOTAL",null,null,null,null,null,null,0.74,0.86]
[null,"AGETOP_I",3070,"BUCHA DE NYLON S-6","un",2,0.04,0.04,0.08,0.08]
[null,"AGETOP_I",3393,"PARAFUSO P/BUCHA S-6","un",2,0.08,0.08,0.16,0.16]
[null,"SINAPI_I",37556,"PLACA DE SINALIZACAO DE SEGURANCA CONTRA INCENDIO, FOTOLUMINESCENTE, QUADRADA, *20 X 20* CM, EM PVC *2* MM ANTI-CHAMAS (SIMBOLOS, CORES E PICTOGRAMAS CONFORME NBR 13434)                                                                                                                                                                                                                                                                                                                                 ","UN    ",1,23.13,23.13,23.13,23.13]
[null,"MATERIAL (C) - TOTAL",null,null,null,null,null,null,23.369999999999997,23.369999999999997]
[]
[236,"FONTE","CÓDIGO","DESCRIÇÃO","UNIDADE","COEFIC.","CUSTO UNITÁRIO",null,"CUSTO  TOTAL (A) + (B) + (C) + (D) + (E)"]
[null,null,null,null,null,null,"DESONERADO","NÃO DESONER.","DESONERADO","NÃO DESONER."]
[null,"COMPOSIÇÃO","COMP 236_SEE","PLACA DE SINALIZAÇÃO EM PVC COD 06 - (300X300) PERIGO INFLAMÁVEL","UN ",null,null,null,24.109999999999996,24.229999999999997]
[null,"AGETOP_I",5,"SERVENTE","h     ",0.09,8.1999999999999993,9.51,0.74,0.86]
[null,null,null,"","",null,0,0,0,0]
[null,null,null,"","",null,0,0,0,0]
[null,"MÃO DE OBRA (B) - TOTAL",null,null,null,null,null,null,0.74,0.86]
[null,"AGETOP_I",3070,"BUCHA DE NYLON S-6","un",2,0.04,0.04,0.08,0.08]
[null,"AGETOP_I",3393,"PARAFUSO P/BUCHA S-6","un",2,0.08,0.08,0.16,0.16]
[null,"SINAPI_I",37556,"PLACA DE SINALIZACAO DE SEGURANCA CONTRA INCENDIO, FOTOLUMINESCENTE, QUADRADA, *20 X 20* CM, EM PVC *2* MM ANTI-CHAMAS (SIMBOLOS, CORES E PICTOGRAMAS CONFORME NBR 13434)                                                                                                                                                                                                                                                                                                                                 ","UN    ",1,23.13,23.13,23.13,23.13]
[null,"MATERIAL (C) - TOTAL",null,null,null,null,null,null,23.369999999999997,23.369999999999997]
[]
[411,"FONTE","CÓDIGO","DESCRIÇÃO","UNIDADE","COEFIC.","CUSTO UNITÁRIO",null,"CUSTO  TOTAL (A) + (B) + (C) + (D) + (E)"]
[null,null,null,null,null,null,"DESONERADO","NÃO DESONER.","DESONERADO","NÃO DESONER."]
[null,"COMPOSIÇÃO","COMP 411_SEE","PLACA DE SINALIZAÇÃO EM PVC COD 13 - (316X158) SAÍDA DE EMERGÊNCIA","UN ",null,null,null,29.349999999999998,29.47]
[null,"AGETOP_I",5,"SERVENTE","h     ",0.09,8.1999999999999993,9.51,0.74,0.86]
[null,null,null,"","",null,0,0,0,0]
[null,null,null,"","",null,0,0,0,0]
[null,"MÃO DE OBRA (B) - TOTAL",null,null,null,null,null,null,0.74,0.86]
[null,"AGETOP_I",3070,"BUCHA DE NYLON S-6","un",2,0.04,0.04,0.08,0.08]
[null,"AGETOP_I",3393,"PARAFUSO P/BUCHA S-6","un",2,0.08,0.08,0.16,0.16]
[null,"SINAPI_I",37559,"PLACA DE SINALIZACAO DE SEGURANCA CONTRA INCENDIO, FOTOLUMINESCENTE, RETANGULAR, *12 X 40* CM, EM PVC *2* MM ANTI-CHAMAS (SIMBOLOS, CORES E PICTOGRAMAS CONFORME NBR 13434)                                                                                                                                                                                                                                                                                                                               ","UN    ",1,28.37,28.37,28.37,28.37]
[null,"MATERIAL (C) - TOTAL",null,null,null,null,null,null,28.61,28.61]
[]
[412,"FONTE","CÓDIGO","DESCRIÇÃO","UNIDADE","COEFIC.","CUSTO UNITÁRIO",null,"CUSTO  TOTAL (A) + (B) + (C) + (D) + (E)"]
[null,null,null,null,null,null,"DESONERADO","NÃO DESONER.","DESONERADO","NÃO DESONER."]
[null,"COMPOSIÇÃO","COMP 412_SEE","PLACA DE SINALIZAÇÃO EM PVC COD 17 - (316X158) MENSAGEM \"SAÍDA\"","UN ",null,null,null,29.349999999999998,29.47]
[null,"AGETOP_I",5,"SERVENTE","h     ",0.09,8.1999999999999993,9.51,0.74,0.86]
[null,null,null,"","",null,0,0,0,0]
[null,null,null,"","",null,0,0,0,0]
[null,"MÃO DE OBRA (B) - TOTAL",null,null,null,null,null,null,0.74,0.86]
[null,"AGETOP_I",3070,"BUCHA DE NYLON S-6","un",2,0.04,0.04,0.08,0.08]
[null,"AGETOP_I",3393,"PARAFUSO P/BUCHA S-6","un",2,0.08,0.08,0.16,0.16]
[null,"SINAPI_I",37559,"PLACA DE SINALIZACAO DE SEGURANCA CONTRA INCENDIO, FOTOLUMINESCENTE, RETANGULAR, *12 X 40* CM, EM PVC *2* MM ANTI-CHAMAS (SIMBOLOS, CORES E PICTOGRAMAS CONFORME NBR 13434)                                                                                                                                                                                                                                                                                                                               ","UN    ",1,28.37,28.37,28.37,28.37]
[null,"MATERIAL (C) - TOTAL",null,null,null,null,null,null,28.61,28.61]
[]
[382,"FONTE","CÓDIGO","DESCRIÇÃO","UNIDADE","COEFIC.","CUSTO UNITÁRIO",null,"CUSTO  TOTAL (A) + (B) + (C) + (D) + (E)"]
[null,null,null,null,null,null,"DESONERADO","NÃO DESONER.","DESONERADO","NÃO DESONER."]
[null,"COMPOSIÇÃO","COMP 382_SEE","TE DE REDUCAO DE FERRO GALVANIZADO, COM ROSCA BSP, DE 3/4\" X 1/2\"","UN ",null,null,null,21.93,24.020000000000003]
[null,"AGETOP_I",8,"AJUDANTE","h     ",0.6,8.1999999999999993,9.51,4.92,5.71]
[null,"AGETOP_I",11,"ENCANADOR","h     ",0.61050000000000004,13.4,15.53,8.18,9.48]
[null,null,null,"","",null,0,0,0,0]
[null,"MÃO DE OBRA (B) - TOTAL",null,null,null,null,null,null,13.1,15.190000000000001]
[null,"SINAPI_I",3146,"FITA VEDA ROSCA EM ROLOS DE 18 MM X 10 M (L X C)                                                                                                                                                                                                                                                                                                                                                                                                                                                          ","UN    ",0.12075471698113208,3.9,3.9,0.47,0.47]
[null,"SINAPI_I",6302,"TE DE REDUCAO DE FERRO GALVANIZADO, COM ROSCA BSP, DE 3/4\" X 1/2\"                                                                                                                                                                                                                                                                                                                                                                                                                                         ","UN    ",1,8.36,8.36,8.36,8.36]
[null,null,null,"","",null,0,0,0,0]
[null,"MATERIAL (C) - TOTAL",null,null,null,null,null,null,8.83,8.83]
[]
[383,"FONTE","CÓDIGO","DESCRIÇÃO","UNIDADE","COEFIC.","CUSTO UNITÁRIO",null,"CUSTO  TOTAL (A) + (B) + (C) + (D) + (E)"]
[null,null,null,null,null,null,"DESONERADO","NÃO DESONER.","DESONERADO","NÃO DESONER."]
[null,"COMPOSIÇÃO","COMP 383_SEE","BUCHA DE REDUCAO DE FERRO GALVANIZADO, COM ROSCA BSP, DE 1/2\" X 1/4\"","UN ",null,null,null,6.87,7.42]
[null,"AGETOP_I",8,"AJUDANTE","h     ",0.16,8.1999999999999993,9.51,1.31,1.52]
[null,"AGETOP_I",11,"ENCANADOR","h     ",0.16,13.4,15.53,2.14,2.48]
[null,null,null,"","",null,0,0,0,0]
[null,"MÃO DE OBRA (B) - TOTAL",null,null,null,null,null,null,3.45,4]
[null,"AGETOP_I","H689","FITA VEDAROSCA 12 MM","m",1.2,0.28000000000000003,0.28000000000000003,0.34,0.34]
[null,"SINAPI_I",770,"BUCHA DE REDUCAO DE FERRO GALVANIZADO, COM ROSCA BSP, DE 1/2\" X 1/4\"                                                                                                                                                                                                                                                                                                                                                                                                                                      ","UN    ",1,3.08,3.08,3.08,3.08]
[null,null,null,"","",null,0,0,0,0]
[null,"MATERIAL (C) - TOTAL",null,null,null,null,null,null,3.42,3.42]
[]
[212,"FONTE","CÓDIGO","DESCRIÇÃO","UNIDADE","COEFIC.","CUSTO UNITÁRIO",null,"CUSTO  TOTAL (A) + (B) + (C) + (D) + (E)"]
[null,null,null,null,null,null,"DESONERADO","NÃO DESONER.","DESONERADO","NÃO DESONER."]
[null,"COMPOSIÇÃO","COMP 212_SEE","NIPLE DE REDUÇÃO 1/2\" X 1/4\" BSP","UN ",null,null,null,9.5,10.050000000000001]
[null,"AGETOP_I",8,"AJUDANTE","h     ",0.16,8.1999999999999993,9.51,1.31,1.52]
[null,"AGETOP_I",11,"ENCANADOR","h     ",0.16,13.4,15.53,2.14,2.48]
[null,null,null,"","",null,0,0,0,0]
[null,"MÃO DE OBRA (B) - TOTAL",null,null,null,null,null,null,3.45,4]
[null,"COTAÇÃO","COT 103_SEE","NIPLE DE REDUÇÃO 1/2\" X 1/4\" BSP","UN",1,6.0533333333333337,6.0533333333333337,6.05,6.05]
[null,null,null,"","",null,0,0,0,0]
[null,null,null,"","",null,0,0,0,0]
[null,"MATERIAL (C) - TOTAL",null,null,null,null,null,null,6.05,6.05]
[]
[213,"FONTE","CÓDIGO","DESCRIÇÃO","UNIDADE","COEFIC.","CUSTO UNITÁRIO",null,"CUSTO  TOTAL (A) + (B) + (C) + (D) + (E)"]
[null,null,null,null,null,null,"DESONERADO","NÃO DESONER.","DESONERADO","NÃO DESONER."]
[null,"COMPOSIÇÃO","COMP 213_SEE","NIPLE DE REDUÇÃO 3/4\" X 1/2\" BSP","UN ",null,null,null,13.16,13.71]
[null,"AGETOP_I",8,"AJUDANTE","h     ",0.16,8.1999999999999993,9.51,1.31,1.52]
[null,"AGETOP_I",11,"ENCANADOR","h     ",0.16,13.4,15.53,2.14,2.48]
[null,null,null,"","",null,0,0,0,0]
[null,"MÃO DE OBRA (B) - TOTAL",null,null,null,null,null,null,3.45,4]
[null,"COTAÇÃO","COT 104_SEE","NIPLE DE REDUÇÃO 3/4\" X 1/2\" BSP","UN",1,9.7099999999999991,9.7099999999999991,9.7100000000000009,9.7100000000000009]
[null,null,null,"","",null,0,0,0,0]
[null,null,null,"","",null,0,0,0,0]
[null,"MATERIAL (C) - TOTAL",null,null,null,null,null,null,9.7100000000000009,9.7100000000000009]
[]
[237,"FONTE","CÓDIGO","DESCRIÇÃO","UNIDADE","COEFIC.","CUSTO UNITÁRIO",null,"CUSTO  TOTAL (A) + (B) + (C) + (D) + (E)"]
[null,null,null,null,null,null,"DESONERADO","NÃO DESONER.","DESONERADO","NÃO DESONER."]
[null,"COMPOSIÇÃO","COMP 237_SEE","FITA ANTICORROSIVA","M",null,null,null,11.92,12.61]
[null,"AGETOP_I",8,"AJUDANTE","h     ",0.2,8.1999999999999993,9.51,1.64,1.9]
[null,"AGETOP_I",12,"ELETRICISTA","h     ",0.2,13.4,15.53,2.68,3.11]
[null,null,null,"","",null,0,0,0,0]
[null,"MÃO DE OBRA (B) - TOTAL",null,null,null,null,null,null,4.32,5.01]
[null,"SINAPI_I",39634,"FITA ADESIVA ANTICORROSIVA DE PVC FLEXIVEL, COR PRETA, PARA PROTECAO TUBULACAO, 50 MM X 30 M (L X C), E= *0,25* MM                                                                                                                                                                                                                                                                                                                                                                                        ","M     ",1,7.6,7.6,7.6,7.6]
[null,null,null,"","",null,0,0,0,0]
[null,null,null,"","",null,0,0,0,0]
[null,"MATERIAL (C) - TOTAL",null,null,null,null,null,null,7.6,7.6]
[]
[542,"FONTE","CÓDIGO","DESCRIÇÃO","UNIDADE","COEFIC.","CUSTO UNITÁRIO",null,"CUSTO  TOTAL (A) + (B) + (C) + (D) + (E)"]
[null,null,null,null,null,null,"DESONERADO","NÃO DESONER.","DESONERADO","NÃO DESONER."]
[null,"COMPOSIÇÃO","COMP 542_SEE","VÁLVULA UGV 3/4\" (S) LATÃO","UN ",null,null,null,25.17,26.66]
[null,"AGETOP_I",8,"AJUDANTE","h     ",0.432,8.1999999999999993,9.51,3.54,4.1100000000000003]
[null,"AGETOP_I",11,"ENCANADOR","h     ",0.432,13.4,15.53,5.79,6.71]
[null,null,null,"","",null,0,0,0,0]
[null,"MÃO DE OBRA (B) - TOTAL",null,null,null,null,null,null,9.33,10.82]
[null,"COTAÇÃO","COT 281_SEE","VÁLVULA UGV 3/4\" (S) LATÃO","UN ",1,15.836666666666666,15.836666666666666,15.84,15.84]
[null,null,null,"","",null,0,0,0,0]
[null,null,null,"","",null,0,0,0,0]
[null,"MATERIAL (C) - TOTAL",null,null,null,null,null,null,15.84,15.84]
[]
[543,"FONTE","CÓDIGO","DESCRIÇÃO","UNIDADE","COEFIC.","CUSTO UNITÁRIO",null,"CUSTO  TOTAL (A) + (B) + (C) + (D) + (E)"]
[null,null,null,null,null,null,"DESONERADO","NÃO DESONER.","DESONERADO","NÃO DESONER."]
[null,"COMPOSIÇÃO","COMP 543_SEE","VÁLVULA UGV 1/2\" (S) LATÃO","UN ",null,null,null,24.5,25.990000000000002]
[null,"AGETOP_I",8,"AJUDANTE","h     ",0.432,8.1999999999999993,9.51,3.54,4.1100000000000003]
[null,"AGETOP_I",11,"ENCANADOR","h     ",0.432,13.4,15.53,5.79,6.71]
[null,null,null,"","",null,0,0,0,0]
[null,"MÃO DE OBRA (B) - TOTAL",null,null,null,null,null,null,9.33,10.82]
[null,"COTAÇÃO","COT 282_SEE","VÁLVULA UGV 1/2\" (S) LATÃO","UN ",1,15.166666666666666,15.166666666666666,15.17,15.17]
[null,null,null,"","",null,0,0,0,0]
[null,null,null,"","",null,0,0,0,0]
[null,"MATERIAL (C) - TOTAL",null,null,null,null,null,null,15.17,15.17]
[]
[211,"FONTE","CÓDIGO","DESCRIÇÃO","UNIDADE","COEFIC.","CUSTO UNITÁRIO",null,"CUSTO  TOTAL (A) + (B) + (C) + (D) + (E)"]
[null,null,null,null,null,null,"DESONERADO","NÃO DESONER.","DESONERADO","NÃO DESONER."]
[null,"COMPOSIÇÃO","COMP 211_SEE","REGULADOR DE 2º ESTÁGIO 5KG/H","UN ",null,null,null,85.46,89.419999999999987]
[null,"AGETOP_I",8,"AJUDANTE","h     ",1.1499999999999999,8.1999999999999993,9.51,9.43,10.94]
[null,"AGETOP_I",11,"ENCANADOR","h     ",1.1499999999999999,13.4,15.53,15.41,17.86]
[null,null,null,"","",null,0,0,0,0]
[null,"MÃO DE OBRA (B) - TOTAL",null,null,null,null,null,null,24.84,28.799999999999997]
[null,"COTAÇÃO","COT 102_SEE","REGULADOR DE 2º ESTÁGIO 5KG/H","UN",1,59.833333333333336,59.833333333333336,59.83,59.83]
[null,"AGETOP_I","H689","FITA VEDAROSCA 12 MM","m",2.82,0.28000000000000003,0.28000000000000003,0.79,0.79]
[null,null,null,"","",null,0,0,0,0]
[null,"MATERIAL (C) - TOTAL",null,null,null,null,null,null,60.62,60.62]
[]
[210,"FONTE","CÓDIGO","DESCRIÇÃO","UNIDADE","COEFIC.","CUSTO UNITÁRIO",null,"CUSTO  TOTAL (A) + (B) + (C) + (D) + (E)"]
[null,null,null,null,null,null,"DESONERADO","NÃO DESONER.","DESONERADO","NÃO DESONER."]
[null,"COMPOSIÇÃO","COMP 210_SEE","REGULADOR DE 1º ESTÁGIO 60KG/H MODELO AP-40  COM MANÔMETRO","UN ",null,null,null,231.21,235.17000000000002]
[null,"AGETOP_I",8,"AJUDANTE","h     ",1.1499999999999999,8.1999999999999993,9.51,9.43,10.94]
[null,"AGETOP_I",11,"ENCANADOR","h     ",1.1499999999999999,13.4,15.53,15.41,17.86]
[null,null,null,"","",null,0,0,0,0]
[null,"MÃO DE OBRA (B) - TOTAL",null,null,null,null,null,null,24.84,28.799999999999997]
[null,"COTAÇÃO","COT 101_SEE","REGULADOR DE 1º ESTÁGIO 60KG/H MODELO AP-40  COM MANÔMETRO","UN",1,205.57666666666668,205.57666666666668,205.58,205.58]
[null,"AGETOP_I","H689","FITA VEDAROSCA 12 MM","m",2.82,0.28000000000000003,0.28000000000000003,0.79,0.79]
[null,null,null,"","",null,0,0,0,0]
[null,"MATERIAL (C) - TOTAL",null,null,null,null,null,null,206.37,206.37]
[]
[235,"FONTE","CÓDIGO","DESCRIÇÃO","UNIDADE","COEFIC.","CUSTO UNITÁRIO",null,"CUSTO  TOTAL (A) + (B) + (C) + (D) + (E)"]
[null,null,null,null,null,null,"DESONERADO","NÃO DESONER.","DESONERADO","NÃO DESONER."]
[null,"COMPOSIÇÃO","COMP 235_SEE","PLACA DE SINALIZAÇÃO EM PVC COD 01 - (300X300) PROIBIDO FUMAR","UN ",null,null,null,24.109999999999996,24.229999999999997]
[null,"AGETOP_I",5,"SERVENTE","h     ",0.09,8.1999999999999993,9.51,0.74,0.86]
[null,null,null,"","",null,0,0,0,0]
[null,null,null,"","",null,0,0,0,0]
[null,"MÃO DE OBRA (B) - TOTAL",null,null,null,null,null,null,0.74,0.86]
[null,"AGETOP_I",3070,"BUCHA DE NYLON S-6","un",2,0.04,0.04,0.08,0.08]
[null,"AGETOP_I",3393,"PARAFUSO P/BUCHA S-6","un",2,0.08,0.08,0.16,0.16]
[null,"SINAPI_I",37556,"PLACA DE SINALIZACAO DE SEGURANCA CONTRA INCENDIO, FOTOLUMINESCENTE, QUADRADA, *20 X 20* CM, EM PVC *2* MM ANTI-CHAMAS (SIMBOLOS, CORES E PICTOGRAMAS CONFORME NBR 13434)                                                                                                                                                                                                                                                                                                                                 ","UN    ",1,23.13,23.13,23.13,23.13]
[null,"MATERIAL (C) - TOTAL",null,null,null,null,null,null,23.369999999999997,23.369999999999997]
[]
[236,"FONTE","CÓDIGO","DESCRIÇÃO","UNIDADE","COEFIC.","CUSTO UNITÁRIO",null,"CUSTO  TOTAL (A) + (B) + (C) + (D) + (E)"]
[null,null,null,null,null,null,"DESONERADO","NÃO DESONER.","DESONERADO","NÃO DESONER."]
[null,"COMPOSIÇÃO","COMP 236_SEE","PLACA DE SINALIZAÇÃO EM PVC COD 06 - (300X300) PERIGO INFLAMÁVEL","UN ",null,null,null,24.109999999999996,24.229999999999997]
[null,"AGETOP_I",5,"SERVENTE","h     ",0.09,8.1999999999999993,9.51,0.74,0.86]
[null,null,null,"","",null,0,0,0,0]
[null,null,null,"","",null,0,0,0,0]
[null,"MÃO DE OBRA (B) - TOTAL",null,null,null,null,null,null,0.74,0.86]
[null,"AGETOP_I",3070,"BUCHA DE NYLON S-6","un",2,0.04,0.04,0.08,0.08]
[null,"AGETOP_I",3393,"PARAFUSO P/BUCHA S-6","un",2,0.08,0.08,0.16,0.16]
[null,"SINAPI_I",37556,"PLACA DE SINALIZACAO DE SEGURANCA CONTRA INCENDIO, FOTOLUMINESCENTE, QUADRADA, *20 X 20* CM, EM PVC *2* MM ANTI-CHAMAS (SIMBOLOS, CORES E PICTOGRAMAS CONFORME NBR 13434)                                                                                                                                                                                                                                                                                                                                 ","UN    ",1,23.13,23.13,23.13,23.13]
[null,"MATERIAL (C) - TOTAL",null,null,null,null,null,null,23.369999999999997,23.369999999999997]
[]
[387,"FONTE","CÓDIGO","DESCRIÇÃO","UNIDADE","COEFIC.","CUSTO UNITÁRIO",null,"CUSTO  TOTAL (A) + (B) + (C) + (D) + (E)"]
[null,null,null,null,null,null,"DESONERADO","NÃO DESONER.","DESONERADO","NÃO DESONER."]
[null,"COMPOSIÇÃO","COMP 387_SEE","LÂMPADA LED TUBULAR 18W ","UN ",null,null,null,22.28,22.330000000000002]
[null,"AGETOP_I",8,"AJUDANTE","h     ",1.4999999999999999E-2,8.1999999999999993,9.51,0.12,0.14000000000000001]
[null,"AGETOP_I",12,"ELETRICISTA","h     ",1.4999999999999999E-2,13.4,15.53,0.2,0.23]
[null,null,null,"","",null,0,0,0,0]
[null,"MÃO DE OBRA (B) - TOTAL",null,null,null,null,null,null,0.32,0.37]
[null,"COTAÇÃO","COT 195_SEE","LÂMPADA LED TUBULAR 18W ","UN",1,21.959999999999997,21.959999999999997,21.96,21.96]
[null,null,null,"","",null,0,0,0,0]
[null,null,null,"","",null,0,0,0,0]
[null,"MATERIAL (C) - TOTAL",null,null,null,null,null,null,21.96,21.96]

{"sheet":"Cotações","index":8,"n_rows":147,"n_cols":9,"rows_kept":147,"cut":false,"hidden":false,"merged":[[9,0,9,2],[9,3,9,6],[9,7,9,8],[10,0,10,2],[10,3,10,6],[10,8,10,9],[14,0,14,8],[15,0,15,9],[11,0,11,9],[12,0,12,2],[12,3,12,6],[12,7,12,8],[13,0,13,2],[13,3,13,6],[13,8,13,9],[8,0,8,8],[0,0,0,8],[1,0,1,9],[2,0,2,8],[3,0,3,6],[3,7,3,9],[4,0,4,6],[4,7,4,9],[5,0,5,8],[6,0,6,6],[6,7,6,9],[7,0,7,6],[7,7,7,9],[16,7,17,8],[18,7,18,8],[19,3,19,4],[19,5,19,6],[19,7,19,8],[16,1,17,1],[16,2,17,2],[16,3,17,3],[16,4,17,4],[16,5,16,6],[23,3,23,4],[23,7,23,8],[24,3,24,4],[24,7,24,8],[25,3,25,8],[20,3,20,4],[20,7,20,8],[21,3,21,4],[21,7,21,8],[22,3,22,4],[22,7,22,8],[27,7,28,8],[29,7,29,8],[30,3,30,4],[30,5,30,6],[30,7,30,8],[27,1,28,1],[27,2,28,2],[27,3,28,3],[27,4,28,4],[27,5,27,6],[34,3,34,4],[34,7,34,8],[35,3,35,4],[35,7,35,8],[36,3,36,8],[31,3,31,4],[31,7,31,8],[32,3,32,4],[32,7,32,8],[33,3,33,4],[33,7,33,8],[38,7,39,8],[40,7,40,8],[41,3,41,4],[41,5,41,6],[41,7,41,8],[38,1,39,1],[38,2,39,2],[38,3,39,3],[38,4,39,4],[38,5,38,6],[45,3,45,4],[45,7,45,8],[46,3,46,4],[46,7,46,8],[47,3,47,8],[42,3,42,4],[42,7,42,8],[43,3,43,4],[43,7,43,8],[44,3,44,4],[44,7,44,8],[49,7,50,8],[51,7,51,8],[52,3,52,4],[52,5,52,6],[52,7,52,8],[49,1,50,1],[49,2,50,2],[49,3,50,3],[49,4,50,4],[49,5,49,6],[56,3,56,4],[56,7,56,8],[57,3,57,4],[57,7,57,8],[58,3,58,8],[53,3,53,4],[53,7,53,8],[54,3,54,4],[54,7,54,8],[55,3,55,4],[55,7,55,8],[60,7,61,8],[62,7,62,8],[63,3,63,4],[63,5,63,6],[63,7,63,8],[60,1,61,1],[60,2,61,2],[60,3,61,3],[60,4,61,4],[60,5,60,6],[67,3,67,4],[67,7,67,8],[68,3,68,4],[68,7,68,8],[69,3,69,8],[64,3,64,4],[64,7,64,8],[65,3,65,4],[65,7,65,8],[66,3,66,4],[66,7,66,8],[71,7,72,8],[73,7,73,8],[74,3,74,4],[74,5,74,6],[74,7,74,8],[71,1,72,1],[71,2,72,2],[71,3,72,3],[71,4,72,4],[71,5,71,6],[78,3,78,4],[78,7,78,8],[79,3,79,4],[79,7,79,8],[80,3,80,8],[75,3,75,4],[75,7,75,8],[76,3,76,4],[76,7,76,8],[77,3,77,4],[77,7,77,8],[82,7,83,8],[84,7,84,8],[85,3,85,4],[85,5,85,6],[85,7,85,8],[82,1,83,1],[82,2,83,2],[82,3,83,3],[82,4,83,4],[82,5,82,6],[89,3,89,4],[89,7,89,8],[90,3,90,4],[90,7,90,8],[91,3,91,8],[86,3,86,4],[86,7,86,8],[87,3,87,4],[87,7,87,8],[88,3,88,4],[88,7,88,8],[93,7,94,8],[95,7,95,8],[96,3,96,4],[96,5,96,6],[96,7,96,8],[93,1,94,1],[93,2,94,2],[93,3,94,3],[93,4,94,4],[93,5,93,6],[100,3,100,4],[100,7,100,8],[101,3,101,4],[101,7,101,8],[102,3,102,8],[97,3,97,4],[97,7,97,8],[98,3,98,4],[98,7,98,8],[99,3,99,4],[99,7,99,8],[104,7,105,8],[106,7,106,8],[107,3,107,4],[107,5,107,6],[107,7,107,8],[104,1,105,1],[104,2,105,2],[104,3,105,3],[104,4,105,4],[104,5,104,6],[111,3,111,4],[111,7,111,8],[112,3,112,4],[112,7,112,8],[113,3,113,8],[108,3,108,4],[108,7,108,8],[109,3,109,4],[109,7,109,8],[110,3,110,4],[110,7,110,8],[115,7,116,8],[117,7,117,8],[118,3,118,4],[118,5,118,6],[118,7,118,8],[115,1,116,1],[115,2,116,2],[115,3,116,3],[115,4,116,4],[115,5,115,6],[122,3,122,4],[122,7,122,8],[123,3,123,4],[123,7,123,8],[124,3,124,8],[119,3,119,4],[119,7,119,8],[120,3,120,4],[120,7,120,8],[121,3,121,4],[121,7,121,8],[126,7,127,8],[128,7,128,8],[129,3,129,4],[129,5,129,6],[129,7,129,8],[126,1,127,1],[126,2,127,2],[126,3,127,3],[126,4,127,4],[126,5,126,6],[133,3,133,4],[133,7,133,8],[134,3,134,4],[134,7,134,8],[135,3,135,8],[130,3,130,4],[130,7,130,8],[131,3,131,4],[131,7,131,8],[132,3,132,4],[132,7,132,8],[137,7,138,8],[139,7,139,8],[140,3,140,4],[140,5,140,6],[140,7,140,8],[137,1,138,1],[137,2,138,2],[137,3,138,3],[137,4,138,4],[137,5,137,6],[144,3,144,4],[144,7,144,8],[145,3,145,4],[145,7,145,8],[146,3,146,8],[141,3,141,4],[141,7,141,8],[142,3,142,4],[142,7,142,8],[143,3,143,4],[143,7,143,8]]}
[]
[]
[]
["UNIDADE ESCOLAR",null,null,null,null,null,null,"CÓDIGO INEP"]
[{"$f":"Orçamento!$O$4","v":"CENTRO DE ENSINO EM PERÍODO INTEGRAL POLIVALENTE ANTÔNIO C PANIAGO"},null,null,null,null,null,null,{"$f":"Orçamento!$X$4","v":52053385}]
[]
["OBRA",null,null,null,null,null,null,"CIDADE"]
[{"$f":"Orçamento!$O$7","v":"REFORMA E AMPLIAÇÃO"},null,null,null,null,null,null,{"$f":"Orçamento!$X$7","v":"MINEIROS"}]
[]
["CRE",null,null,"ENDEREÇO",null,null,null,"REFERÊNCIA AGETOP"]
[{"$f":"Orçamento!$O$10","v":"MINEIROS"},null,null,{"$f":"Orçamento!$R$10","v":"RUA 6 A, MARTINS, CEP:75832-028"},null,null,null,{"$f":"Orçamento!$X$10","v":"DEZ/18"},{"$f":"Orçamento!$Y$10","v":"ONERADA"}]
[]
["DATA",null,null,"ÁREA TOTAL CONSTRUÍDA (M²)",null,null,null,"REFERÊNCIA SINAPI"]
[{"$f":"Orçamento!$S$7","v":"2020-04-23"},null,null,{"$f":"Orçamento!$S$13","v":3442.6800000000003},null,null,null,{"$f":"Orçamento!$X$13","v":"AGO/19"},{"$f":"Orçamento!$Y$13","v":"ONERADA"}]
[]
["COTAÇÕES DE PREÇOS - SEE-GO"]
[null,"FONTE","CÓDIGO","DESCRIÇÃO","UNIDADE","MÉDIA",null,"ÍNDICE RETROAÇÃO"]
[null,null,null,null,null,"DESONERADA","ONERADA"]
[17,"COTAÇÃO","COT 017_SEE","REGISTRO DE GAVETA COM HASTE ASCENDENTE DE BRONZE 2 1/2\"","UN ",231.66666666666666,231.66666666666666,""]
[null,null,"EMPRESA","NOME DA EMPRESA",null,"COTAÇÕES",null,"DATA COTAÇÃO"]
[null,null,"E034 - VALK T...","VALK TUBOS",null,220,220,""]
[null,null,"E035 - ACIONA...","ACIONAR SERVIÇOS E EQUIPAMENTOS CONTRA INCÊNDIO",null,250,250,""]
[null,null,"E038 - CENTER...","CENTER FIRE",null,225,225,""]
[null,null,"","",null,null,null,""]
[null,null,"","",null,null,null,""]
[null,null,"OBSERVAÇÕES:",""]
[]
[null,"FONTE","CÓDIGO","DESCRIÇÃO","UNIDADE","MÉDIA",null,"ÍNDICE RETROAÇÃO"]
[null,null,null,null,null,"DESONERADA","ONERADA"]
[286,"COTAÇÃO","COT 286_SEE","BUJÃO DE REBORDO 2.1/2\"","UN ",15,15,""]
[null,null,"EMPRESA","NOME DA EMPRESA",null,"COTAÇÕES",null,"DATA COTAÇÃO"]
[null,null,"E076 - GOIÂNI...","GOIÂNIA TUBOS",null,15,15,"12/04/2019"]
[null,null,null,"",null,null,null,""]
[null,null,null,"",null,null,null,""]
[null,null,"","",null,null,null,""]
[null,null,"","",null,null,null,""]
[null,null,"OBSERVAÇÕES:",""]
[]
[null,"FONTE","CÓDIGO","DESCRIÇÃO","UNIDADE","MÉDIA",null,"ÍNDICE RETROAÇÃO"]
[null,null,null,null,null,"DESONERADA","ONERADA"]
[88,"COTAÇÃO","COT 088_SEE","BOTOEIRA BOMBA DE INCÊNDIO C/ MARTELO CONVENCIONAL/ ANALÓGICA","UN",63.5,63.5,""]
[null,null,"EMPRESA","NOME DA EMPRESA",null,"COTAÇÕES",null,"DATA COTAÇÃO"]
[null,null,"E034 - VALK T...","VALK TUBOS",null,58,58,""]
[null,null,"E035 - ACIONA...","ACIONAR SERVIÇOS E EQUIPAMENTOS CONTRA INCÊNDIO",null,67.5,67.5,""]
[null,null,"E038 - CENTER...","CENTER FIRE",null,65,65,""]
[null,null,"","",null,null,null,""]
[null,null,"","",null,null,null,""]
[null,null,"OBSERVAÇÕES:",""]
[]
[null,"FONTE","CÓDIGO","DESCRIÇÃO","UNIDADE","MÉDIA",null,"ÍNDICE RETROAÇÃO"]
[null,null,null,null,null,"DESONERADA","ONERADA"]
[90,"COTAÇÃO","COT 090_SEE","ACIONADOR MANUAL DE ALARME","UN",83.333333333333329,83.333333333333329,""]
[null,null,"EMPRESA","NOME DA EMPRESA",null,"COTAÇÕES",null,"DATA COTAÇÃO"]
[null,null,"E034 - VALK T...","VALK TUBOS",null,120,120,""]
[null,null,"E035 - ACIONA...","ACIONAR SERVIÇOS E EQUIPAMENTOS CONTRA INCÊNDIO",null,65,65,""]
[null,null,"E038 - CENTER...","CENTER FIRE",null,65,65,""]
[null,null,"","",null,null,null,""]
[null,null,"","",null,null,null,""]
[null,null,"OBSERVAÇÕES:",""]
[]
[null,"FONTE","CÓDIGO","DESCRIÇÃO","UNIDADE","MÉDIA",null,"ÍNDICE RETROAÇÃO"]
[null,null,null,null,null,"DESONERADA","ONERADA"]
[92,"COTAÇÃO","COT 092_SEE","CENTRAL DE DETECÇÃO E ALARME DE 40 SETORES COM BATERIA (PREÇO MÉDIO)","UN",963.33333333333337,963.33333333333337,""]
[null,null,"EMPRESA","NOME DA EMPRESA",null,"COTAÇÕES",null,"DATA COTAÇÃO"]
[null,null,"E034 - VALK T...","VALK TUBOS",null,840,840,""]
[null,null,"E035 - ACIONA...","ACIONAR SERVIÇOS E EQUIPAMENTOS CONTRA INCÊNDIO",null,980,980,""]
[null,null,"E038 - CENTER...","CENTER FIRE",null,1070,1070,""]
[null,null,"","",null,null,null,""]
[null,null,"","",null,null,null,""]
[null,null,"OBSERVAÇÕES:",""]
[]
[null,"FONTE","CÓDIGO","DESCRIÇÃO","UNIDADE","MÉDIA",null,"ÍNDICE RETROAÇÃO"]
[null,null,null,null,null,"DESONERADA","ONERADA"]
[103,"COTAÇÃO","COT 103_SEE","NIPLE DE REDUÇÃO 1/2\" X 1/4\" BSP","UN",6.0533333333333337,6.0533333333333337,""]
[null,null,"EMPRESA","NOME DA EMPRESA",null,"COTAÇÕES",null,"DATA COTAÇÃO"]
[null,null,"E070 - FOCO R...","FOCO REPRESENTAÇÃO E CONSULTORIA LTDA-ME",null,4.46,4.46,"12/02/2019"]
[null,null,"E071 - CASA D...","CASA DAS PEÇAS COM E INDUSTRIA DE FOGOES LTDA",null,3.9,3.9,"11/02/2019"]
[null,null,"E072 - AMIG I...","AMIG INSTALAÇÃO DE REDE DE GÁS E INCÊNDIO",null,9.8000000000000007,9.8000000000000007,"08/02/2019"]
[null,null,"","",null,null,null,""]
[null,null,"","",null,null,null,""]
[null,null,"OBSERVAÇÕES:",""]
[]
[null,"FONTE","CÓDIGO","DESCRIÇÃO","UNIDADE","MÉDIA",null,"ÍNDICE RETROAÇÃO"]
[null,null,null,null,null,"DESONERADA","ONERADA"]
[104,"COTAÇÃO","COT 104_SEE","NIPLE DE REDUÇÃO 3/4\" X 1/2\" BSP","UN",9.7099999999999991,9.7099999999999991,""]
[null,null,"EMPRESA","NOME DA EMPRESA",null,"COTAÇÕES",null,"DATA COTAÇÃO"]
[null,null,"E070 - FOCO R...","FOCO REPRESENTAÇÃO E CONSULTORIA LTDA-ME",null,10.93,10.93,"12/02/2019"]
[null,null,"E071 - CASA D...","CASA DAS PEÇAS COM E INDUSTRIA DE FOGOES LTDA",null,5.5,5.5,"11/02/2019"]
[null,null,"E072 - AMIG I...","AMIG INSTALAÇÃO DE REDE DE GÁS E INCÊNDIO",null,12.7,12.7,"08/02/2019"]
[null,null,"","",null,null,null,""]
[null,null,"","",null,null,null,""]
[null,null,"OBSERVAÇÕES:",""]
[]
[null,"FONTE","CÓDIGO","DESCRIÇÃO","UNIDADE","MÉDIA",null,"ÍNDICE RETROAÇÃO"]
[null,null,null,null,null,"DESONERADA","ONERADA"]
[281,"COTAÇÃO","COT 281_SEE","VÁLVULA UGV 3/4\" (S) LATÃO","UN ",15.836666666666666,15.836666666666666,""]
[null,null,"EMPRESA","NOME DA EMPRESA",null,"COTAÇÕES",null,"DATA COTAÇÃO"]
[null,null,"E070 - FOCO R...","FOCO REPRESENTAÇÃO E CONSULTORIA LTDA-ME",null,12.51,12.51,"12/02/2019"]
[null,null,"E071 - CASA D...","CASA DAS PEÇAS COM E INDUSTRIA DE FOGOES LTDA",null,17.5,17.5,"11/02/2019"]
[null,null,"E072 - AMIG I...","AMIG INSTALAÇÃO DE REDE DE GÁS E INCÊNDIO",null,17.5,17.5,"08/02/2019"]
[null,null,"",""]
[null,null,"","",null,null,null,""]
[null,null,"OBSERVAÇÕES:",""]
[]
[null,"FONTE","CÓDIGO","DESCRIÇÃO","UNIDADE","MÉDIA",null,"ÍNDICE RETROAÇÃO"]
[null,null,null,null,null,"DESONERADA","ONERADA"]
[282,"COTAÇÃO","COT 282_SEE","VÁLVULA UGV 1/2\" (S) LATÃO","UN ",15.166666666666666,15.166666666666666,""]
[null,null,"EMPRESA","NOME DA EMPRESA",null,"COTAÇÕES",null,"DATA COTAÇÃO"]
[null,null,"E070 - FOCO R...","FOCO REPRESENTAÇÃO E CONSULTORIA LTDA-ME",null,11.2,11.2,"12/02/2019"]
[null,null,"E071 - CASA D...","CASA DAS PEÇAS COM E INDUSTRIA DE FOGOES LTDA",null,17.5,17.5,"11/02/2019"]
[null,null,"E072 - AMIG I...","AMIG INSTALAÇÃO DE REDE DE GÁS E INCÊNDIO",null,16.8,16.8,"08/02/2019"]
[null,null,"","",null,null,null,""]
[null,null,"","",null,null,null,""]
[null,null,"OBSERVAÇÕES:",""]
[]
[null,"FONTE","CÓDIGO","DESCRIÇÃO","UNIDADE","MÉDIA",null,"ÍNDICE RETROAÇÃO"]
[null,null,null,null,null,"DESONERADA","ONERADA"]
[102,"COTAÇÃO","COT 102_SEE","REGULADOR DE 2º ESTÁGIO 5KG/H","UN",59.833333333333336,59.833333333333336,""]
[null,null,"EMPRESA","NOME DA EMPRESA",null,"COTAÇÕES",null,"DATA COTAÇÃO"]
[null,null,"E070 - FOCO R...","FOCO REPRESENTAÇÃO E CONSULTORIA LTDA-ME",null,38.9,38.9,"12/02/2019"]
[null,null,"E071 - CASA D...","CASA DAS PEÇAS COM E INDUSTRIA DE FOGOES LTDA",null,55.599999999999994,55.599999999999994,"11/02/2019"]
[null,null,"E072 - AMIG I...","AMIG INSTALAÇÃO DE REDE DE GÁS E INCÊNDIO",null,85,85,"08/02/2019"]
[null,null,"","",null,null,null,""]
[null,null,"","",null,null,null,""]
[null,null,"OBSERVAÇÕES:","AMIG enviou cotação de regulador de 2º estágio de 12kg/h."]
[]
[null,"FONTE","CÓDIGO","DESCRIÇÃO","UNIDADE","MÉDIA",null,"ÍNDICE RETROAÇÃO"]
[null,null,null,null,null,"DESONERADA","ONERADA"]
[101,"COTAÇÃO","COT 101_SEE","REGULADOR DE 1º ESTÁGIO 60KG/H MODELO AP-40  COM MANÔMETRO","UN",205.57666666666668,205.57666666666668,""]
[null,null,"EMPRESA","NOME DA EMPRESA",null,"COTAÇÕES",null,"DATA COTAÇÃO"]
[null,null,"E070 - FOCO R...","FOCO REPRESENTAÇÃO E CONSULTORIA LTDA-ME",null,148.72999999999999,148.72999999999999,"12/02/2019"]
[null,null,"E071 - CASA D...","CASA DAS PEÇAS COM E INDUSTRIA DE FOGOES LTDA",null,198,198,"11/02/2019"]
[null,null,"E072 - AMIG I...","AMIG INSTALAÇÃO DE REDE DE GÁS E INCÊNDIO",null,270,270,"08/02/2019"]
[null,null,"","",null,null,null,""]
[null,null,"","",null,null,null,""]
[null,null,"OBSERVAÇÕES:",""]
[]
[null,"FONTE","CÓDIGO","DESCRIÇÃO","UNIDADE","MÉDIA",null,"ÍNDICE RETROAÇÃO"]
[null,null,null,null,null,"DESONERADA","ONERADA"]
[195,"COTAÇÃO","COT 195_SEE","LÂMPADA LED TUBULAR 18W ","UN",21.959999999999997,21.959999999999997,""]
[null,null,"EMPRESA","NOME DA EMPRESA",null,"COTAÇÕES",null,"DATA COTAÇÃO"]
[null,null,"E030 - AJEL M...","AJEL MATERIAIS ELÉTRICOS",null,19.89,19.89,""]
[null,null,"E013 - ELETRO...","ELETROTRANSOL",null,25.99,25.99,""]
[null,null,"E014 - MAKRO ...","MAKRO SERVICE",null,20,20,""]
[null,null,"","",null,null,null,""]
[null,null,"","",null,null,null,""]
[null,null,"OBSERVAÇÕES:",""]