{"text_format":"1","workbook":"xlsx","n_sheets":8,"sheets":["Orçamento","Resumo ","Somatório","Cronog_120_Dias","Composição BDI","Relatório CENTRAL","Parc Maior Relev","Composições"],"not_rendered":{"charts":0,"images":3,"macros":1,"external_links":0,"defined_names":79,"comments":3,"pivot_tables":0},"unopened":[],"bounds":{"document_bytes":16777216,"sheet_cells":100000,"rows_first":2000,"rows_last":500,"rows_between":2000,"halvings":0,"cell_chars":16384,"cell_head_chars":4096},"cells_cut":0,"cells_raw":0,"read":"whole","date_system":"1900"}

{"sheet":"Orçamento","index":0,"n_rows":902,"n_cols":24,"rows_kept":902,"cut":false,"hidden":false,"merged":[[883,18,883,20],[883,21,883,22],[884,15,884,17],[884,18,884,20],[884,21,884,22],[885,15,885,17],[885,18,885,20],[885,21,885,22],[880,15,880,17],[880,18,880,20],[880,21,880,22],[881,15,881,17],[881,18,881,20],[881,21,881,22],[882,15,882,17],[882,18,882,20],[882,21,882,22],[894,18,894,20],[894,21,894,22],[889,15,889,17],[889,18,889,20],[889,21,889,22],[890,15,890,17],[890,18,890,20],[890,21,890,22],[891,15,891,17],[891,18,891,20],[891,21,891,22],[870,14,870,17],[877,15,877,17],[843,15,843,17],[898,18,898,20],[898,21,898,22],[886,15,886,17],[886,18,886,20],[886,21,886,22],[887,15,887,17],[887,18,887,20],[887,21,887,22],[888,15,888,17],[888,18,888,20],[888,21,888,22],[892,15,892,17],[892,18,892,20],[892,21,892,22],[893,15,893,17],[893,18,893,20],[893,21,893,22],[894,15,894,17],[883,15,883,17],[838,16,838,22],[901,18,901,20],[901,21,901,22],[898,14,898,17],[895,15,895,17],[895,18,895,20],[895,21,895,22],[896,15,896,17],[896,18,896,20],[896,21,896,22],[897,15,897,17],[897,18,897,20],[897,21,897,22],[900,18,900,20],[900,21,900,22],[899,18,899,20],[899,21,899,22],[876,14,876,23],[877,18,877,20],[877,21,877,22],[878,15,878,17],[878,18,878,20],[878,21,878,22],[879,15,879,17],[879,18,879,20],[879,21,879,22],[834,16,834,22],[835,16,835,22],[836,16,836,22],[3,21,3,22],[2,21,2,22],[5,21,5,22],[10,14,10,23],[13,14,13,23],[6,21,6,22],[9,17,9,20],[2,14,2,20],[3,14,3,20],[5,18,5,20],[6,18,6,20],[11,18,11,20],[12,18,12,20],[6,14,6,17],[5,14,5,17],[856,15,856,17],[857,15,857,17],[858,15,858,17],[859,15,859,17],[860,15,860,17],[861,15,861,17],[862,15,862,17],[863,15,863,17],[864,15,864,17],[844,15,844,17],[845,15,845,17],[846,15,846,17],[847,15,847,17],[848,15,848,17],[849,15,849,17],[850,15,850,17],[851,15,851,17],[852,15,852,17],[865,15,865,17],[866,15,866,17],[867,15,867,17],[868,15,868,17],[869,15,869,17],[842,14,842,23],[831,20,831,21],[830,20,830,21],[826,17,831,17],[826,20,826,21],[843,18,843,20],[843,21,843,22],[844,18,844,20],[844,21,844,22],[832,20,832,21],[852,18,852,20],[852,21,852,22],[853,18,853,20],[853,21,853,22],[854,18,854,20],[854,21,854,22],[855,18,855,20],[855,21,855,22],[867,18,867,20],[870,18,870,20],[870,21,870,22],[867,21,867,22],[868,18,868,20],[868,21,868,22],[869,18,869,20],[869,21,869,22],[859,18,859,20],[859,21,859,22],[866,18,866,20],[866,21,866,22],[861,21,861,22],[862,18,862,20],[862,21,862,22],[864,18,864,20],[860,18,860,20],[860,21,860,22],[861,18,861,20],[871,18,871,20],[871,21,871,22],[858,18,858,20],[858,21,858,22],[851,18,851,20],[851,21,851,22],[873,18,873,20],[873,21,873,22],[827,20,827,21],[849,18,849,20],[849,21,849,22],[850,18,850,20],[850,21,850,22],[848,18,848,20],[848,21,848,22],[857,18,857,20],[828,20,828,21],[839,18,839,22],[845,18,845,20],[845,21,845,22],[846,18,846,20],[846,21,846,22],[847,18,847,20],[847,21,847,22],[837,16,837,22],[8,12,9,12],[872,18,872,20],[872,21,872,22],[0,14,0,22],[8,14,8,16],[9,14,9,16],[11,14,11,16],[12,14,12,16],[14,14,14,22],[1,14,1,22],[4,14,4,22],[7,14,7,22],[856,18,856,20],[856,21,856,22],[864,21,864,22],[853,15,853,17],[854,15,854,17],[855,15,855,17],[857,21,857,22],[865,18,865,20],[865,21,865,22],[863,18,863,20],[863,21,863,22]]}
[]
[]
[null,null,null,null,null,null,null,null,null,null,null,null,null,null,"UNIDADE ESCOLAR",null,null,null,null,null,null,"CÓDIGO INEP"]
[null,null,null,null,null,null,null,null,null,null,null,null,null,null,"CENTRO DE ENSINO EM PERÍODO INTEGRAL PADRE TRINDADE",null,null,null,null,null,null,52020452]
[]
["Nmax",null,null,null,null,null,null,null,null,null,null,null,"Ajustar altura?",null,"OBRA",null,null,null,"DATA",null,null,"CIDADE"]
[{"$f":"MAX($C$18:$C$826)","v":3},null,null,null,null,null,null,null,null,null,null,null,"NÃO",null,"REFORMA E AMPLIAÇÃO",null,null,null,"2020-04-08",null,null,"ANÁPOLIS"]
[]
[null,null,null,null,null,null,null,null,null,null,null,null,"",null,"CRE",null,null,"ENDEREÇO",null,null,null,"REFERÊNCIA AGETOP"]
[null,null,null,null,null,null,null,null,null,null,null,null,null,null,"ANÁPOLIS",null,null,"RUA SILVA PINTO S/N, JUNDIAI, CEP:75110-640",null,null,null,"DEZ/18","ONERADA"]
[]
[null,null,null,null,null,null,null,null,null,null,null,null,null,null,"ÁREA EXISTENTE (M²)",null,null,"ÁREA A CONSTRUIR (M²)","ÁREA TOTAL CONSTRUÍDA (M²)",null,null,"REFERÊNCIA SINAPI"]
[null,null,null,null,null,null,null,null,null,null,null,null,null,null,1194.8599999999999,null,null,694.4,1889.2599999999998,null,null,"MAR/19","ONERADA"]
[]
[null,null,null,null,null,null,null,null,null,null,null,"FILTRO",null,null,"PLANILHA ORÇAMENTÁRIA"]
{"$rows_left_out":888}
{"sheet":"Resumo ","index":1,"n_rows":39,"n_cols":9,"rows_kept":39,"cut":false,"hidden":false,"merged":[[13,0,14,0],[34,2,34,3],[35,2,35,3],[31,2,31,3],[32,2,32,3],[33,2,33,3],[28,2,28,3],[29,2,29,3],[30,2,30,3],[0,1,0,8],[36,1,36,5],[2,1,2,5],[3,1,3,5],[5,1,5,5],[6,1,6,5],[8,1,8,5],[9,1,9,5],[11,3,11,5],[12,3,12,5],[10,1,10,8],[11,6,11,8],[12,6,12,8],[25,2,25,3],[21,2,21,3],[22,2,22,3],[6,6,6,8],[7,1,7,8],[8,6,8,8],[9,6,9,8],[13,1,13,8],[1,1,1,8],[2,6,2,8],[3,6,3,8],[4,1,4,8],[5,6,5,8],[42,3,42,7],[11,1,11,2],[12,1,12,2],[15,2,15,3],[16,2,16,3],[14,1,14,8],[17,2,17,3],[23,2,23,3],[18,2,18,3],[19,2,19,3],[20,2,20,3],[41,3,41,7],[24,2,24,3],[26,2,26,3],[27,2,27,3],[38,1,38,8]]}
[]
[]
[null,"UNIDADE ESCOLAR",null,null,null,null,"CÓDIGO INEP"]
[null,{"$f":"Orçamento!$O$4","v":"CENTRO DE ENSINO EM PERÍODO INTEGRAL PADRE TRINDADE"},null,null,null,null,{"$f":"Orçamento!V4","v":52020452}]
[]
[null,"OBRA",null,null,null,null,"CIDADE"]
[null,{"$f":"Orçamento!$O$7","v":"REFORMA E AMPLIAÇÃO"},null,null,null,null,{"$f":"Orçamento!$V$7","v":"ANÁPOLIS"}]
[]
[null,"ENDEREÇO",null,null,null,null,"CRE"]
[null,{"$f":"Orçamento!$R$10","v":"RUA SILVA PINTO S/N, JUNDIAI, CEP:75110-640"},null,null,null,null,{"$f":"Orçamento!$O$10","v":"ANÁPOLIS"}]
[]
[null,"REFERÊNCIA",null,"DATA",null,null,"ÁREA TOTAL CONSTRUÍDA (M²)"]
[null,{"$f":"CONCATENATE(\"AGETOP E SINAPI - \",Orçamento!$W$10)","v":"AGETOP E SINAPI - ONERADA"},null,{"$f":"Orçamento!$S$7","v":"2020-04-08"},null,null,{"$f":"Orçamento!$S$13","v":1889.2599999999998}]
["FILTRO"]
[null,"RESUMO GERAL DO ORÇAMENTO"]
{"$rows_left_out":25}
{"sheet":"Somatório","index":2,"n_rows":45,"n_cols":6,"rows_kept":45,"cut":false,"hidden":false,"merged":[[13,0,14,0],[42,1,42,2],[44,1,44,5],[47,3,47,5],[48,3,48,5],[13,1,13,5],[9,1,9,3],[9,4,9,5],[11,1,11,2],[11,4,11,5],[12,1,12,2],[12,4,12,5],[0,1,0,5],[14,1,14,5],[2,1,2,3],[2,4,2,5],[3,1,3,3],[3,4,3,5],[5,1,5,3],[5,4,5,5],[6,1,6,3],[6,4,6,5],[8,1,8,3],[8,4,8,5],[1,1,1,5],[4,1,4,5],[7,1,7,5],[10,1,10,5]]}
[]
[]
[null,"UNIDADE ESCOLAR",null,null,"CÓDIGO INEP"]
[null,{"$f":"Orçamento!$O$4","v":"CENTRO DE ENSINO EM PERÍODO INTEGRAL PADRE TRINDADE"},null,null,{"$f":"Orçamento!V4","v":52020452}]
[]
[null,"OBRA",null,null,"CIDADE"]
[null,{"$f":"Orçamento!$O$7","v":"REFORMA E AMPLIAÇÃO"},null,null,{"$f":"Orçamento!$V$7","v":"ANÁPOLIS"}]
[]
[null,"ENDEREÇO",null,null,"CRE"]
[null,{"$f":"Orçamento!$R$10","v":"RUA SILVA PINTO S/N, JUNDIAI, CEP:75110-640"},null,null,{"$f":"Orçamento!$O$10","v":"ANÁPOLIS"}]
[]
[null,"REFERÊNCIA",null,"DATA","ÁREA TOTAL CONSTRUÍDA (M²)"]
[null,{"$f":"CONCATENATE(\"AGETOP E SINAPI - \",Orçamento!$W$10)","v":"AGETOP E SINAPI - ONERADA"},null,{"$f":"Orçamento!$S$7","v":"2020-04-08"},{"$f":"Orçamento!$S$13","v":1889.2599999999998}]
["FILTRO"]
[null,"SOMATÓRIO DE SERVIÇOS"]
{"$rows_left_out":31}
{"sheet":"Cronog_120_Dias","index":3,"n_rows":99,"n_cols":22,"rows_kept":99,"cut":false,"hidden":false,"merged":[[2,1,2,7],[5,1,5,7],[6,1,6,7],[8,1,8,7],[9,1,9,7],[4,1,4,21],[7,1,7,21],[0,1,0,21],[1,1,1,21],[2,8,2,21],[12,0,13,0],[9,0,11,0],[11,1,11,21],[92,1,92,2],[92,5,92,8],[92,9,92,12],[93,1,93,2],[93,5,93,8],[93,9,93,12],[74,9,74,12],[74,5,74,8],[68,9,68,12],[70,5,70,8],[70,9,70,12],[59,5,59,8],[71,1,73,2],[71,4,73,4],[71,5,71,8],[71,9,71,12],[73,5,73,8],[73,9,73,12],[59,9,59,12],[61,5,61,8],[61,9,61,12],[94,1,94,2],[94,5,94,8],[94,9,94,12],[76,5,76,8],[76,9,76,12],[77,5,77,8],[77,9,77,12],[79,5,79,8],[79,9,79,12],[80,5,80,8],[80,9,80,12],[82,5,82,8],[82,9,82,12],[77,3,79,3],[80,3,82,3],[86,1,88,2],[80,4,82,4],[95,1,95,2],[95,5,95,8],[95,9,95,12],[97,1,97,4],[98,1,98,21],[86,9,86,12],[88,5,88,8],[88,9,88,12],[85,5,85,8],[85,9,85,12],[89,1,91,2],[89,4,91,4],[89,5,89,8],[89,9,89,12],[91,5,91,8],[91,9,91,12],[89,3,91,3],[86,4,88,4],[86,5,86,8],[86,3,88,3],[83,1,85,2],[83,4,85,4],[83,5,83,8],[83,9,83,12],[68,5,68,8],[65,5,65,8],[65,9,65,12],[67,5,67,8],[67,9,67,12],[65,3,67,3],[62,9,62,12],[64,5,64,8],[64,9,64,12],[62,5,62,8],[53,9,53,12],[55,5,55,8],[55,9,55,12],[50,5,50,8],[50,9,50,12],[52,5,52,8],[52,9,52,12],[56,9,56,12],[58,5,58,8],[58,9,58,12],[53,5,53,8],[56,5,56,8],[44,9,44,12],[46,5,46,8],[46,9,46,12],[47,1,49,2],[47,4,49,4],[47,5,47,8],[47,9,47,12],[49,5,49,8],[49,9,49,12],[44,5,44,8],[47,3,49,3],[35,9,35,12],[37,5,37,8],[37,9,37,12],[35,3,37,3],[40,9,40,12],[38,3,40,3],[38,9,38,12],[41,1,43,2],[41,4,43,4],[41,5,41,8],[41,9,41,12],[43,5,43,8],[43,9,43,12],[41,3,43,3],[35,5,35,8],[38,5,38,8],[40,5,40,8],[29,9,29,12],[31,5,31,8],[31,9,31,12],[32,1,34,2],[32,4,34,4],[32,5,32,8],[32,9,32,12],[34,5,34,8],[34,9,34,12],[32,3,34,3],[29,5,29,8],[29,1,31,2],[29,4,31,4],[26,1,28,2],[26,4,28,4],[26,5,26,8],[26,9,26,12],[28,5,28,8],[28,9,28,12],[23,3,25,3],[23,1,25,2],[23,4,25,4],[23,5,23,8],[26,3,28,3],[14,3,16,3],[17,3,19,3],[14,4,16,4],[14,5,14,8],[14,9,14,12],[16,5,16,8],[16,9,16,12],[23,9,23,12],[25,5,25,8],[25,9,25,12],[17,9,17,12],[19,5,19,8],[19,9,19,12],[20,1,22,2],[20,4,22,4],[20,5,20,8],[20,9,20,12],[22,5,22,8],[22,9,22,12],[20,3,22,3],[83,3,85,3],[53,4,55,4],[59,1,61,2],[59,4,61,4],[74,1,76,2],[77,1,79,2],[77,4,79,4],[80,1,82,2],[65,1,67,2],[68,3,70,3],[62,3,64,3],[68,1,70,2],[56,3,58,3],[65,4,67,4],[71,3,73,3],[74,3,76,3],[74,4,76,4],[56,1,58,2],[68,4,70,4],[44,3,46,3],[62,1,64,2],[62,4,64,4],[38,1,40,2],[38,4,40,4],[59,3,61,3],[44,1,46,2],[44,4,46,4],[53,1,55,2],[50,1,52,2],[50,4,52,4],[10,1,10,21],[9,8,9,21],[8,8,8,21],[3,8,3,21],[6,8,6,21],[5,8,5,21],[3,1,3,7],[56,4,58,4],[29,3,31,3],[35,1,37,2],[35,4,37,4],[50,3,52,3],[53,3,55,3],[12,21,13,21],[13,1,13,2],[13,5,13,8],[13,9,13,12],[12,3,13,3],[12,9,12,12],[14,1,16,2],[12,5,12,8],[17,1,19,2],[17,4,19,4],[17,5,17,8],[12,13,12,16],[12,17,12,20],[13,13,13,16],[13,17,13,20],[14,13,14,16],[14,17,14,20],[16,13,16,16],[16,17,16,20],[19,13,19,16],[19,17,19,20],[71,13,71,16],[71,17,71,20],[74,13,74,16],[74,17,74,20],[47,13,47,16],[47,17,47,20],[22,13,22,16],[22,17,22,20],[25,13,25,16],[25,17,25,20],[28,13,28,16],[28,17,28,20],[31,13,31,16],[31,17,31,20],[34,13,34,16],[34,17,34,20],[32,13,32,16],[32,17,32,20],[35,13,35,16],[35,17,35,20],[38,13,38,16],[38,17,38,20],[37,13,37,16],[37,17,37,20],[64,13,64,16],[64,17,64,20],[67,13,67,16],[67,17,67,20],[70,13,70,16],[70,17,70,20],[65,13,65,16],[65,17,65,20],[68,13,68,16],[68,17,68,20],[46,13,46,16],[46,17,46,20],[49,13,49,16],[49,17,49,20],[41,13,41,16],[41,17,41,20],[44,13,44,16],[44,17,44,20],[17,13,17,16],[17,17,17,20],[20,13,20,16],[20,17,20,20],[23,13,23,16],[23,17,23,20],[26,13,26,16],[26,17,26,20],[29,13,29,16],[29,17,29,20],[40,13,40,16],[40,17,40,20],[43,13,43,16],[43,17,43,20],[50,13,50,16],[50,17,50,20],[53,13,53,16],[53,17,53,20],[56,13,56,16],[56,17,56,20],[59,13,59,16],[59,17,59,20],[62,13,62,16],[62,17,62,20],[52,13,52,16],[52,17,52,20],[55,13,55,16],[55,17,55,20],[58,13,58,16],[58,17,58,20],[61,13,61,16],[61,17,61,20],[77,13,77,16],[77,17,77,20],[73,13,73,16],[73,17,73,20],[76,13,76,16],[76,17,76,20],[93,13,93,16],[93,17,93,20],[94,13,94,16],[94,17,94,20],[79,13,79,16],[79,17,79,20],[95,13,95,16],[95,17,95,20],[80,13,80,16],[80,17,80,20],[83,13,83,16],[83,17,83,20],[86,13,86,16],[86,17,86,20],[89,13,89,16],[89,17,89,20],[92,13,92,16],[92,17,92,20],[82,13,82,16],[82,17,82,20],[85,13,85,16],[85,17,85,20],[88,13,88,16],[88,17,88,20],[91,13,91,16],[91,17,91,20]]}
[]
[]
[null,"UNIDADE ESCOLAR",null,null,null,null,null,null,"PRAZO"]
[null,{"$f":"Orçamento!$O$4","v":"CENTRO DE ENSINO EM PERÍODO INTEGRAL PADRE TRINDADE"},null,null,null,null,null,null,"120 DIAS CORRIDOS"]
[]
[null,"OBRA",null,null,null,null,null,null,"DATA"]
[null,{"$f":"Orçamento!$O$7","v":"REFORMA E AMPLIAÇÃO"},null,null,null,null,null,null,{"$f":"Orçamento!$S$7","v":"2020-04-08"}]
[]
[null,"LOCAL",null,null,null,null,null,null,"ÁREA TOTAL CONSTRUÍDA (M²)"]
["FILTRO",{"$f":"Orçamento!$V$7","v":"ANÁPOLIS"},null,null,null,null,null,null,{"$f":"Orçamento!$S$13","v":1889.2599999999998}]
[]
[null,"CRONOGRAMA - FÍSICO FINANCEIRO"]
["↓","CUSTO TOTAL:",{"$f":"D93","v":0},"VALOR","Dias:",30,null,null,null,60,null,null,null,90,null,null,null,120,null,null,null,"TOTAL"]
[null,"DESCRIÇÃO DOS SERVIÇOS",null,null,"%","1ª PARCELA",null,null,null,"2ª PARCELA",null,null,null,"3ª PARCELA",null,null,null,"4ª PARCELA"]
[{"$f":"IF(D15>0,\"F\",\"\")","v":""},"SERVIÇOS PRELIMINARES",null,{"$f":"Orçamento!V845","v":0},{"$f":"Orçamento!X845","v":0},{"$f":"ROUND(F17*$D$15,2)","v":0},null,null,null,{"$f":"ROUND(J17*$D$15,2)","v":0},null,null,null,{"$f":"ROUND(N17*$D$15,2)","v":0},null,null,null,{"$f":"ROUND(R17*$D$15,2)","v":0},null,null,null,{"$f":"SUM(F15:U15)","v":0}]
{"$rows_left_out":85}
{"sheet":"Composição BDI","index":4,"n_rows":45,"n_cols":9,"rows_kept":45,"cut":false,"hidden":false,"merged":[[11,0,11,3],[12,0,12,3],[14,0,14,3],[15,0,15,3],[13,0,13,3],[0,0,0,3],[1,0,1,3],[4,0,4,3],[7,0,7,3],[10,0,10,3],[2,0,2,3],[3,0,3,3],[5,0,5,3],[6,0,6,3],[8,0,8,3],[9,0,9,3],[18,5,18,8],[17,0,17,3],[16,0,16,3],[44,0,44,3],[42,0,42,3],[43,0,43,3],[18,0,18,3],[36,0,36,3],[39,0,39,3],[38,0,38,3],[40,0,40,3],[29,0,29,2],[32,0,32,3],[33,0,33,3],[34,0,34,3],[35,0,35,3]]}
[]
[]
["UNIDADE ESCOLAR"]
[{"$f":"Orçamento!$O$4","v":"CENTRO DE ENSINO EM PERÍODO INTEGRAL PADRE TRINDADE"}]
[]
["OBRA"]
[{"$f":"Orçamento!$O$7","v":"REFORMA E AMPLIAÇÃO"}]
[]
["ENDEREÇO"]
[{"$f":"Orçamento!$R$10","v":"RUA SILVA PINTO S/N, JUNDIAI, CEP:75110-640"}]
[]
["CIDADE"]
[{"$f":"Orçamento!$V$7","v":"ANÁPOLIS"}]
[]
["CRE"]
{"$rows_left_out":31}
{"sheet":"Relatório CENTRAL","index":5,"n_rows":40,"n_cols":5,"rows_kept":40,"cut":false,"hidden":false,"merged":[[8,1,8,2],[8,3,8,4],[9,1,9,2],[10,1,10,4],[11,1,11,4],[39,1,39,2],[9,0,11,0],[0,1,0,4],[6,3,6,4],[9,3,9,4],[1,1,1,4],[2,1,2,2],[2,3,2,4],[3,1,3,2],[3,3,3,4],[4,1,4,4],[5,1,5,2],[5,3,5,4],[6,1,6,2],[7,1,7,4]]}
[]
[]
[null,"UNIDADE ESCOLAR",null,"CIDADE"]
[null,{"$f":"Orçamento!$O$4","v":"CENTRO DE ENSINO EM PERÍODO INTEGRAL PADRE TRINDADE"},null,{"$f":"Orçamento!$V$7","v":"ANÁPOLIS"}]
[]
[null,"OBRA",null,"CRE"]
[null,{"$f":"Orçamento!$O$7","v":"REFORMA E AMPLIAÇÃO"},null,{"$f":"Orçamento!$O$10","v":"ANÁPOLIS"}]
[]
[null,"ENDEREÇO",null,"DATA"]
["FILTRO",{"$f":"Orçamento!$R$10","v":"RUA SILVA PINTO S/N, JUNDIAI, CEP:75110-640"},null,{"$f":"Orçamento!$S$7","v":"2020-04-08"}]
[]
[null,"RELATÓRIO CENTRAL"]
["↓","CÓDIGO","ETAPA","PREÇO  (R$) C/ BDI","PARTIC  ( % )"]
[{"$f":"IF(D14>0,\"F\",\"\")","v":""},{"$f":"Orçamento!O845","v":"a."},{"$f":"Orçamento!P845","v":"SERVIÇOS PRELIMINARES"},{"$f":"Orçamento!V845","v":0},{"$f":"Orçamento!X845","v":0}]
[{"$f":"IF(D15>0,\"F\",\"\")","v":""},{"$f":"Orçamento!O846","v":"b."},{"$f":"Orçamento!P846","v":"TRANSPORTES"},{"$f":"Orçamento!V846","v":0},{"$f":"Orçamento!X846","v":0}]
{"$rows_left_out":26}
{"sheet":"Parc Maior Relev","index":6,"n_rows":21,"n_cols":7,"rows_kept":21,"cut":false,"hidden":false,"merged":[[0,1,0,6],[11,1,11,6],[1,1,1,6],[2,1,2,3],[2,4,2,6],[3,1,3,3],[3,4,3,6],[4,1,4,6],[5,1,5,3],[5,4,5,6],[9,1,9,3],[9,4,9,6],[10,1,10,6],[6,1,6,3],[6,4,6,6],[7,1,7,6],[10,0,12,0],[8,1,8,3],[8,4,8,6],[21,3,21,7],[19,1,19,6]]}
[]
[]
[null,"UNIDADE ESCOLAR",null,null,"CÓDIGO INEP"]
[null,{"$f":"Orçamento!$O$4","v":"CENTRO DE ENSINO EM PERÍODO INTEGRAL PADRE TRINDADE"},null,null,{"$f":"Orçamento!$V$4","v":52020452}]
[]
[null,"OBRA",null,null,"CIDADE"]
[null,{"$f":"Orçamento!$O$7","v":"REFORMA E AMPLIAÇÃO"},null,null,{"$f":"Orçamento!$V$7","v":"ANÁPOLIS"}]
[]
[null,"CRE",null,null,"ÁREA TOTAL CONSTRUÍDA (M²)"]
[null,{"$f":"Orçamento!$O$10","v":"ANÁPOLIS"},null,null,{"$f":"Orçamento!$S$13","v":1889.2599999999998}]
["FILTRO"]
[null,"PARCELA DE MAIOR RELEVÂNCIA"]
[null,"CÓDIGO","SERVIÇO","DESCRIÇÃO","UNID","QUANT","PARC. MAIOR RELEV (50%)"]
[{"$f":"IF(F14>0,\"F\",\"\")","v":"F"},"U.",{"$f":"IFERROR(VLOOKUP(B14,Orçamento!$O$845:$P$870,2,FALSE),\"(inserir código ao lado)\")","v":"REVESTIMENTO DE PISO"},"PISO DE CONCRETO DESEMPENADO","M²",575.70000000000005,{"$f":"F14*0.5","v":287.85000000000002}]
[{"$f":"IF(F15>0,\"F\",\"\")","v":"F"},"O.",{"$f":"IFERROR(VLOOKUP(B15,Orçamento!$O$845:$P$870,2,FALSE),\"(inserir código ao lado)\")","v":"COBERTURAS"},"TELHA CERÂMICA","M²",345.07,172.535]
{"$rows_left_out":7}
{"sheet":"Composições","index":7,"n_rows":335,"n_cols":10,"rows_kept":335,"cut":false,"hidden":false,"merged":[[15,0,15,9],[13,0,13,2],[13,3,13,6],[1,0,1,9],[3,7,3,9],[4,7,4,9],[6,7,6,9],[7,7,7,9],[6,0,6,6],[10,8,10,9],[13,8,13,9],[14,0,14,9],[8,0,8,9],[5,0,5,9],[2,0,2,9],[0,0,0,8],[10,0,10,2],[10,3,10,6],[11,0,11,9],[12,0,12,2],[12,3,12,6],[12,7,12,8],[7,0,7,6],[9,0,9,2],[9,3,9,6],[9,7,9,8],[3,0,3,6],[4,0,4,6],[16,5,17,5],[16,6,16,7],[16,8,16,9],[22,1,22,7],[26,1,26,7],[16,0,17,0],[16,1,17,1],[16,2,17,2],[16,3,17,3],[16,4,17,4],[28,5,29,5],[28,6,28,7],[28,8,28,9],[34,1,34,7],[38,1,38,7],[28,0,29,0],[28,1,29,1],[28,2,29,2],[28,3,29,3],[28,4,29,4],[40,5,41,5],[40,6,40,7],[40,8,40,9],[46,1,46,7],[50,1,50,7],[40,0,41,0],[40,1,41,1],[40,2,41,2],[40,3,41,3],[40,4,41,4],[52,5,53,5],[52,6,52,7],[52,8,52,9],[58,1,58,7],[62,1,62,7],[52,0,53,0],[52,1,53,1],[52,2,53,2],[52,3,53,3],[52,4,53,4],[64,5,65,5],[64,6,64,7],[64,8,64,9],[69,1,69,7],[71,1,71,7],[64,0,65,0],[64,1,65,1],[64,2,65,2],[64,3,65,3],[64,4,65,4],[73,5,74,5],[73,6,73,7],[73,8,73,9],[79,1,79,7],[86,1,86,7],[73,0,74,0],[73,1,74,1],[73,2,74,2],[73,3,74,3],[73,4,74,4],[88,5,89,5],[88,6,88,7],[88,8,88,9],[94,1,94,7],[98,1,98,7],[88,0,89,0],[88,1,89,1],[88,2,89,2],[88,3,89,3],[88,4,89,4],[100,5,101,5],[100,6,100,7],[100,8,100,9],[106,1,106,7],[110,1,110,7],[100,0,101,0],[100,1,101,1],[100,2,101,2],[100,3,101,3],[100,4,101,4],[112,5,113,5],[112,6,112,7],[112,8,112,9],[118,1,118,7],[122,1,122,7],[112,0,113,0],[112,1,113,1],[112,2,113,2],[112,3,113,3],[112,4,113,4],[124,5,125,5],[124,6,124,7],[124,8,124,9],[130,1,130,7],[134,1,134,7],[124,0,125,0],[124,1,125,1],[124,2,125,2],[124,3,125,3],[124,4,125,4],[136,5,137,5],[136,6,136,7],[136,8,136,9],[142,1,142,7],[146,1,146,7],[136,0,137,0],[136,1,137,1],[136,2,137,2],[136,3,137,3],[136,4,137,4],[148,5,149,5],[148,6,148,7],[148,8,148,9],[154,1,154,7],[158,1,158,7],[148,0,149,0],[148,1,149,1],[148,2,149,2],[148,3,149,3],[148,4,149,4],[160,5,161,5],[160,6,160,7],[160,8,160,9],[166,1,166,7],[170,1,170,7],[160,0,161,0],[160,1,161,1],[160,2,161,2],[160,3,161,3],[160,4,161,4],[172,5,173,5],[172,6,172,7],[172,8,172,9],[178,1,178,7],[182,1,182,7],[172,0,173,0],[172,1,173,1],[172,2,173,2],[172,3,173,3],[172,4,173,4],[184,5,185,5],[184,6,184,7],[184,8,184,9],[190,1,190,7],[194,1,194,7],[184,0,185,0],[184,1,185,1],[184,2,185,2],[184,3,185,3],[184,4,185,4],[196,5,197,5],[196,6,196,7],[196,8,196,9],[202,1,202,7],[206,1,206,7],[196,0,197,0],[196,1,197,1],[196,2,197,2],[196,3,197,3],[196,4,197,4],[208,5,209,5],[208,6,208,7],[208,8,208,9],[214,1,214,7],[218,1,218,7],[208,0,209,0],[208,1,209,1],[208,2,209,2],[208,3,209,3],[208,4,209,4],[220,5,221,5],[220,6,220,7],[220,8,220,9],[226,1,226,7],[230,1,230,7],[220,0,221,0],[220,1,221,1],[220,2,221,2],[220,3,221,3],[220,4,221,4],[232,5,233,5],[232,6,232,7],[232,8,232,9],[238,1,238,7],[242,1,242,7],[232,0,233,0],[232,1,233,1],[232,2,233,2],[232,3,233,3],[232,4,233,4],[244,5,245,5],[244,6,244,7],[244,8,244,9],[250,1,250,7],[254,1,254,7],[244,0,245,0],[244,1,245,1],[244,2,245,2],[244,3,245,3],[244,4,245,4],[256,5,257,5],[256,6,256,7],[256,8,256,9],[262,1,262,7],[266,1,266,7],[256,0,257,0],[256,1,257,1],[256,2,257,2],[256,3,257,3],[256,4,257,4],[268,5,269,5],[268,6,268,7],[268,8,268,9],[274,1,274,7],[278,1,278,7],[268,0,269,0],[268,1,269,1],[268,2,269,2],[268,3,269,3],[268,4,269,4],[280,5,281,5],[280,6,280,7],[280,8,280,9],[285,1,285,7],[298,1,298,7],[280,0,281,0],[280,1,281,1],[280,2,281,2],[280,3,281,3],[280,4,281,4],[300,5,301,5],[300,6,300,7],[300,8,300,9],[306,1,306,7],[310,1,310,7],[300,0,301,0],[300,1,301,1],[300,2,301,2],[300,3,301,3],[300,4,301,4],[312,5,313,5],[312,6,312,7],[312,8,312,9],[317,1,317,7],[320,1,320,7],[312,0,313,0],[312,1,313,1],[312,2,313,2],[312,3,313,3],[312,4,313,4],[322,5,323,5],[322,6,322,7],[322,8,322,9],[328,1,328,7],[334,1,334,7],[322,0,323,0],[322,1,323,1],[322,2,323,2],[322,3,323,3],[322,4,323,4]]}
[]
[]
[]
["UNIDADE ESCOLAR",null,null,null,null,null,null,"CÓDIGO INEP"]
[{"$f":"Orçamento!$O$4","v":"CENTRO DE ENSINO EM PERÍODO INTEGRAL PADRE TRINDADE"},null,null,null,null,null,null,{"$f":"Orçamento!$V$4","v":52020452}]
[]
["OBRA",null,null,null,null,null,null,"CIDADE"]
[{"$f":"Orçamento!$O$7","v":"REFORMA E AMPLIAÇÃO"},null,null,null,null,null,null,{"$f":"Orçamento!$V$7","v":"ANÁPOLIS"}]
[]
["CRE",null,null,"ENDEREÇO",null,null,null,"REFERÊNCIA AGETOP"]
[{"$f":"Orçamento!$O$10","v":"ANÁPOLIS"},null,null,{"$f":"Orçamento!$R$10","v":"RUA SILVA PINTO S/N, JUNDIAI, CEP:75110-640"},null,null,null,{"$f":"Orçamento!$V$10","v":"DEZ/18"},{"$f":"Orçamento!$W$10","v":"ONERADA"}]
[]
["DATA",null,null,"ÁREA TOTAL CONSTRUÍDA (M²)",null,null,null,"REFERÊNCIA SINAPI"]
[{"$f":"Orçamento!$S$7","v":"2020-04-08"},null,null,{"$f":"Orçamento!$S$13","v":1889.2599999999998},null,null,null,{"$f":"Orçamento!$V$13","v":"MAR/19"},{"$f":"Orçamento!$W$13","v":"ONERADA"}]
[]
{"$rows_left_out":320}