{"text_format":"1","workbook":"xlsx","n_sheets":8,"sheets":["Orçamento","Resumo ","Somatório","Cronog_120_Dias","Composição BDI","Relatório CENTRAL","Parc Maior Relev","Composições"],"not_rendered":{"charts":0,"images":3,"macros":1,"external_links":0,"defined_names":79,"comments":3,"pivot_tables":0},"unopened":[],"bounds":{"document_bytes":16777216,"sheet_cells":100000,"rows_first":2000,"rows_last":500,"rows_between":2000,"halvings":0,"cell_chars":16384,"cell_head_chars":4096},"cells_cut":0,"cells_raw":0,"read":"whole","date_system":"1900"}

{"sheet":"Orçamento","index":0,"n_rows":902,"n_cols":24,"rows_kept":902,"cut":false,"hidden":false,"merged":[[883,18,883,20],[883,21,883,22],[884,15,884,17],[884,18,884,20],[884,21,884,22],[885,15,885,17],[885,18,885,20],[885,21,885,22],[880,15,880,17],[880,18,880,20],[880,21,880,22],[881,15,881,17],[881,18,881,20],[881,21,881,22],[882,15,882,17],[882,18,882,20],[882,21,882,22],[894,18,894,20],[894,21,894,22],[889,15,889,17],[889,18,889,20],[889,21,889,22],[890,15,890,17],[890,18,890,20],[890,21,890,22],[891,15,891,17],[891,18,891,20],[891,21,891,22],[870,14,870,17],[877,15,877,17],[843,15,843,17],[898,18,898,20],[898,21,898,22],[886,15,886,17],[886,18,886,20],[886,21,886,22],[887,15,887,17],[887,18,887,20],[887,21,887,22],[888,15,888,17],[888,18,888,20],[888,21,888,22],[892,15,892,17],[892,18,892,20],[892,21,892,22],[893,15,893,17],[893,18,893,20],[893,21,893,22],[894,15,894,17],[883,15,883,17],[838,16,838,22],[901,18,901,20],[901,21,901,22],[898,14,898,17],[895,15,895,17],[895,18,895,20],[895,21,895,22],[896,15,896,17],[896,18,896,20],[896,21,896,22],[897,15,897,17],[897,18,897,20],[897,21,897,22],[900,18,900,20],[900,21,900,22],[899,18,899,20],[899,21,899,22],[876,14,876,23],[877,18,877,20],[877,21,877,22],[878,15,878,17],[878,18,878,20],[878,21,878,22],[879,15,879,17],[879,18,879,20],[879,21,879,22],[834,16,834,22],[835,16,835,22],[836,16,836,22],[3,21,3,22],[2,21,2,22],[5,21,5,22],[10,14,10,23],[13,14,13,23],[6,21,6,22],[9,17,9,20],[2,14,2,20],[3,14,3,20],[5,18,5,20],[6,18,6,20],[11,18,11,20],[12,18,12,20],[6,14,6,17],[5,14,5,17],[856,15,856,17],[857,15,857,17],[858,15,858,17],[859,15,859,17],[860,15,860,17],[861,15,861,17],[862,15,862,17],[863,15,863,17],[864,15,864,17],[844,15,844,17],[845,15,845,17],[846,15,846,17],[847,15,847,17],[848,15,848,17],[849,15,849,17],[850,15,850,17],[851,15,851,17],[852,15,852,17],[865,15,865,17],[866,15,866,17],[867,15,867,17],[868,15,868,17],[869,15,869,17],[842,14,842,23],[831,20,831,21],[830,20,830,21],[826,17,831,17],[826,20,826,21],[843,18,843,20],[843,21,843,22],[844,18,844,20],[844,21,844,22],[832,20,832,21],[852,18,852,20],[852,21,852,22],[853,18,853,20],[853,21,853,22],[854,18,854,20],[854,21,854,22],[855,18,855,20],[855,21,855,22],[867,18,867,20],[870,18,870,20],[870,21,870,22],[867,21,867,22],[868,18,868,20],[868,21,868,22],[869,18,869,20],[869,21,869,22],[859,18,859,20],[859,21,859,22],[866,18,866,20],[866,21,866,22],[861,21,861,22],[862,18,862,20],[862,21,862,22],[864,18,864,20],[860,18,860,20],[860,21,860,22],[861,18,861,20],[871,18,871,20],[871,21,871,22],[858,18,858,20],[858,21,858,22],[851,18,851,20],[851,21,851,22],[873,18,873,20],[873,21,873,22],[827,20,827,21],[849,18,849,20],[849,21,849,22],[850,18,850,20],[850,21,850,22],[848,18,848,20],[848,21,848,22],[857,18,857,20],[828,20,828,21],[839,18,839,22],[845,18,845,20],[845,21,845,22],[846,18,846,20],[846,21,846,22],[847,18,847,20],[847,21,847,22],[837,16,837,22],[8,12,9,12],[872,18,872,20],[872,21,872,22],[0,14,0,22],[8,14,8,16],[9,14,9,16],[11,14,11,16],[12,14,12,16],[14,14,14,22],[1,14,1,22],[4,14,4,22],[7,14,7,22],[856,18,856,20],[856,21,856,22],[864,21,864,22],[853,15,853,17],[854,15,854,17],[855,15,855,17],[857,21,857,22],[865,18,865,20],[865,21,865,22],[863,18,863,20],[863,21,863,22]]}
[]
[]
[null,null,null,null,null,null,null,null,null,null,null,null,null,null,"UNIDADE ESCOLAR",null,null,null,null,null,null,"CÓDIGO INEP"]
[null,null,null,null,null,null,null,null,null,null,null,null,null,null,"CENTRO DE ENSINO EM PERÍODO INTEGRAL PADRE TRINDADE",null,null,null,null,null,null,52020452]
[]
["Nmax",null,null,null,null,null,null,null,null,null,null,null,"Ajustar altura?",null,"OBRA",null,null,null,"DATA",null,null,"CIDADE"]
[{"$f":"MAX($C$18:$C$826)","v":3},null,null,null,null,null,null,null,null,null,null,null,"NÃO",null,"REFORMA E AMPLIAÇÃO",null,null,null,"2020-04-08",null,null,"ANÁPOLIS"]
[]
[null,null,null,null,null,null,null,null,null,null,null,null,"",null,"CRE",null,null,"ENDEREÇO",null,null,null,"REFERÊNCIA AGETOP"]
[null,null,null,null,null,null,null,null,null,null,null,null,null,null,"ANÁPOLIS",null,null,"RUA SILVA PINTO S/N, JUNDIAI, CEP:75110-640",null,null,null,"DEZ/18","ONERADA"]
[]
[null,null,null,null,null,null,null,null,null,null,null,null,null,null,"ÁREA EXISTENTE (M²)",null,null,"ÁREA A CONSTRUIR (M²)","ÁREA TOTAL CONSTRUÍDA (M²)",null,null,"REFERÊNCIA SINAPI"]
[null,null,null,null,null,null,null,null,null,null,null,null,null,null,1194.8599999999999,null,null,694.4,1889.2599999999998,null,null,"MAR/19","ONERADA"]
[]
[null,null,null,null,null,null,null,null,null,null,null,"FILTRO",null,null,"PLANILHA ORÇAMENTÁRIA"]
["Nível E","Save Nivel","Nível C","Altura","n1","n2","n3","n4","n5","Czero","Cnível","↓","Nível","Nível Corrigido","ITEM","TABELA","CODIGO","DESCRIÇÃO DOS SERVIÇOS","UNID","QUANT","MAT","MO","T.SERVIÇO","OBSERVAÇÕES¹"]
[{"$f":"CHOOSE(1+LOG(1+2*(ORÇAMENTO.Nivel=\"Nível 1\")+4*(ORÇAMENTO.Nivel=\"Nível 2\")+8*(ORÇAMENTO.Nivel=\"Nível 3\")+16*(ORÇAMENTO.Nivel=\"Nível 4\")+32*(ORÇAMENTO.Nivel=\"Serviço\"),2),0,1,2,3,4,\"S\")","v":"S"},{"$f":"IF(OR(C17=\"s\",C17=0),OFFSET(B17,-1,0),C17)","v":"Save Nivel"},{"$f":"IF(OFFSET(C17,-1,0)=\"L\",1,IF(OFFSET(C17,-1,0)=1,2,IF(OR(A17=\"s\",A17=0),\"S\",IF(AND(OFFSET(C17,-1,0)=2,A17=4),3,IF(AND(OR(OFFSET(C17,-1,0)=\"s\",OFFSET(C17,-1,0)=0),A17<>\"s\",A17>OFFSET(B17,-1,0)),OFFSET(B17,-1,0),A17)))))","v":"S"},{"$f":"IF(OR(C17=\"S\",C17=0),0,IF(ISERROR(K17),J17,SMALL(J17:K17,1)))","v":0},{"$f":"IF($C17=1,OFFSET(E17,-1,0)+1,OFFSET(E17,-1,0))","v":"n1"},{"$f":"IF($C17=1,0,IF($C17=2,OFFSET(F17,-1,0)+1,OFFSET(F17,-1,0)))","v":"n2"},{"$f":"IF(AND($C17<=2,$C17<>0),0,IF($C17=3,OFFSET(G17,-1,0)+1,OFFSET(G17,-1,0)))","v":"n3"},{"$f":"IF(AND($C17<=3,$C17<>0),0,IF($C17=4,OFFSET(H17,-1,0)+1,OFFSET(H17,-1,0)))","v":"n4"},{"$f":"IF(AND($C17<=4,$C17<>0),0,IF(AND($C17=\"S\",$W17>0),OFFSET(I17,-1,0)+1,OFFSET(I17,-1,0)))","v":"n5"},{"$f":"IF(OR($C17=\"S\",$C17=0),0,MATCH(0,OFFSET($D17,1,$C17,ROW($C$826)-ROW($C17)),0))","v":0},{"$f":"IF(OR($C17=\"S\",$C17=0),0,MATCH(OFFSET($D17,0,$C17)+1,OFFSET($D17,1,$C17,ROW($C$826)-ROW($C17)),0))","v":0},"","Serviço","Serviço","-","SINAPI",null,"(sem código)","-",null,0,0,0,""]
[0,null,"L",{"$f":"COUNTA(OFFSET(D18,1,0):D$826)","v":807},{"$f":"LEFT(O19,1)-1","v":0},null,null,null,null,null,null,"F","LOTE","LOTE","REFORMA E AMPLIAÇÃO - CENTRO DE ENSINO EM PERÍODO INTEGRAL PADRE TRINDADE",null,null,null,null,null,null,null,0]
[1,{"$f":"IF(OR(C19=\"s\",C19=0),OFFSET(B19,-1,0),C19)","v":1},{"$f":"IF(OFFSET(C19,-1,0)=\"L\",1,IF(OFFSET(C19,-1,0)=1,2,IF(OR(A19=\"s\",A19=0),\"S\",IF(AND(OFFSET(C19,-1,0)=2,A19=4),3,IF(AND(OR(OFFSET(C19,-1,0)=\"s\",OFFSET(C19,-1,0)=0),A19<>\"s\",A19>OFFSET(B19,-1,0)),OFFSET(B19,-1,0),A19)))))","v":1},{"$f":"IF(OR(C19=\"S\",C19=0),0,IF(ISERROR(K19),J19,SMALL(J19:K19,1)))","v":374},{"$f":"IF($C19=1,OFFSET(E19,-1,0)+1,OFFSET(E19,-1,0))","v":1},{"$f":"IF($C19=1,0,IF($C19=2,OFFSET(F19,-1,0)+1,OFFSET(F19,-1,0)))","v":0},{"$f":"IF(AND($C19<=2,$C19<>0),0,IF($C19=3,OFFSET(G19,-1,0)+1,OFFSET(G19,-1,0)))","v":0},{"$f":"IF(AND($C19<=3,$C19<>0),0,IF($C19=4,OFFSET(H19,-1,0)+1,OFFSET(H19,-1,0)))","v":0},0,{"$f":"IF(OR($C19=\"S\",$C19=0),0,MATCH(0,OFFSET($D19,1,$C19,ROW($C$826)-ROW($C19)),0))","v":807},{"$f":"IF(OR($C19=\"S\",$C19=0),0,MATCH(OFFSET($D19,0,$C19)+1,OFFSET($D19,1,$C19,ROW($C$826)-ROW($C19)),0))","v":374},"F","Nível 1","Nível 1","1.","AGETOP",null,"REFORMA",null,null,null,null,0]
[2,{"$f":"IF(OR(C20=\"s\",C20=0),OFFSET(B20,-1,0),C20)","v":2},{"$f":"IF(OFFSET(C20,-1,0)=\"L\",1,IF(OFFSET(C20,-1,0)=1,2,IF(OR(A20=\"s\",A20=0),\"S\",IF(AND(OFFSET(C20,-1,0)=2,A20=4),3,IF(AND(OR(OFFSET(C20,-1,0)=\"s\",OFFSET(C20,-1,0)=0),A20<>\"s\",A20>OFFSET(B20,-1,0)),OFFSET(B20,-1,0),A20)))))","v":2},{"$f":"IF(OR(C20=\"S\",C20=0),0,IF(ISERROR(K20),J20,SMALL(J20:K20,1)))","v":20},{"$f":"IF($C20=1,OFFSET(E20,-1,0)+1,OFFSET(E20,-1,0))","v":1},{"$f":"IF($C20=1,0,IF($C20=2,OFFSET(F20,-1,0)+1,OFFSET(F20,-1,0)))","v":1},{"$f":"IF(AND($C20<=2,$C20<>0),0,IF($C20=3,OFFSET(G20,-1,0)+1,OFFSET(G20,-1,0)))","v":0},{"$f":"IF(AND($C20<=3,$C20<>0),0,IF($C20=4,OFFSET(H20,-1,0)+1,OFFSET(H20,-1,0)))","v":0},0,373,20,"","Nível 2","Nível 2","-","AGETOP",null,"SERVIÇOS PRELIMINARES",null,null,null,null,0]
[3,{"$f":"IF(OR(C21=\"s\",C21=0),OFFSET(B21,-1,0),C21)","v":3},{"$f":"IF(OFFSET(C21,-1,0)=\"L\",1,IF(OFFSET(C21,-1,0)=1,2,IF(OR(A21=\"s\",A21=0),\"S\",IF(AND(OFFSET(C21,-1,0)=2,A21=4),3,IF(AND(OR(OFFSET(C21,-1,0)=\"s\",OFFSET(C21,-1,0)=0),A21<>\"s\",A21>OFFSET(B21,-1,0)),OFFSET(B21,-1,0),A21)))))","v":3},{"$f":"IF(OR(C21=\"S\",C21=0),0,IF(ISERROR(K21),J21,SMALL(J21:K21,1)))","v":19},1,1,1,0,0,19,29,"","Nível 3","Nível 3","-","SINAPI",null,"OUTROS","-",null,null,null,0,""]
["S",3,"S",0,1,1,1,0,0,0,0,"","Serviço","Serviço","-","AGETOP",20100,"DEMOLIÇÃO - COBERTURA TELHA METÁLICA C/ TRANSP. ATÉ CB. E CARGA","m2    ",6,null,null,0,""]
["S",3,"S",0,1,1,1,0,0,0,0,"","Serviço","Serviço","-","AGETOP",271204,"RETIRADA DE QUADRO DE GIZ COM TRANSP. AT[E CB E CARGA","Un    ",8,null,null,0,""]
["S",3,"S",0,1,1,1,0,0,0,0,"","Serviço","Serviço","-","AGETOP",20102,"DEMOLICAO-COBERTURA TELHA FIBROCIMENTO/FIBRA DE VIDRO/SIMILARES C/ TRANSP. ATÉ CB. E CARGA","m2    ",175,null,null,0,""]
["S",3,"S",0,1,1,1,0,0,0,0,"","Serviço","Serviço","-","AGETOP",20103,"DEMOLIÇÃO ESTRUTURA EM MADEIRA TELHADO C/ TRANSP. ATÉ CB. E CARGA","m2    ",175,null,null,0,""]
["S",3,"S",0,1,1,1,0,0,0,0,"","Serviço","Serviço","-","AGETOP",20107,"CORTE/DESTOC./RETIRADA/REATERRO (MANUAIS) DE ÁRVORE GRANDE PORTE ( H = 8 A 10 M / DIÂMETRO TRONCO 60 A 70CM E COPA DE 10 A 13M ) C/TRANSP.ATE C.B.E CARGA ","Un    ",3,null,null,0,""]
["S",3,"S",0,1,1,1,0,0,0,0,"","Serviço","Serviço","-","SINAPI",97645,"REMOÇÃO DE JANELAS, DE FORMA MANUAL, SEM REAPROVEITAMENTO. AF_12/2017","M2",5.52,null,null,0,"Referência: AGETOP - 20106"]
["S",3,"S",0,1,1,1,0,0,0,0,"","Serviço","Serviço","-","SINAPI",97644,"REMOÇÃO DE PORTAS, DE FORMA MANUAL, SEM REAPROVEITAMENTO. AF_12/2017","M2",18.060000000000002,null,null,0,"Referência: AGETOP - 20106"]
["S",3,"S",0,1,1,1,0,0,0,0,"","Serviço","Serviço","-","AGETOP",20109,"DEM.PISO CIMENT.SOBRE LASTRO CONC.C/TR.ATE CB. E CARGA","m2    ",880.16,null,null,0,""]
["S",3,"S",0,1,1,1,0,0,0,0,"","Serviço","Serviço","-","AGETOP",20111,"DEM.PISO CERAM.SOBRE LASTRO CONC.C/TR.CB.E CARGA","m2    ",79.2,null,null,0,""]
["S",3,"S",0,1,1,1,0,0,0,0,"","Serviço","Serviço","-","SINAPI",97633,"DEMOLIÇÃO DE REVESTIMENTO CERÂMICO, DE FORMA MANUAL, SEM REAPROVEITAMENTO. AF_12/2017","M2",165,null,null,0,"Referência: AGETOP - 20115"]
["S",3,"S",0,1,1,1,0,0,0,0,"","Serviço","Serviço","-","SINAPI",97622,"DEMOLIÇÃO DE ALVENARIA DE BLOCO FURADO, DE FORMA MANUAL, SEM REAPROVEITAMENTO. AF_12/2017","M3",7.51,null,null,0,"Referência: AGETOP - 20118"]
["S",3,"S",0,1,1,1,0,0,0,0,"","Serviço","Serviço","-","AGETOP",20137,"DEMOLIÇAO BACIA SANITARIA C/ TRANSP. ATÉ CB. E CARGA","Un    ",3,null,null,0,""]
["S",3,"S",0,1,1,1,0,0,0,0,"","Serviço","Serviço","-","AGETOP",20139,"DEMOLIÇAO DE BANCADAS C/ TRANSP. ATÉ CB. E CARGA","m2    ",7.61,null,null,0,""]
["S",3,"S",0,1,1,1,0,0,0,0,"","Serviço","Serviço","-","AGETOP",20140,"DEMOLIÇAO DE VÁLVULA DE DESCARGA C/ TRANSP. ATÉ CB. E CARGA","Un    ",13,null,null,0,""]
["S",3,"S",0,1,1,1,0,0,0,0,"","Serviço","Serviço","-","AGETOP",20146,"DEMOLIÇÃO DE MICTÓRIO C/ TRANSP. ATÉ CB. E CARGA","Un    ",2,null,null,0,""]
["S",3,"S",0,1,1,1,0,0,0,0,"","Serviço","Serviço","-","AGETOP",20162,"DEMOLIÇÃO DAS INSTALAÇÕES ELÉTRICAS E AFINS C/ TRANSP. ATÉ CB. E CARGA","H     ",200,null,null,0,""]
["S",3,"S",0,1,1,1,0,0,0,0,"","Serviço","Serviço","-","AGETOP",20163,"DEMOLIÇÃO DAS INSTALAÇÕES HIDROSANITÁRIAS E AFINS C/ TRANSP. ATÉ CB. E CARGA","H     ",8,null,null,0,""]
["S",3,"S",0,1,1,1,0,0,0,0,"","Serviço","Serviço","-","SINAPI","74209/1","PLACA DE OBRA EM CHAPA DE ACO GALVANIZADO","M2",4.5,null,null,0,"Referência: AGETOP - 21301"]
[2,2,2,2,1,2,0,0,0,353,2,"","Nível 2","Nível 2","-","AGETOP",null,"TRANSPORTES","-",null,null,null,0,""]
["S",2,"S",0,1,2,0,0,0,0,0,"","Serviço","Serviço","-","SINAPI",72900,"TRANSPORTE DE ENTULHO COM CAMINHAO BASCULANTE 6 M3, RODOVIA PAVIMENTADA, DMT 0,5 A 1,0 KM","M3",63.728000000000009,null,null,0,""]
[{"$f":"CHOOSE(1+LOG(1+2*(ORÇAMENTO.Nivel=\"Nível 1\")+4*(ORÇAMENTO.Nivel=\"Nível 2\")+8*(ORÇAMENTO.Nivel=\"Nível 3\")+16*(ORÇAMENTO.Nivel=\"Nível 4\")+32*(ORÇAMENTO.Nivel=\"Serviço\"),2),0,1,2,3,4,\"S\")","v":2},{"$f":"IF(OR(C42=\"s\",C42=0),OFFSET(B42,-1,0),C42)","v":2},{"$f":"IF(OFFSET(C42,-1,0)=\"L\",1,IF(OFFSET(C42,-1,0)=1,2,IF(OR(A42=\"s\",A42=0),\"S\",IF(AND(OFFSET(C42,-1,0)=2,A42=4),3,IF(AND(OR(OFFSET(C42,-1,0)=\"s\",OFFSET(C42,-1,0)=0),A42<>\"s\",A42>OFFSET(B42,-1,0)),OFFSET(B42,-1,0),A42)))))","v":2},{"$f":"IF(OR(C42=\"S\",C42=0),0,IF(ISERROR(K42),J42,SMALL(J42:K42,1)))","v":14},{"$f":"IF($C42=1,OFFSET(E42,-1,0)+1,OFFSET(E42,-1,0))","v":1},{"$f":"IF($C42=1,0,IF($C42=2,OFFSET(F42,-1,0)+1,OFFSET(F42,-1,0)))","v":3},{"$f":"IF(AND($C42<=2,$C42<>0),0,IF($C42=3,OFFSET(G42,-1,0)+1,OFFSET(G42,-1,0)))","v":0},{"$f":"IF(AND($C42<=3,$C42<>0),0,IF($C42=4,OFFSET(H42,-1,0)+1,OFFSET(H42,-1,0)))","v":0},{"$f":"IF(AND($C42<=4,$C42<>0),0,IF(AND($C42=\"S\",$W42>0),OFFSET(I42,-1,0)+1,OFFSET(I42,-1,0)))","v":0},351,14,"","Nível 2","Nível 2","-","AGETOP",null,"FUNDAÇÕES E SONDAGENS","-",null,null,null,0,""]
[3,3,3,7,1,3,1,0,0,13,7,"","Nível 3","Nível 3","-","SINAPI",null,"ESTACAS E BLOCOS","-",null,null,null,0,""]
["S",3,"S",0,1,3,1,0,0,0,0,"","Serviço","Serviço","-","SINAPI",98230,"ESTACA BROCA DE CONCRETO, DIÂMETRO DE 30 CM, PROFUNDIDADE DE ATÉ 3 M, ESCAVAÇÃO MANUAL COM TRADO CONCHA, NÃO ARMADA. AF_03/2018","M",10,null,null,0,"Referência: AGETOP - 50302"]
["S",3,"S",0,1,3,1,0,0,0,0,"","Serviço","Serviço","-","AGETOP",51009,"FORMA TABUA PINHO P/FUNDACOES U=3V - (OBRAS CIVIS)","m2    ",42.75,null,null,0,""]
["S",3,"S",0,1,3,1,0,0,0,0,"","Serviço","Serviço","-","SINAPI",94971,"CONCRETO FCK = 25MPA, TRAÇO 1:2,3:2,7 (CIMENTO/ AREIA MÉDIA/ BRITA 1)  - PREPARO MECÂNICO COM BETONEIRA 600 L. AF_07/2016","M3",5.3000000000000007,null,null,0,""]
["S",3,"S",0,1,3,1,0,0,0,0,"","Serviço","Serviço","-","SINAPI","74157/4","LANCAMENTO/APLICACAO MANUAL DE CONCRETO EM FUNDACOES","M3",5.3000000000000007,null,null,0,"Referência: AGETOP - 51055"]
["S",3,"S",0,1,3,1,0,0,0,0,"","Serviço","Serviço","-","SINAPI",96544,"ARMAÇÃO DE BLOCO, VIGA BALDRAME OU SAPATA UTILIZANDO AÇO CA-50 DE 6,3 MM - MONTAGEM. AF_06/2017","KG",98.4,null,null,0,"Referência: AGETOP - 52003"]
["S",3,"S",0,1,3,1,0,0,0,0,"","Serviço","Serviço","-","SINAPI",96547,"ARMAÇÃO DE BLOCO, VIGA BALDRAME OU SAPATA UTILIZANDO AÇO CA-50 DE 12,5 MM - MONTAGEM. AF_06/2017","KG",413.73,null,null,0,"Referência: AGETOP - 52006"]
[3,3,3,6,1,3,2,0,0,6,93,"","Nível 3","Nível 3","-","SINAPI",null,"VIGAS BALDRAMES","-",null,null,null,0,""]
["S",3,"S",0,1,3,2,0,0,0,0,"","Serviço","Serviço","-","AGETOP",60191,"FORMA DE TABUA CINTA BALDRAME U=8 VEZES","m2    ",33.340000000000003,null,null,0,""]
["S",3,"S",0,1,3,2,0,0,0,0,"","Serviço","Serviço","-","SINAPI",94971,"CONCRETO FCK = 25MPA, TRAÇO 1:2,3:2,7 (CIMENTO/ AREIA MÉDIA/ BRITA 1)  - PREPARO MECÂNICO COM BETONEIRA 600 L. AF_07/2016","M3",1.92,null,null,0,""]
["S",3,"S",0,1,3,2,0,0,0,0,"","Serviço","Serviço","-","SINAPI","74157/4","LANCAMENTO/APLICACAO MANUAL DE CONCRETO EM FUNDACOES","M3",1.92,null,null,0,"Referência: AGETOP - 51055"]
["S",3,"S",0,1,3,2,0,0,0,0,"","Serviço","Serviço","-","SINAPI",96544,"ARMAÇÃO DE BLOCO, VIGA BALDRAME OU SAPATA UTILIZANDO AÇO CA-50 DE 6,3 MM - MONTAGEM. AF_06/2017","KG",79.5,null,null,0,"Referência: AGETOP - 52003"]
["S",3,"S",0,1,3,2,0,0,0,0,"","Serviço","Serviço","-","SINAPI",96545,"ARMAÇÃO DE BLOCO, VIGA BALDRAME OU SAPATA UTILIZANDO AÇO CA-50 DE 8 MM - MONTAGEM. AF_06/2017","KG",90.6,null,null,0,"Referência: AGETOP - 52004"]
[2,2,2,7,1,4,0,0,0,337,7,"","Nível 2","Nível 2","-","AGETOP",null,"ESTRUTURA","-",null,null,null,0,""]
[3,3,3,6,1,4,1,0,0,6,74,"","Nível 3","Nível 3","-",null,null,"VIGAS DE COBERTURA","-",null,null,null,0,""]
["S",3,"S",0,1,4,1,0,0,0,0,"","Serviço","Serviço","-","SINAPI",92464,"MONTAGEM E DESMONTAGEM DE FÔRMA DE VIGA, ESCORAMENTO METÁLICO, PÉ-DIREITO SIMPLES, EM CHAPA DE MADEIRA RESINADA, 8 UTILIZAÇÕES. AF_12/2015","M2",58.99,null,null,0,"Referência: AGETOP - 60204"]
["S",3,"S",0,1,4,1,0,0,0,0,"","Serviço","Serviço","-","SINAPI",94971,"CONCRETO FCK = 25MPA, TRAÇO 1:2,3:2,7 (CIMENTO/ AREIA MÉDIA/ BRITA 1)  - PREPARO MECÂNICO COM BETONEIRA 600 L. AF_07/2016","M3",3.85,null,null,0,""]
["S",3,"S",0,1,4,1,0,0,0,0,"","Serviço","Serviço","-","SINAPI",92873,"LANÇAMENTO COM USO DE BALDES, ADENSAMENTO E ACABAMENTO DE CONCRETO EM ESTRUTURAS. AF_12/2015","M3",3.85,null,null,0,"Referência: AGETOP - 51055"]
[{"$f":"CHOOSE(1+LOG(1+2*(ORÇAMENTO.Nivel=\"Nível 1\")+4*(ORÇAMENTO.Nivel=\"Nível 2\")+8*(ORÇAMENTO.Nivel=\"Nível 3\")+16*(ORÇAMENTO.Nivel=\"Nível 4\")+32*(ORÇAMENTO.Nivel=\"Serviço\"),2),0,1,2,3,4,\"S\")","v":"S"},3,"S",0,1,4,1,0,{"$f":"IF(AND($C61<=4,$C61<>0),0,IF(AND($C61=\"S\",$W61>0),OFFSET(I61,-1,0)+1,OFFSET(I61,-1,0)))","v":0},0,0,"","Serviço","Serviço","-","SINAPI",92776,"ARMAÇÃO DE PILAR OU VIGA DE UMA ESTRUTURA CONVENCIONAL DE CONCRETO ARMADO EM UMA EDIFICAÇÃO TÉRREA OU SOBRADO UTILIZANDO AÇO CA-50 DE 6,3 MM - MONTAGEM. AF_12/2015","KG",66.099999999999994,null,null,0,"Referência: AGETOP - 60303"]
["S",3,"S",0,1,4,1,0,0,0,0,"","Serviço","Serviço","-","SINAPI",92777,"ARMAÇÃO DE PILAR OU VIGA DE UMA ESTRUTURA CONVENCIONAL DE CONCRETO ARMADO EM UMA EDIFICAÇÃO TÉRREA OU SOBRADO UTILIZANDO AÇO CA-50 DE 8,0 MM - MONTAGEM. AF_12/2015","KG",109.7,null,null,0,"Referência: AGETOP - 60304"]
[2,{"$f":"IF(OR(C63=\"s\",C63=0),OFFSET(B63,-1,0),C63)","v":2},{"$f":"IF(OFFSET(C63,-1,0)=\"L\",1,IF(OFFSET(C63,-1,0)=1,2,IF(OR(A63=\"s\",A63=0),\"S\",IF(AND(OFFSET(C63,-1,0)=2,A63=4),3,IF(AND(OR(OFFSET(C63,-1,0)=\"s\",OFFSET(C63,-1,0)=0),A63<>\"s\",A63>OFFSET(B63,-1,0)),OFFSET(B63,-1,0),A63)))))","v":2},{"$f":"IF(OR(C63=\"S\",C63=0),0,IF(ISERROR(K63),J63,SMALL(J63:K63,1)))","v":120},{"$f":"IF($C63=1,OFFSET(E63,-1,0)+1,OFFSET(E63,-1,0))","v":1},{"$f":"IF($C63=1,0,IF($C63=2,OFFSET(F63,-1,0)+1,OFFSET(F63,-1,0)))","v":5},{"$f":"IF(AND($C63<=2,$C63<>0),0,IF($C63=3,OFFSET(G63,-1,0)+1,OFFSET(G63,-1,0)))","v":0},{"$f":"IF(AND($C63<=3,$C63<>0),0,IF($C63=4,OFFSET(H63,-1,0)+1,OFFSET(H63,-1,0)))","v":0},0,330,120,"","Nível 2","Nível 2","-",null,null,"INSTALAÇÕES ELÉTRICAS","-",null,null,null,0,""]
[3,3,3,67,1,5,1,0,0,119,67,"","Nível 3","Nível 3","-","SINAPI",null,"REFORMA ELÉTRICA","-",null,null,null,0,""]
["S",3,"S",0,1,5,1,0,0,0,0,"","Serviço","Serviço","-","AGETOP",70351,"BRACADEIRA METALICA TIPO \"U\" DIAM. 3/4\"","Un    ",114,null,null,0,""]
["S",3,"S",0,1,5,1,0,0,0,0,"","Serviço","Serviço","-","AGETOP",70352,"BRACADEIRA METALICA TIPO \"U\" DIAM. 1\"","Un    ",40,null,null,0,""]
["S",3,"S",0,1,5,1,0,0,0,0,"","Serviço","Serviço","-","AGETOP",70354,"BRACADEIRA METALICA TIPO \"U\" DIAM. 1.1/2\"","Un    ",7,null,null,0,""]
["S",3,"S",0,1,5,1,0,0,0,0,"","Serviço","Serviço","-","AGETOP",70355,"BRACADEIRA METALICA TIPO \"U\" DIAM. 2\"","Un    ",10,null,null,0,""]
["S",3,"S",0,1,5,1,0,0,0,0,"","Serviço","Serviço","-","AGETOP",70356,"BRACADEIRA METALICA TIPO \"U\" DIAM. 2.1/2\"","Un    ",2,null,null,0,""]
["S",3,"S",0,1,5,1,0,0,0,0,"","Serviço","Serviço","-","AGETOP",70358,"BRACADEIRA METALICA TIPO \"U\" DIAM. 4\"","Un    ",2,null,null,0,""]
["S",3,"S",0,1,5,1,0,0,0,0,"","Serviço","Serviço","-","SINAPI",91879,"LUVA PARA ELETRODUTO, PVC, ROSCÁVEL, DN 25 MM (3/4\"), PARA CIRCUITOS TERMINAIS, INSTALADA EM LAJE - FORNECIMENTO E INSTALAÇÃO. AF_12/2015","UN",114,null,null,0,""]
["S",3,"S",0,1,5,1,0,0,0,0,"","Serviço","Serviço","-","SINAPI",91880,"LUVA PARA ELETRODUTO, PVC, ROSCÁVEL, DN 32 MM (1\"), PARA CIRCUITOS TERMINAIS, INSTALADA EM LAJE - FORNECIMENTO E INSTALAÇÃO. AF_12/2015","UN",40,null,null,0,""]
["S",3,"S",0,1,5,1,0,0,0,0,"","Serviço","Serviço","-","SINAPI",92986,"CABO DE COBRE FLEXÍVEL ISOLADO, 35 MM², ANTI-CHAMA 0,6/1,0 KV, PARA DISTRIBUIÇÃO - FORNECIMENTO E INSTALAÇÃO. AF_12/2015","M",23,null,null,0,"Referência: AGETOP - 70512"]
["S",3,"S",0,1,5,1,0,0,0,0,"","Serviço","Serviço","-","SINAPI",96971,"CORDOALHA DE COBRE NU 16 MM², NÃO ENTERRADA, COM ISOLADOR - FORNECIMENTO E INSTALAÇÃO. AF_12/2017","M",5,null,null,0,"Referência: AGETOP - 70541"]
["S",3,"S",0,1,5,1,0,0,0,0,"","Serviço","Serviço","-","AGETOP",70544,"CABO DE COBRE NÚ No. 50 MM2","M     ",20,null,null,0,"Referência: AGETOP - 70561"]
["S",3,"S",0,1,5,1,0,0,0,0,"","Serviço","Serviço","-","SINAPI",91834,"ELETRODUTO FLEXÍVEL CORRUGADO, PVC, DN 25 MM (3/4\"), PARA CIRCUITOS TERMINAIS, INSTALADO EM FORRO - FORNECIMENTO E INSTALAÇÃO. AF_12/2015","M",20,null,null,0,""]
["S",3,"S",0,1,5,1,0,0,0,0,"","Serviço","Serviço","-","SINAPI",91836,"ELETRODUTO FLEXÍVEL CORRUGADO, PVC, DN 32 MM (1\"), PARA CIRCUITOS TERMINAIS, INSTALADO EM FORRO - FORNECIMENTO E INSTALAÇÃO. AF_12/2015","M",104.85,null,null,0,""]
["S",3,"S",0,1,5,1,0,0,0,0,"","Serviço","Serviço","-","SINAPI",95801,"CONDULETE DE ALUMÍNIO, TIPO X, PARA ELETRODUTO DE AÇO GALVANIZADO DN 20 MM (3/4''), APARENTE - FORNECIMENTO E INSTALAÇÃO. AF_11/2016_P","UN",200,null,null,0,"Referência: AGETOP - 70929"]
[{"$f":"CHOOSE(1+LOG(1+2*(ORÇAMENTO.Nivel=\"Nível 1\")+4*(ORÇAMENTO.Nivel=\"Nível 2\")+8*(ORÇAMENTO.Nivel=\"Nível 3\")+16*(ORÇAMENTO.Nivel=\"Nível 4\")+32*(ORÇAMENTO.Nivel=\"Serviço\"),2),0,1,2,3,4,\"S\")","v":"S"},3,"S",0,1,5,1,0,{"$f":"IF(AND($C79<=4,$C79<>0),0,IF(AND($C79=\"S\",$W79>0),OFFSET(I79,-1,0)+1,OFFSET(I79,-1,0)))","v":0},0,0,"","Serviço","Serviço","-","SINAPI",91902,"CURVA 90 GRAUS PARA ELETRODUTO, PVC, ROSCÁVEL, DN 25 MM (3/4\"), PARA CIRCUITOS TERMINAIS, INSTALADA EM LAJE - FORNECIMENTO E INSTALAÇÃO. AF_12/2015","UN",89,null,null,0,"Referência: AGETOP - 71141"]
["S",3,"S",0,1,5,1,0,0,0,0,"","Serviço","Serviço","-","SINAPI",91905,"CURVA 90 GRAUS PARA ELETRODUTO, PVC, ROSCÁVEL, DN 32 MM (1\"), PARA CIRCUITOS TERMINAIS, INSTALADA EM LAJE - FORNECIMENTO E INSTALAÇÃO. AF_12/2015","UN",18,null,null,0,"Referência: AGETOP - 71142"]
["S",3,"S",0,1,5,1,0,0,0,0,"","Serviço","Serviço","-","AGETOP",71124,"CURVA 90 GRAUS AÇO ZINCADO DIÂMETRO 1.1/2\"","Un    ",13,null,null,0,""]
["S",3,"S",0,{"$f":"IF($C82=1,OFFSET(E82,-1,0)+1,OFFSET(E82,-1,0))","v":1},{"$f":"IF($C82=1,0,IF($C82=2,OFFSET(F82,-1,0)+1,OFFSET(F82,-1,0)))","v":5},{"$f":"IF(AND($C82<=2,$C82<>0),0,IF($C82=3,OFFSET(G82,-1,0)+1,OFFSET(G82,-1,0)))","v":1},{"$f":"IF(AND($C82<=3,$C82<>0),0,IF($C82=4,OFFSET(H82,-1,0)+1,OFFSET(H82,-1,0)))","v":0},0,0,0,"","Serviço","Serviço","-","AGETOP",71125,"CURVA 90 GRAUS AÇO ZINCADO DIÂMETRO 2\"","Un    ",9,null,null,0,""]
["S",3,"S",0,1,5,1,0,0,{"$f":"IF(OR($C83=\"S\",$C83=0),0,MATCH(0,OFFSET($D83,1,$C83,ROW($C$826)-ROW($C83)),0))","v":0},{"$f":"IF(OR($C83=\"S\",$C83=0),0,MATCH(OFFSET($D83,0,$C83)+1,OFFSET($D83,1,$C83,ROW($C$826)-ROW($C83)),0))","v":0},"","Serviço","Serviço","-","AGETOP",71126,"CURVA 90 GRAUS AÇO ZINCADO DIÂMETRO 2.1/2\"","Un    ",10,null,null,0,""]
["S",3,"S",0,1,5,1,0,0,0,0,"","Serviço","Serviço","-","AGETOP",71128,"CURVA 90 GRAUS AÇO ZINCADO DIÂMETRO 4\"","Un    ",10,null,null,0,""]
["S",3,"S",0,1,5,1,0,0,0,0,"","Serviço","Serviço","-","SINAPI",92870,"CAIXA RETANGULAR 4\" X 4\" ALTA (2,00 M DO PISO), METÁLICA, INSTALADA EM PAREDE - FORNECIMENTO E INSTALAÇÃO. AF_12/2015","UN",100,null,null,0,"Referência: AGETOP - 71151"]
["S",3,"S",0,1,5,1,0,0,0,0,"","Serviço","Serviço","-","SINAPI",93653,"DISJUNTOR MONOPOLAR TIPO DIN, CORRENTE NOMINAL DE 10A - FORNECIMENTO E INSTALAÇÃO. AF_04/2016","UN",32,null,null,0,""]
["S",3,"S",0,1,5,1,0,0,0,0,"","Serviço","Serviço","-","SINAPI",93654,"DISJUNTOR MONOPOLAR TIPO DIN, CORRENTE NOMINAL DE 16A - FORNECIMENTO E INSTALAÇÃO. AF_04/2016","UN",6,null,null,0,""]
["S",{"$f":"IF(OR(C88=\"s\",C88=0),OFFSET(B88,-1,0),C88)","v":3},{"$f":"IF(OFFSET(C88,-1,0)=\"L\",1,IF(OFFSET(C88,-1,0)=1,2,IF(OR(A88=\"s\",A88=0),\"S\",IF(AND(OFFSET(C88,-1,0)=2,A88=4),3,IF(AND(OR(OFFSET(C88,-1,0)=\"s\",OFFSET(C88,-1,0)=0),A88<>\"s\",A88>OFFSET(B88,-1,0)),OFFSET(B88,-1,0),A88)))))","v":"S"},{"$f":"IF(OR(C88=\"S\",C88=0),0,IF(ISERROR(K88),J88,SMALL(J88:K88,1)))","v":0},1,5,1,0,0,0,0,"","Serviço","Serviço","-","SINAPI",93656,"DISJUNTOR MONOPOLAR TIPO DIN, CORRENTE NOMINAL DE 25A - FORNECIMENTO E INSTALAÇÃO. AF_04/2016","UN",17,null,null,0,""]
["S",3,"S",0,1,5,1,0,0,0,0,"","Serviço","Serviço","-","SINAPI",93673,"DISJUNTOR TRIPOLAR TIPO DIN, CORRENTE NOMINAL DE 50A - FORNECIMENTO E INSTALAÇÃO. AF_04/2016","UN",2,null,null,0,"Referência: AGETOP - 71174"]
["S",3,"S",0,1,5,1,0,0,0,0,"","Serviço","Serviço","-","SINAPI",93670,"DISJUNTOR TRIPOLAR TIPO DIN, CORRENTE NOMINAL DE 25A - FORNECIMENTO E INSTALAÇÃO. AF_04/2016","UN",2,null,null,0,""]
["S",3,"S",0,1,5,1,0,0,0,0,"","Serviço","Serviço","-","SINAPI","74130/5","DISJUNTOR TERMOMAGNETICO TRIPOLAR PADRAO NEMA (AMERICANO) 60 A 100A 240V, FORNECIMENTO E INSTALACAO","UN",2,null,null,0,""]
["S",3,"S",0,1,5,1,0,0,0,0,"","Serviço","Serviço","-","AGETOP",71184,"DISPOSITIVO DE PROTEÇÃO CONTRA SURTOS (D.P.S.) 275V DE 8 A 40KA","Un    ",3,null,null,0,"Referência: AGETOP - 71184"]
["S",3,"S",0,1,5,1,0,0,0,0,"","Serviço","Serviço","-","SINAPI",93672,"DISJUNTOR TRIPOLAR TIPO DIN, CORRENTE NOMINAL DE 40A - FORNECIMENTO E INSTALAÇÃO. AF_04/2016","UN",2,null,null,0,""]
["S",3,"S",0,1,5,1,0,0,0,0,"","Serviço","Serviço","-","SINAPI","74130/10","DISJUNTOR TERMOMAGNETICO TRIPOLAR EM CAIXA MOLDADA 175 A 225A 240V, FORNECIMENTO E INSTALACAO","UN",2,null,null,0,""]
["S",3,"S",0,1,5,1,0,0,0,0,"","Serviço","Serviço","-","SINAPI",91926,"CABO DE COBRE FLEXÍVEL ISOLADO, 2,5 MM², ANTI-CHAMA 450/750 V, PARA CIRCUITOS TERMINAIS - FORNECIMENTO E INSTALAÇÃO. AF_12/2015","M",2263,null,null,0,""]
["S",3,"S",0,1,5,1,0,0,0,0,"","Serviço","Serviço","-","SINAPI",91928,"CABO DE COBRE FLEXÍVEL ISOLADO, 4 MM², ANTI-CHAMA 450/750 V, PARA CIRCUITOS TERMINAIS - FORNECIMENTO E INSTALAÇÃO. AF_12/2015","M",1093,null,null,0,""]
["S",3,"S",0,1,5,1,0,0,0,0,"","Serviço","Serviço","-","SINAPI",91930,"CABO DE COBRE FLEXÍVEL ISOLADO, 6 MM², ANTI-CHAMA 450/750 V, PARA CIRCUITOS TERMINAIS - FORNECIMENTO E INSTALAÇÃO. AF_12/2015","M",1022.02,null,null,0,""]
["S",3,"S",0,1,5,1,0,0,0,0,"","Serviço","Serviço","-","SINAPI",92979,"CABO DE COBRE FLEXÍVEL ISOLADO, 10 MM², ANTI-CHAMA 450/750 V, PARA DISTRIBUIÇÃO - FORNECIMENTO E INSTALAÇÃO. AF_12/2015","M",201.7,null,null,0,""]
["S",3,"S",0,1,5,1,0,0,0,0,"","Serviço","Serviço","-","SINAPI",92983,"CABO DE COBRE FLEXÍVEL ISOLADO, 25 MM², ANTI-CHAMA 450/750 V, PARA DISTRIBUIÇÃO - FORNECIMENTO E INSTALAÇÃO. AF_12/2015","M",160.80000000000001,null,null,0,""]
["S",3,"S",0,1,5,1,0,0,0,0,"","Serviço","Serviço","-","SINAPI",92990,"CABO DE COBRE FLEXÍVEL ISOLADO, 70 MM², ANTI-CHAMA 0,6/1,0 KV, PARA DISTRIBUIÇÃO - FORNECIMENTO E INSTALAÇÃO. AF_12/2015","M",92,null,null,0,""]
["S",3,"S",0,1,5,1,0,0,0,0,"","Serviço","Serviço","-","SINAPI",91867,"ELETRODUTO RÍGIDO ROSCÁVEL, PVC, DN 25 MM (3/4\"), PARA CIRCUITOS TERMINAIS, INSTALADO EM LAJE - FORNECIMENTO E INSTALAÇÃO. AF_12/2015","M",340,null,null,0,""]
["S",3,"S",0,1,5,1,0,0,0,0,"","Serviço","Serviço","-","SINAPI",91868,"ELETRODUTO RÍGIDO ROSCÁVEL, PVC, DN 32 MM (1\"), PARA CIRCUITOS TERMINAIS, INSTALADO EM LAJE - FORNECIMENTO E INSTALAÇÃO. AF_12/2015","M",115,null,null,0,""]
["S",3,"S",0,1,5,1,0,0,0,0,"","Serviço","Serviço","-","SINAPI",93009,"ELETRODUTO RÍGIDO ROSCÁVEL, PVC, DN 60 MM (2\") - FORNECIMENTO E INSTALAÇÃO. AF_12/2015","M",6,null,null,0,""]
["S",3,"S",0,1,5,1,0,0,0,0,"","Serviço","Serviço","-","SINAPI",93012,"ELETRODUTO RÍGIDO ROSCÁVEL, PVC, DN 110 MM (4\") - FORNECIMENTO E INSTALAÇÃO. AF_12/2015","M",5,null,null,0,""]
["S",3,"S",0,1,5,1,0,0,0,0,"","Serviço","Serviço","-","SINAPI","73798/1","DUTO ESPIRAL FLEXIVEL SINGELO PEAD D=50MM(2\") REVESTIDO COM PVC COM FIO GUIA DE ACO GALVANIZADO, LANCADO DIRETO NO SOLO, INCL CONEXOES","M",181.05,null,null,0,"Referência: AGETOP - 71197"]
["S",3,"S",0,1,5,1,0,0,0,0,"","Serviço","Serviço","-","AGETOP",71198,"ELETRODUTO PVC FLEXÍVEL - MANGUEIRA CORRUGADA REFORÇADA - DIAM. 60MM","M     ",40,null,null,0,""]
["S",3,"S",0,1,5,1,0,0,0,0,"","Serviço","Serviço","-","AGETOP",71199,"ELETRODUTO PVC FLEXÍVEL - MANGUEIRA CORRUGADA REFORÇADA - DIAM. 75MM","M     ",20,null,null,0,""]
["S",3,"S",0,1,5,1,0,0,0,0,"","Serviço","Serviço","-","SINAPI",91953,"INTERRUPTOR SIMPLES (1 MÓDULO), 10A/250V, INCLUINDO SUPORTE E PLACA - FORNECIMENTO E INSTALAÇÃO. AF_12/2015","UN",103,null,null,0,"Referência: AGETOP - 71440"]
["S",3,"S",0,1,5,1,0,0,0,0,"","Serviço","Serviço","-","SINAPI",91959,"INTERRUPTOR SIMPLES (2 MÓDULOS), 10A/250V, INCLUINDO SUPORTE E PLACA - FORNECIMENTO E INSTALAÇÃO. AF_12/2015","UN",21,null,null,0,"Referência: AGETOP - 71441"]
["S",3,"S",0,1,5,1,0,0,0,0,"","Serviço","Serviço","-","SINAPI",91967,"INTERRUPTOR SIMPLES (3 MÓDULOS), 10A/250V, INCLUINDO SUPORTE E PLACA - FORNECIMENTO E INSTALAÇÃO. AF_12/2015","UN",6,null,null,0,""]
["S",3,"S",0,1,5,1,0,0,0,0,"","Serviço","Serviço","-","SINAPI","74246/1","REFLETOR RETANGULAR FECHADO COM LAMPADA VAPOR METALICO 400 W","UN",20,null,null,0,"Referência: AGETOP - 71684"]
["S",3,"S",0,1,5,1,0,0,0,0,"","Serviço","Serviço","-","SINAPI",97889,"CAIXA ENTERRADA ELÉTRICA RETANGULAR, EM ALVENARIA COM TIJOLOS CERÂMICOS MACIÇOS, FUNDO COM BRITA, DIMENSÕES INTERNAS: 0,8X0,8X0,6 M. AF_05/2018","UN",2,null,null,0,""]
["S",3,"S",0,1,5,1,0,0,0,0,"","Serviço","Serviço","-","SINAPI",93013,"LUVA PARA ELETRODUTO, PVC, ROSCÁVEL, DN 50 MM (1 1/2\") - FORNECIMENTO E INSTALAÇÃO. AF_12/2015","UN",7,null,null,0,"Referência: AGETOP - 71744"]
["S",3,"S",0,1,5,1,0,0,0,0,"","Serviço","Serviço","-","SINAPI",93014,"LUVA PARA ELETRODUTO, PVC, ROSCÁVEL, DN 60 MM (2\") - FORNECIMENTO E INSTALAÇÃO. AF_12/2015","UN",10,null,null,0,"Referência: AGETOP - 71745"]
["S",3,"S",0,1,5,1,0,0,0,0,"","Serviço","Serviço","-","SINAPI",93015,"LUVA PARA ELETRODUTO, PVC, ROSCÁVEL, DN 75 MM (2 1/2\") - FORNECIMENTO E INSTALAÇÃO. AF_12/2015","UN",20,null,null,0,""]
["S",3,"S",0,1,5,1,0,0,0,0,"","Serviço","Serviço","-","SINAPI",93017,"LUVA PARA ELETRODUTO, PVC, ROSCÁVEL, DN 110 MM (4\") - FORNECIMENTO E INSTALAÇÃO. AF_12/2015","UN",2,null,null,0,""]
["S",3,"S",0,1,5,1,0,0,0,0,"","Serviço","Serviço","-","SINAPI",92004,"TOMADA MÉDIA DE EMBUTIR (2 MÓDULOS), 2P+T 10 A, INCLUINDO SUPORTE E PLACA - FORNECIMENTO E INSTALAÇÃO. AF_12/2015","UN",2,null,null,0,""]
["S",3,"S",0,1,5,1,0,0,0,0,"","Serviço","Serviço","-","SINAPI","74131/5","QUADRO DE DISTRIBUICAO DE ENERGIA DE EMBUTIR, EM CHAPA METALICA, PARA 24 DISJUNTORES TERMOMAGNETICOS MONOPOLARES, COM BARRAMENTO TRIFASICO E NEUTRO, FORNECIMENTO E INSTALACAO","UN",1,null,null,0,""]
["S",3,"S",0,1,5,1,0,0,0,0,"","Serviço","Serviço","-","SINAPI",97585,"LUMINÁRIA TIPO CALHA, DE SOBREPOR, COM 2 LÂMPADAS TUBULARES DE 18 W - FORNECIMENTO E INSTALAÇÃO. AF_11/2017","UN",185,null,null,0,""]
["S",3,"S",0,1,5,1,0,0,0,0,"","Serviço","Serviço","-","SINAPI",97605,"LUMINÁRIA ARANDELA TIPO MEIA-LUA, PARA 1 LÂMPADA LED - FORNECIMENTO E INSTALAÇÃO. AF_11/2017","UN",9,null,null,0,""]
["S",3,"S",0,1,5,1,0,0,0,0,"","Serviço","Serviço","-","SINAPI",97610,"LÂMPADA COMPACTA DE LED 10 W, BASE E27 - FORNECIMENTO E INSTALAÇÃO. AF_11/2017","UN",370,null,null,0,""]
["S",3,"S",0,1,5,1,0,0,0,0,"","Serviço","Serviço","-","SINAPI","74131/4","QUADRO DE DISTRIBUICAO DE ENERGIA DE EMBUTIR, EM CHAPA METALICA, PARA 18 DISJUNTORES TERMOMAGNETICOS MONOPOLARES, COM BARRAMENTO TRIFASICO E NEUTRO, FORNECIMENTO E INSTALACAO","UN",5,null,null,0,""]
["S",3,"S",0,1,5,1,0,0,0,0,"","Serviço","Serviço","-","SINAPI","73831/8","LAMPADA DE VAPOR DE SODIO DE 250WX220V - FORNECIMENTO E INSTALACAO","UN",20,null,null,0,""]
["S",3,"S",0,1,5,1,0,0,0,0,"","Serviço","Serviço","-","AGETOP",71861,"PARAFUSO P/BUCHA S-6","Un    ",200,null,null,0,""]
["S",3,"S",0,1,5,1,0,0,0,0,"","Serviço","Serviço","-","AGETOP",70647,"CAIXA DE PASSAGEM METÁLICA DE EMBUTIR 30X30X12 CM","Un    ",5,null,null,0,""]
["S",3,"S",0,1,5,1,0,0,0,0,"","Serviço","Serviço","-","AGETOP",70391,"BUCHA DE NYLON S-6","Un    ",5,null,null,0,""]
["S",3,"S",0,1,5,1,0,0,0,0,"","Serviço","Serviço","-","SINAPI",6171,"TAMPA DE CONCRETO ARMADO 60X60X5CM PARA CAIXA","UN",2,null,null,0,"Referência: AGETOP - 72425"]
["S",3,"S",0,1,5,1,0,0,0,0,"","Serviço","Serviço","-","SINAPI",91996,"TOMADA MÉDIA DE EMBUTIR (1 MÓDULO), 2P+T 10 A, INCLUINDO SUPORTE E PLACA - FORNECIMENTO E INSTALAÇÃO. AF_12/2015","UN",71,null,null,0,"Referência: AGETOP - 72578"]
["S",3,"S",0,1,5,1,0,0,0,0,"","Serviço","Serviço","-","SINAPI",92000,"TOMADA BAIXA DE EMBUTIR (1 MÓDULO), 2P+T 10 A, INCLUINDO SUPORTE E PLACA - FORNECIMENTO E INSTALAÇÃO. AF_12/2015","UN",39,null,null,0,"Referência: AGETOP - 72578"]
["S",3,"S",0,1,5,1,0,0,0,0,"","Serviço","Serviço","-","SINAPI",91993,"TOMADA ALTA DE EMBUTIR (1 MÓDULO), 2P+T 20 A, INCLUINDO SUPORTE E PLACA - FORNECIMENTO E INSTALAÇÃO. AF_12/2015","UN",22,null,null,0,"Referência: AGETOP - 72585"]
[3,3,3,12,1,5,2,0,0,52,12,"","Nível 3","Nível 3","-","SINAPI",null,"ELÉTRICA","-",null,null,null,0,""]
["S",3,"S",0,1,5,2,0,0,0,0,"","Serviço","Serviço","-","AGETOP",70354,"BRACADEIRA METALICA TIPO \"U\" DIAM. 1.1/2\"","Un    ",27,null,null,0,""]
["S",3,"S",0,1,5,2,0,0,0,0,"","Serviço","Serviço","-","SINAPI","74130/5","DISJUNTOR TERMOMAGNETICO TRIPOLAR PADRAO NEMA (AMERICANO) 60 A 100A 240V, FORNECIMENTO E INSTALACAO","UN",1,null,null,0,""]
["S",3,"S",0,1,5,2,0,0,0,0,"","Serviço","Serviço","-","SINAPI",92981,"CABO DE COBRE FLEXÍVEL ISOLADO, 16 MM², ANTI-CHAMA 450/750 V, PARA DISTRIBUIÇÃO - FORNECIMENTO E INSTALAÇÃO. AF_12/2015","M",400,null,null,0,""]
["S",3,"S",0,1,5,2,0,0,0,0,"","Serviço","Serviço","-","SINAPI",93008,"ELETRODUTO RÍGIDO ROSCÁVEL, PVC, DN 50 MM (1 1/2\") - FORNECIMENTO E INSTALAÇÃO. AF_12/2015","M",80,null,null,0,""]
["S",3,"S",0,1,5,2,0,0,0,0,"","Serviço","Serviço","-","SINAPI",93013,"LUVA PARA ELETRODUTO, PVC, ROSCÁVEL, DN 50 MM (1 1/2\") - FORNECIMENTO E INSTALAÇÃO. AF_12/2015","UN",27,null,null,0,"Referência: AGETOP - 71744"]
["S",3,"S",0,1,5,2,0,0,0,0,"","Serviço","Serviço","-","AGETOP",70647,"CAIXA DE PASSAGEM METÁLICA DE EMBUTIR 30X30X12 CM","Un    ",10,null,null,0,""]
["S",3,"S",0,1,5,2,0,0,0,0,"","Serviço","Serviço","-","SINAPI",97889,"CAIXA ENTERRADA ELÉTRICA RETANGULAR, EM ALVENARIA COM TIJOLOS CERÂMICOS MACIÇOS, FUNDO COM BRITA, DIMENSÕES INTERNAS: 0,8X0,8X0,6 M. AF_05/2018","UN",3,null,null,0,""]
["S",3,"S",0,1,5,2,0,0,0,0,"","Serviço","Serviço","-","SINAPI",6171,"TAMPA DE CONCRETO ARMADO 60X60X5CM PARA CAIXA","UN",3,null,null,0,""]
["S",3,"S",0,1,5,2,0,0,0,0,"","Serviço","Serviço","-","SINAPI",92870,"CAIXA RETANGULAR 4\" X 4\" ALTA (2,00 M DO PISO), METÁLICA, INSTALADA EM PAREDE - FORNECIMENTO E INSTALAÇÃO. AF_12/2015","UN",2,null,null,0,""]
["S",3,"S",0,1,5,2,0,0,0,0,"","Serviço","Serviço","-","AGETOP",71861,"PARAFUSO P/BUCHA S-6","Un    ",100,null,null,0,""]
["S",3,"S",0,1,5,2,0,0,0,0,"","Serviço","Serviço","-","AGETOP",70391,"BUCHA DE NYLON S-6","Un    ",100,null,null,0,""]
[3,3,3,40,1,5,3,0,{"$f":"IF(AND($C143<=4,$C143<>0),0,IF(AND($C143=\"S\",$W143>0),OFFSET(I143,-1,0)+1,OFFSET(I143,-1,0)))","v":0},40,140,"","Nível 3","Nível 3","-","SINAPI",null,"SUBESTAÇÃO","-",null,null,null,0,""]
["S",3,"S",0,1,5,3,0,0,0,0,"","Serviço","Serviço","-","AGETOP",70386,"BRAÇO C AÇO GALVANIZADO , CONFORME NTD-17","un    ",1,null,null,0,""]
["S",3,"S",0,1,5,3,0,0,0,0,"","Serviço","Serviço","-","SINAPI","73767/2","ALCA PRE-FORMADA DISTRIBUIÇÃO EM  ACO RECOBERTO COM ALUMINIO PARA CABO 25MM2, ENCAPADO. FORNECIMENTO E INSTALAÇÃO.","UN",1,null,null,0,""]
["S",3,"S",0,{"$f":"IF($C146=1,OFFSET(E146,-1,0)+1,OFFSET(E146,-1,0))","v":1},{"$f":"IF($C146=1,0,IF($C146=2,OFFSET(F146,-1,0)+1,OFFSET(F146,-1,0)))","v":5},{"$f":"IF(AND($C146<=2,$C146<>0),0,IF($C146=3,OFFSET(G146,-1,0)+1,OFFSET(G146,-1,0)))","v":3},{"$f":"IF(AND($C146<=3,$C146<>0),0,IF($C146=4,OFFSET(H146,-1,0)+1,OFFSET(H146,-1,0)))","v":0},0,0,0,"","Serviço","Serviço","-","SINAPI","73767/1","GRAMPO PARALELO EM ALUMINIO FUNDIDO OU ESTRUDADO DE 2 PARAFUSOS, PARA CABO DE 6 A 50 MM2, PASTA ANTIOXIDANTE. FORNEC E INSTALAÇÃO.","UN",3,null,null,0,""]
["S",3,"S",0,1,5,3,0,0,{"$f":"IF(OR($C147=\"S\",$C147=0),0,MATCH(0,OFFSET($D147,1,$C147,ROW($C$826)-ROW($C147)),0))","v":0},{"$f":"IF(OR($C147=\"S\",$C147=0),0,MATCH(OFFSET($D147,0,$C147)+1,OFFSET($D147,1,$C147,ROW($C$826)-ROW($C147)),0))","v":0},"","Serviço","Serviço","-","SINAPI",83377,"CONECTOR DE PARAFUSO FENDIDO EM LIGA DE COBRE COM SEPARADOR DE CABOS PARA CABO 50 MM2 - FORNECIMENTO E INSTALACAO","UN",6,null,null,0,""]
["S",3,"S",0,1,5,3,0,0,0,0,"","Serviço","Serviço","-","SINAPI",72263,"TERMINAL OU CONECTOR DE PRESSAO - PARA CABO 50MM2 - FORNECIMENTO E INSTALACAO","UN",1,null,null,0,""]
["S",3,"S",0,1,5,3,0,0,0,0,"","Serviço","Serviço","-","AGETOP",71833,"PARA RAIOS DISTRIBUIDOR POLIMÉRICO ÓXIDO DE ZINCO S/CENTELHADOR C/ DESLIGAMENTO AUTOMÁTICO 15KV,10KA","Un    ",3,null,null,0,""]
["S",3,"S",0,1,5,3,0,0,0,0,"","Serviço","Serviço","-","SINAPI",88544,"ARMACAO SECUNDARIA OU REX COMPLETA PARA DUAS LINHAS-FORNECIMENTO E INSTALACAO.","UN",1,null,null,0,""]
["S",3,"S",0,1,5,3,0,0,0,0,"","Serviço","Serviço","-","COMPOSIÇÃO","COMP 046_SEE","CAPUZ PARA PROTEÇÃO DOS PARA RAIOS","UN ",3,null,null,0,""]
["S",{"$f":"IF(OR(C152=\"s\",C152=0),OFFSET(B152,-1,0),C152)","v":3},{"$f":"IF(OFFSET(C152,-1,0)=\"L\",1,IF(OFFSET(C152,-1,0)=1,2,IF(OR(A152=\"s\",A152=0),\"S\",IF(AND(OFFSET(C152,-1,0)=2,A152=4),3,IF(AND(OR(OFFSET(C152,-1,0)=\"s\",OFFSET(C152,-1,0)=0),A152<>\"s\",A152>OFFSET(B152,-1,0)),OFFSET(B152,-1,0),A152)))))","v":"S"},{"$f":"IF(OR(C152=\"S\",C152=0),0,IF(ISERROR(K152),J152,SMALL(J152:K152,1)))","v":0},1,5,3,0,0,0,0,"","Serviço","Serviço","-","COMPOSIÇÃO","COMP 047_SEE","CAPUZ DE PROTEÇÃO PARA BUCHA DE TRANSFORMADOR","UN ",3,null,null,0,""]
["S",3,"S",0,1,5,3,0,0,0,0,"","Serviço","Serviço","-","COMPOSIÇÃO","COMP 048_SEE","HASTE ROSQUEADA \"TIRANTE\" 3/8\"","M",0.5,null,null,0,""]
["S",3,"S",0,1,5,3,0,0,0,0,"","Serviço","Serviço","-","COMPOSIÇÃO","COMP 049_SEE","PORCA SEXTAVADA 3/8\"","UN ",8,null,null,0,""]
["S",3,"S",0,1,5,3,0,0,0,0,"","Serviço","Serviço","-","SINAPI","73781/2","ISOLADOR DE PINO TP HI-POT CILINDRICO CLASSE 15KV. FORNECIMENTO E INSTALACAO.","UN",3,null,null,0,""]
["S",3,"S",0,1,5,3,0,0,0,0,"","Serviço","Serviço","-","SINAPI","73781/3","ISOLADOR DE SUSPENSAO (DISCO) TP CAVILHA CLASSE 15KV - 6''. FORNECIMENTO E INSTALACAO.","UN",1,null,null,0,""]
["S",3,"S",0,1,5,3,0,0,0,0,"","Serviço","Serviço","-","AGETOP",70252,"ARRUELA LISA D=5/16\"","Un    ",8,null,null,0,""]
["S",3,"S",0,1,5,3,0,0,0,0,"","Serviço","Serviço","-","AGETOP",70695,"CAIXA METÁLICA PARA PROTEÇÃO GERAL 580X500X216MM ATÉ 175A","Un    ",1,null,null,0,""]
["S",3,"S",0,1,5,3,0,0,0,0,"","Serviço","Serviço","-","AGETOP",70695,"CAIXA METÁLICA PARA PROTEÇÃO GERAL 580X500X216MM ATÉ 175A","Un    ",1,null,null,0,""]
["S",3,"S",0,1,5,3,0,0,0,0,"","Serviço","Serviço","-","AGETOP",70725,"CAIXA METÁLICA PARA T.C. 580X500X216MM - ATÉ 175A","Un    ",1,null,null,0,""]
["S",3,"S",0,1,5,3,0,0,0,0,"","Serviço","Serviço","-","SINAPI",93205,"CINTA DE AMARRAÇÃO DE ALVENARIA MOLDADA IN LOCO COM UTILIZAÇÃO DE BLOCOS CANALETA. AF_03/2016","M",6,null,null,0,""]
["S",3,"S",0,1,5,3,0,0,0,0,"","Serviço","Serviço","-","AGETOP",71268,"ELO FUSÍVEL 6 K","Un    ",3,null,null,0,""]
["S",3,"S",0,1,5,3,0,0,0,0,"","Serviço","Serviço","-","AGETOP",71186,"DISPOSITIVO DE PROTEÇÃO CONTRA SURTOS (D.P.S.) 275V DE 90KA","Un    ",3,null,null,0,""]
["S",3,"S",0,1,5,3,0,0,0,0,"","Serviço","Serviço","-","AGETOP",71320,"FITA DE AUTO FUSAO, ROLO DE 2,00 M","Un    ",5,null,null,0,""]
["S",3,"S",0,1,5,3,0,0,0,0,"","Serviço","Serviço","-","AGETOP",70771,"CANTONEIRA AUXILIAR PARA BRAÇO TIPO C","un    ",3,null,null,0,""]
["S",3,"S",0,1,5,3,0,0,0,0,"","Serviço","Serviço","-","SINAPI",93022,"CURVA 90 GRAUS PARA ELETRODUTO, PVC, ROSCÁVEL, DN 75 MM (2 1/2\") - FORNECIMENTO E INSTALAÇÃO. AF_12/2015","UN",2,null,null,0,""]
["S",3,"S",0,1,5,3,0,0,0,0,"","Serviço","Serviço","-","AGETOP",72329,"SAPATILHA DE AÇO GALVANIZADO PARA POSTE COM TRANSFORMADOR","un    ",3,null,null,0,""]
["S",3,"S",0,1,5,3,0,0,0,0,"","Serviço","Serviço","-","AGETOP",71795,"OLHAL PARA PARAFUSO","un    ",3,null,null,0,""]
["S",3,"S",0,1,5,3,0,0,0,0,"","Serviço","Serviço","-","AGETOP",71761,"MURETA MEDIÇÃO ALVEN. 1 1/2 V.(35CM) REBOC.C/PINTURA ACRÍL. E LAJE CONC. 20MPA MALHA 8.0MM CADA 10CM REVEST.C/ARGAMASSA 1:3 C/ IMPERMEABILIZANTE","m2    ",1,null,null,0,""]
["S",3,"S",0,1,5,3,0,0,0,0,"","Serviço","Serviço","-","AGETOP",71776,"NIPLE METALICO Fo.Zo. DIAMETRO 2.1/2\"","Un    ",2,null,null,0,""]
["S",3,"S",0,1,5,3,0,0,0,0,"","Serviço","Serviço","-","AGETOP",71791,"NIPLE DUPLO FERRO GALVANIZADO 2\"","Un    ",1,null,null,0,""]
["S",3,"S",0,1,5,3,0,0,0,0,"","Serviço","Serviço","-","SINAPI",73624,"SUPORTE PARA TRANSFORMADOR EM POSTE DE CONCRETO CIRCULAR","UN",2,null,null,0,""]
["S",3,"S",0,1,5,3,0,0,0,0,"","Serviço","Serviço","-","AGETOP",72060,"POSTE DE CONCRETO SC 11/400 - SEM FUNDAÇÃO/CONCRETO","Un    ",1,null,null,0,""]
["S",3,"S",0,1,5,3,0,0,0,0,"","Serviço","Serviço","-","AGETOP",72000,"POSTE - ENGASTAMENTO SIMPLES PARA POSTE DE CONCRETO SEÇÃO CIRCULAR","m3    ",0.2,null,null,0,""]
["S",3,"S",0,1,5,3,0,0,0,0,"","Serviço","Serviço","-","SINAPI",72263,"TERMINAL OU CONECTOR DE PRESSAO - PARA CABO 50MM2 - FORNECIMENTO E INSTALACAO","UN",3,null,null,0,""]
["S",3,"S",0,1,5,3,0,0,0,0,"","Serviço","Serviço","-","AGETOP",72535,"TERMINAL DE PRESSAO 70 MMM2","Un    ",2,null,null,0,""]
["S",3,"S",0,1,5,3,0,0,0,0,"","Serviço","Serviço","-","AGETOP",72528,"TERMINAL DE PRESSAO 35 MM2","Un    ",5,null,null,0,""]
["S",3,"S",0,1,5,3,0,0,0,0,"","Serviço","Serviço","-","AGETOP",72518,"TERMINAL DE PRESSAO 10 MM2","Un    ",1,null,null,0,""]
["S",3,"S",0,1,5,3,0,0,0,0,"","Serviço","Serviço","-","AGETOP",72550,"TERMINAL DE PRESSAO 150 MM2","Un    ",10,null,null,0,""]
["S",3,"S",0,1,5,3,0,0,0,0,"","Serviço","Serviço","-","SINAPI","73857/2","TRANSFORMADOR DISTRIBUICAO  112,5KVA TRIFASICO 60HZ CLASSE 15KV IMERSO EM ÓLEO MINERAL FORNECIMENTO E INSTALACAO","UN",1,null,null,0,""]
["S",3,"S",0,1,5,3,0,0,0,0,"","Serviço","Serviço","-","AGETOP",72630,"TRILHO OU SUPORTE P/BORNE TERMINAL","M     ",0.2,null,null,0,""]
["S",3,"S",0,1,5,3,0,0,0,0,"","Serviço","Serviço","-","AGETOP",72080,"POSTE/TRAFO - CAMINHÃO MUNCK 12 TON. (MÍNIMO 4H/DIA)","H     ",8,null,null,0,""]
[{"$f":"CHOOSE(1+LOG(1+2*(ORÇAMENTO.Nivel=\"Nível 1\")+4*(ORÇAMENTO.Nivel=\"Nível 2\")+8*(ORÇAMENTO.Nivel=\"Nível 3\")+16*(ORÇAMENTO.Nivel=\"Nível 4\")+32*(ORÇAMENTO.Nivel=\"Serviço\"),2),0,1,2,3,4,\"S\")","v":2},{"$f":"IF(OR(C183=\"s\",C183=0),OFFSET(B183,-1,0),C183)","v":2},{"$f":"IF(OFFSET(C183,-1,0)=\"L\",1,IF(OFFSET(C183,-1,0)=1,2,IF(OR(A183=\"s\",A183=0),\"S\",IF(AND(OFFSET(C183,-1,0)=2,A183=4),3,IF(AND(OR(OFFSET(C183,-1,0)=\"s\",OFFSET(C183,-1,0)=0),A183<>\"s\",A183>OFFSET(B183,-1,0)),OFFSET(B183,-1,0),A183)))))","v":2},{"$f":"IF(OR(C183=\"S\",C183=0),0,IF(ISERROR(K183),J183,SMALL(J183:K183,1)))","v":110},{"$f":"IF($C183=1,OFFSET(E183,-1,0)+1,OFFSET(E183,-1,0))","v":1},{"$f":"IF($C183=1,0,IF($C183=2,OFFSET(F183,-1,0)+1,OFFSET(F183,-1,0)))","v":6},{"$f":"IF(AND($C183<=2,$C183<>0),0,IF($C183=3,OFFSET(G183,-1,0)+1,OFFSET(G183,-1,0)))","v":0},{"$f":"IF(AND($C183<=3,$C183<>0),0,IF($C183=4,OFFSET(H183,-1,0)+1,OFFSET(H183,-1,0)))","v":0},{"$f":"IF(AND($C183<=4,$C183<>0),0,IF(AND($C183=\"S\",$W183>0),OFFSET(I183,-1,0)+1,OFFSET(I183,-1,0)))","v":0},210,110,"","Nível 2","Nível 2","-",null,null,"INSTALAÇÕES HIDROSSANITÁRIAS","-",null,null,null,0,""]
[3,3,3,28,1,6,1,0,0,109,28,"","Nível 3","Nível 3","-",null,null,"PEÇAS E ACESSÓRIOS","-",null,null,null,0,""]
["S",3,"S",0,1,6,1,0,0,0,0,"","Serviço","Serviço","-","AGETOP",20137,"RECOLOCAÇÃO DE BACIA SANITÁRIA COM  TRANSP. ATÉ CB E CARGA","Un    ",6,null,null,0,""]
["S",3,"S",0,1,6,1,0,0,0,0,"","Serviço","Serviço","-","AGETOP",20146,"RECOLOCAÇÃO DE MICTÓRIO COM TRANSP. ATÉ CB E CARGA","Un    ",2,null,null,0,""]
["S",3,"S",0,1,6,1,0,0,0,0,"","Serviço","Serviço","-","AGETOP",80502,"VASO SANITARIO","Un    ",6,null,null,0,""]
["S",3,"S",0,1,6,1,0,0,0,0,"","Serviço","Serviço","-","AGETOP",80510,"ANEL DE VEDAÇÃO PARA VASO SANITÁRIO","Un    ",12,null,null,0,""]
["S",3,"S",0,1,6,1,0,0,0,0,"","Serviço","Serviço","-","AGETOP",80513,"TUBO PARA VÁLVULA DE DESCARGA ( CURTO 1.1/4\" )","Un    ",12,null,null,0,""]
["S",3,"S",0,1,6,1,0,0,0,0,"","Serviço","Serviço","-","AGETOP",80514,"TUBO DE LIGACAO PVC CROMADO 1.1/2\" / ESPUDE  - (ENTRADA)","Un    ",12,null,null,0,""]
["S",3,"S",0,1,6,1,0,0,0,0,"","Serviço","Serviço","-","AGETOP",80517,"VÁLVULA DE DESCARGA DUPLO ACIONAMENTO COM ACABAMENTO CROMADO ANTIVANDALISMO","Un    ",12,null,null,0,""]
["S",3,"S",0,1,6,1,0,0,0,0,"","Serviço","Serviço","-","AGETOP",80543,"LAVATÓRIO DE CANTO SEM COLUNA ","un    ",2,null,null,0,""]
["S",3,"S",0,1,6,1,0,0,0,0,"","Serviço","Serviço","-","AGETOP",80811,"TORNEIRA DE JARDIM COM BICO PARA MANGUEIRA DIÂMETRO DE 1/2\" E 3/4\"","Un    ",2,null,null,0,""]
["S",3,"S",0,1,6,1,0,0,0,0,"","Serviço","Serviço","-","AGETOP",80621,"VÁLVULA DE DESCARGA PARA MICTÓRIO DIÂMETRO 1/2\" FECHAMENTO AUTOMÁTICO TEMPORIZADO","Un    ",9,null,null,0,""]
["S",3,"S",0,1,6,1,0,0,0,0,"","Serviço","Serviço","-","AGETOP",80520,"CONJUNTO DE FIXACAO P/VASO SANITARIO (PAR)","CJ    ",12,null,null,0,"Referência: AGETOP - 80520"]
["S",3,"S",0,1,6,1,0,0,0,0,"","Serviço","Serviço","-","AGETOP",80526,"ASSENTO EM POLIPROPILENO COM SISTEMA DE FECHAMENTO SUAVE PARA VASO SANITÁRIO","Un    ",12,null,null,0,"Referência: AGETOP - 80526"]
["S",3,"S",0,1,6,1,0,0,0,0,"","Serviço","Serviço","-","SINAPI",95544,"PAPELEIRA DE PAREDE EM METAL CROMADO SEM TAMPA, INCLUSO FIXAÇÃO. AF_10/2016","UN",12,null,null,0,""]
["S",3,"S",0,1,6,1,0,0,0,0,"","Serviço","Serviço","-","AGETOP",80550,"FIXACAO P/LAVATORIO (PAR)","PAR   ",2,null,null,0,"Referência: AGETOP - 80550"]
["S",3,"S",0,1,6,1,0,0,0,0,"","Serviço","Serviço","-","AGETOP",80555,"LIGAÇÃO FLEXÍVEL METÁLICA DIAM.1/2\"(ENGATE)","Un    ",null,null,null,0,"Referência: AGETOP - 80555"]
["S",3,"S",0,1,6,1,0,0,0,0,"","Serviço","Serviço","-","AGETOP",80556,"LIGAÇÃO FLEXÍVEL PVC DIAM.1/2\" (ENGATE)","Un    ",10,null,null,0,"Referência: AGETOP - 80556"]
["S",3,"S",0,1,6,1,0,0,0,0,"","Serviço","Serviço","-","SINAPI",86883,"SIFÃO DO TIPO FLEXÍVEL EM PVC 1\u0094 X 1.1/2\u0094 - FORNECIMENTO E INSTALAÇÃO. AF_12/2013","UN",10,null,null,0,""]
["S",3,"S",0,1,6,1,0,0,0,0,"","Serviço","Serviço","-","SINAPI",86915,"TORNEIRA CROMADA DE MESA, 1/2\" OU 3/4\", PARA LAVATÓRIO, PADRÃO MÉDIO - FORNECIMENTO E INSTALAÇÃO. AF_12/2013","UN",10,null,null,0,"Referência: AGETOP - 80570"]
["S",3,"S",0,1,6,1,0,0,0,0,"","Serviço","Serviço","-","SINAPI",86877,"VÁLVULA EM METAL CROMADO 1.1/2\" X 1.1/2\" PARA TANQUE OU LAVATÓRIO, COM OU SEM LADRÃO - FORNECIMENTO E INSTALAÇÃO. AF_12/2013","UN",10,null,null,0,"Referência: AGETOP - 80580"]
["S",3,"S",0,1,6,1,0,0,{"$f":"IF(OR($C204=\"S\",$C204=0),0,MATCH(0,OFFSET($D204,1,$C204,ROW($C$826)-ROW($C204)),0))","v":0},{"$f":"IF(OR($C204=\"S\",$C204=0),0,MATCH(OFFSET($D204,0,$C204)+1,OFFSET($D204,1,$C204,ROW($C$826)-ROW($C204)),0))","v":0},"","Serviço","Serviço","-","AGETOP",80601,"MICTORIO DE LOUCA C/SIFAO INTEGRADO","Un    ",1,null,null,0,""]
["S",3,"S",0,1,6,1,0,0,0,0,"","Serviço","Serviço","-","AGETOP",80610,"KIT FERR.P/MICT.LOUCA (ESPUDE,CONEXÃO ENTR.PARAFUSOS)","Un    ",2,null,null,0,"Referência: AGETOP - 80610"]
["S",3,"S",0,1,6,1,0,0,0,0,"","Serviço","Serviço","-","AGETOP",80845,"CAIXA DE ALVENARIA 20x20x25 CM (REVESTIMENTO IMPERMEABILIZADO), FUNDO DE BRITA SEM TAMPA - PARA REGISTRO/TORNEIRA JARDIM","Un    ",1,null,null,0,"Referência: AGETOP - 80845"]
["S",3,"S",0,1,6,1,0,0,0,0,"","Serviço","Serviço","-","SINAPI",94794,"REGISTRO DE GAVETA BRUTO, LATÃO, ROSCÁVEL, 1 1/2\u0094, COM ACABAMENTO E CANOPLA CROMADOS, INSTALADO EM RESERVAÇÃO DE ÁGUA DE EDIFICAÇÃO QUE POSSUA RESERVATÓRIO DE FIBRA/FIBROCIMENTO \u0096 FORNECIMENTO E INSTALAÇÃO. AF_06/2016","UN",2,null,null,0,"Referência: AGETOP - 80929"]
["S",3,"S",0,1,6,1,0,0,0,0,"","Serviço","Serviço","-","AGETOP",81070,"ADAPTAD.SOLD.CURTO C/BOLSA/ROSCA P/REGIST.60X2\"","Un    ",4,null,null,0,""]
["S",3,"S",0,1,6,1,0,0,0,0,"","Serviço","Serviço","-","AGETOP",71072,"CONTATOR 3 TF 48 - 75A","Un    ",2,null,null,0,""]
["S",3,"S",0,1,6,1,0,0,0,0,"","Serviço","Serviço","-","AGETOP",81108,"LUVA SOLDAVEL DIAMETRO 85 mm","Un    ",1,null,null,0,""]
["S",3,"S",0,1,6,1,0,0,0,0,"","Serviço","Serviço","-","AGETOP",81107,"LUVA SOLDAVEL DIAMETRO 75 mm","Un    ",1,null,null,0,""]
[3,3,3,43,1,6,2,0,0,{"$f":"IF(OR($C212=\"S\",$C212=0),0,MATCH(0,OFFSET($D212,1,$C212,ROW($C$826)-ROW($C212)),0))","v":81},{"$f":"IF(OR($C212=\"S\",$C212=0),0,MATCH(OFFSET($D212,0,$C212)+1,OFFSET($D212,1,$C212,ROW($C$826)-ROW($C212)),0))","v":43},"","Nível 3","Nível 3","-","SINAPI",null,"ÁGUA FRIA","-",null,null,null,0,""]
["S",3,"S",0,1,6,2,0,0,0,0,"","Serviço","Serviço","-","SINAPI",89402,"TUBO, PVC, SOLDÁVEL, DN 25MM, INSTALADO EM RAMAL DE DISTRIBUIÇÃO DE ÁGUA - FORNECIMENTO E INSTALAÇÃO. AF_12/2014","M",116,null,null,0,"Referência: AGETOP - 81003"]
["S",3,"S",0,1,6,2,0,0,0,0,"","Serviço","Serviço","-","AGETOP",80906,"REGISTRO DE GAVETA BRUTO DIAMETRO 2\"","Un    ",2,null,null,0,""]
["S",3,"S",0,1,6,2,0,0,0,0,"","Serviço","Serviço","-","AGETOP",80911,"REGISTRO DE GAVETA BRUTO 3\"","Un    ",1,null,null,0,""]
["S",3,"S",0,1,6,2,0,0,0,0,"","Serviço","Serviço","-","AGETOP",80927,"REGISTRO DE GAVETA C/CANOPLA DIAMETRO 1\"","Un    ",2,null,null,0,""]
["S",3,"S",0,1,6,2,0,0,0,0,"","Serviço","Serviço","-","SINAPI",94790,"ADAPTADOR COM FLANGES LIVRES, PVC, SOLDÁVEL LONGO, DN 85 MM X 3 , INSTALADO EM RESERVAÇÃO DE ÁGUA DE EDIFICAÇÃO QUE POSSUA RESERVATÓRIO DE FIBRA/FIBROCIMENTO   FORNECIMENTO E INSTALAÇÃO. AF_06/2016","UN",1,null,null,0,""]
["S",3,"S",0,1,6,2,0,0,0,0,"","Serviço","Serviço","-","AGETOP",81009,"TUBO SOLDAVEL PVC MARROM DIAMETRO 85 mm","m     ",60,null,null,0,""]
["S",3,"S",0,1,6,2,0,0,0,0,"","Serviço","Serviço","-","AGETOP",81007,"TUBO SOLDAVEL PVC MARROM DIAMETRO 60 mm (2\")","m     ",22,null,null,0,""]
["S",3,"S",0,1,6,2,0,0,0,0,"","Serviço","Serviço","-","SINAPI",89447,"TUBO, PVC, SOLDÁVEL, DN 32MM, INSTALADO EM PRUMADA DE ÁGUA - FORNECIMENTO E INSTALAÇÃO. AF_12/2014","M",8,null,null,0,""]
["S",3,"S",0,1,6,2,0,0,0,0,"","Serviço","Serviço","-","SINAPI",89449,"TUBO, PVC, SOLDÁVEL, DN 50MM, INSTALADO EM PRUMADA DE ÁGUA - FORNECIMENTO E INSTALAÇÃO. AF_12/2014","M",38,null,null,0,""]
["S",3,"S",0,1,6,2,0,0,0,0,"","Serviço","Serviço","-","SINAPI",89451,"TUBO, PVC, SOLDÁVEL, DN 75MM, INSTALADO EM PRUMADA DE ÁGUA - FORNECIMENTO E INSTALAÇÃO. AF_12/2014","M",10,null,null,0,""]
["S",3,"S",0,1,6,2,0,0,0,0,"","Serviço","Serviço","-","SINAPI",94708,"ADAPTADOR COM FLANGES LIVRES, PVC, SOLDÁVEL, DN  25 MM X 3/4 , INSTALADO EM RESERVAÇÃO DE ÁGUA DE EDIFICAÇÃO QUE POSSUA RESERVATÓRIO DE FIBRA/FIBROCIMENTO   FORNECIMENTO E INSTALAÇÃO. AF_06/2016","UN",1,null,null,0,"Referência: AGETOP - 81041"]
["S",3,"S",0,1,6,2,0,0,0,0,"","Serviço","Serviço","-","SINAPI",94709,"ADAPTADOR COM FLANGES LIVRES, PVC, SOLDÁVEL, DN 32 MM X 1 , INSTALADO EM RESERVAÇÃO DE ÁGUA DE EDIFICAÇÃO QUE POSSUA RESERVATÓRIO DE FIBRA/FIBROCIMENTO   FORNECIMENTO E INSTALAÇÃO. AF_06/2016","UN",1,null,null,0,"Referência: AGETOP - 81042"]
["S",3,"S",0,1,6,2,0,0,0,0,"","Serviço","Serviço","-","SINAPI",89553,"ADAPTADOR CURTO COM BOLSA E ROSCA PARA REGISTRO, PVC, SOLDÁVEL, DN 32MM X 1\u0094, INSTALADO EM PRUMADA DE ÁGUA - FORNECIMENTO E INSTALAÇÃO. AF_12/2014","UN",4,null,null,0,"Referência: AGETOP - 81067"]
["S",3,"S",0,1,6,2,0,0,0,0,"","Serviço","Serviço","-","SINAPI",89596,"ADAPTADOR CURTO COM BOLSA E ROSCA PARA REGISTRO, PVC, SOLDÁVEL, DN 50MM X 1.1/2\u0094, INSTALADO EM PRUMADA DE ÁGUA - FORNECIMENTO E INSTALAÇÃO. AF_12/2014","UN",16,null,null,0,"Referência: AGETOP - 81069"]
["S",3,"S",0,1,6,2,0,0,0,0,"","Serviço","Serviço","-","SINAPI",89575,"LUVA, PVC, SOLDÁVEL, DN 50MM, INSTALADO EM PRUMADA DE ÁGUA - FORNECIMENTO E INSTALAÇÃO. AF_12/2014","UN",1,null,null,0,"Referência: AGETOP - 81105"]
["S",3,"S",0,1,6,2,0,0,0,0,"","Serviço","Serviço","-","SINAPI",96662,"BUCHA DE REDUÇÃO, PPR, 32 X 25, CLASSE PN 25, INSTALADO EM RAMAL DE DISTRIBUIÇÃO DE ÁGUA \u0096 FORNECIMENTO E INSTALAÇÃO . AF_06/2015","UN",1,null,null,0,"Referência: AGETOP - 81162"]
["S",3,"S",0,1,6,2,0,0,0,0,"","Serviço","Serviço","-","SINAPI",89605,"LUVA DE REDUÇÃO, PVC, SOLDÁVEL, DN 60MM X 50MM, INSTALADO EM PRUMADA DE ÁGUA - FORNECIMENTO E INSTALAÇÃO. AF_12/2014","UN",2,null,null,0,"Referência: AGETOP - 81165"]
["S",3,"S",0,1,6,2,0,0,0,0,"","Serviço","Serviço","-","AGETOP",81182,"BUCHA DE REDUCAO SOLDAVEL LONGA 60 X 32 mm","Un    ",2,null,null,0,""]
["S",3,"S",0,1,6,2,0,0,0,0,"","Serviço","Serviço","-","AGETOP",81184,"BUCHA DE REDUCAO SOLDAVEL LONGA 60 X 50 mm","Un    ",2,null,null,0,""]
["S",3,"S",0,1,6,2,0,0,0,0,"","Serviço","Serviço","-","AGETOP",81180,"BUCHA DE REDUCAO SOLDAVEL LONGA 50 X 32 mm","Un    ",null,null,null,0,"Referência: AGETOP - 81180"]
["S",3,"S",0,1,6,2,0,{"$f":"IF(AND($C233<=4,$C233<>0),0,IF(AND($C233=\"S\",$W233>0),OFFSET(I233,-1,0)+1,OFFSET(I233,-1,0)))","v":0},0,0,"","Serviço","Serviço","-","AGETOP",81185,"BUCHA DE REDUÇÃO SOLDÁVEL LONGA 75 X 50 MM","un    ",2,null,null,0,"Referência: AGETOP - 81185"]
["S",3,"S",0,1,6,2,0,0,0,0,"","Serviço","Serviço","-","COMPOSIÇÃO","COMP 057_SEE","BUCHA DE REDUCAO SOLDAVEL LONGA 85 X 60 mm","UN ",2,null,null,0,""]
["S",3,"S",0,1,6,2,0,0,0,0,"","Serviço","Serviço","-","AGETOP",81306,"JOELHO 45 GRAUS SOLDAVEL 60 mm","Un    ",1,null,null,0,""]
["S",3,"S",0,{"$f":"IF($C236=1,OFFSET(E236,-1,0)+1,OFFSET(E236,-1,0))","v":1},{"$f":"IF($C236=1,0,IF($C236=2,OFFSET(F236,-1,0)+1,OFFSET(F236,-1,0)))","v":6},{"$f":"IF(AND($C236<=2,$C236<>0),0,IF($C236=3,OFFSET(G236,-1,0)+1,OFFSET(G236,-1,0)))","v":2},{"$f":"IF(AND($C236<=3,$C236<>0),0,IF($C236=4,OFFSET(H236,-1,0)+1,OFFSET(H236,-1,0)))","v":0},0,0,0,"","Serviço","Serviço","-","AGETOP",81307,"JOELHO 45 GRAUS SOLDAVEL 75 mm","Un    ",1,null,null,0,""]
["S",3,"S",0,1,6,2,0,0,0,0,"","Serviço","Serviço","-","AGETOP",81308,"JOELHO 45 GRAUS SOLDAVEL 85 mm","Un    ",1,null,null,0,""]
["S",3,"S",0,1,6,2,0,0,0,0,"","Serviço","Serviço","-","AGETOP",81340,"JOELHO REDUÇÃO 90º SOLDÁVEL  32 mm X 25 mm","Un    ",1,null,null,0,""]
["S",3,"S",0,1,6,2,0,0,0,0,"","Serviço","Serviço","-","SINAPI",89515,"JOELHO 45 GRAUS, PVC, SOLDÁVEL, DN 75MM, INSTALADO EM PRUMADA DE ÁGUA - FORNECIMENTO E INSTALAÇÃO. AF_12/2014","UN",1,null,null,0,"Referência: AGETOP - 81307"]
["S",3,"S",0,1,6,2,0,0,0,0,"","Serviço","Serviço","-","AGETOP",81360,"JOELHO RED.90 GRAUS SOLD.C/BUCHA LATAO 25X1/2\"","Un    ",4,null,null,0,"Referência: AGETOP - 81360"]
["S",3,"S",0,1,6,2,0,0,0,0,"","Serviço","Serviço","-","SINAPI",94672,"JOELHO 90 GRAUS COM BUCHA DE LATÃO, PVC, SOLDÁVEL, DN  25 MM, X 3/4\u0094 INSTALADO EM RESERVAÇÃO DE ÁGUA DE EDIFICAÇÃO QUE POSSUA RESERVATÓRIO DE FIBRA/FIBROCIMENTO   FORNECIMENTO E INSTALAÇÃO. AF_06/2016","UN",4,null,null,0,""]
["S",{"$f":"IF(OR(C242=\"s\",C242=0),OFFSET(B242,-1,0),C242)","v":3},{"$f":"IF(OFFSET(C242,-1,0)=\"L\",1,IF(OFFSET(C242,-1,0)=1,2,IF(OR(A242=\"s\",A242=0),\"S\",IF(AND(OFFSET(C242,-1,0)=2,A242=4),3,IF(AND(OR(OFFSET(C242,-1,0)=\"s\",OFFSET(C242,-1,0)=0),A242<>\"s\",A242>OFFSET(B242,-1,0)),OFFSET(B242,-1,0),A242)))))","v":"S"},{"$f":"IF(OR(C242=\"S\",C242=0),0,IF(ISERROR(K242),J242,SMALL(J242:K242,1)))","v":0},1,6,2,0,0,0,0,"","Serviço","Serviço","-","SINAPI",89617,"TE, PVC, SOLDÁVEL, DN 25MM, INSTALADO EM PRUMADA DE ÁGUA - FORNECIMENTO E INSTALAÇÃO. AF_12/2014","UN",2,null,null,0,""]
["S",3,"S",0,1,6,2,0,0,0,0,"","Serviço","Serviço","-","SINAPI",89625,"TE, PVC, SOLDÁVEL, DN 50MM, INSTALADO EM PRUMADA DE ÁGUA - FORNECIMENTO E INSTALAÇÃO. AF_12/2014","UN",6,null,null,0,"Referência: AGETOP - 81405"]
["S",3,"S",0,1,6,2,0,0,0,0,"","Serviço","Serviço","-","AGETOP",81408,"TE 90 GRAUS SOLDAVEL DIAMETRO 85 mm","Un    ",4,null,null,0,""]
["S",3,"S",0,1,6,2,0,0,0,0,"","Serviço","Serviço","-","SINAPI",89627,"TÊ DE REDUÇÃO, PVC, SOLDÁVEL, DN 50MM X 25MM, INSTALADO EM PRUMADA DE ÁGUA - FORNECIMENTO E INSTALAÇÃO. AF_12/2014","UN",2,null,null,0,""]
["S",3,"S",0,1,6,2,0,0,0,0,"","Serviço","Serviço","-","AGETOP",81421,"TE REDUCAO 90 GRAUS SOLDAVEL 32 X 25 mm","Un    ",2,null,null,0,""]
["S",3,"S",0,1,6,2,0,0,0,0,"","Serviço","Serviço","-","AGETOP",81428,"TE DE REDUCAO 90 GRAUS SOLDAVEL 85 X 60 MM","Un    ",3,null,null,0,""]
["S",3,"S",0,1,6,2,0,0,0,0,"","Serviço","Serviço","-","AGETOP",81501,"ADESIVO PLASTICO - FRASCO 850 G","Un    ",3,null,null,0,"Referência: AGETOP - 81501"]
["S",3,"S",0,1,6,2,0,0,0,0,"","Serviço","Serviço","-","AGETOP",81504,"SOLUCAO LIMPADORA 1000 CM3","Un    ",3,null,null,0,"Referência: AGETOP - 81504"]
["S",3,"S",0,1,6,2,0,0,0,0,"","Serviço","Serviço","-","SINAPI",89410,"CURVA 90 GRAUS, PVC, SOLDÁVEL, DN 25MM, INSTALADO EM RAMAL DE DISTRIBUIÇÃO DE ÁGUA - FORNECIMENTO E INSTALAÇÃO. AF_12/2014","UN",12,null,null,0,""]
["S",3,"S",0,1,6,2,0,0,0,0,"","Serviço","Serviço","-","SINAPI",89415,"CURVA 90 GRAUS, PVC, SOLDÁVEL, DN 32MM, INSTALADO EM RAMAL DE DISTRIBUIÇÃO DE ÁGUA - FORNECIMENTO E INSTALAÇÃO. AF_12/2014","UN",1,null,null,0,"Referência: AGETOP - 81538"]
["S",3,"S",0,1,6,2,0,0,0,0,"","Serviço","Serviço","-","SINAPI",89503,"CURVA 90 GRAUS, PVC, SOLDÁVEL, DN 50MM, INSTALADO EM PRUMADA DE ÁGUA - FORNECIMENTO E INSTALAÇÃO. AF_12/2014","UN",6,null,null,0,""]
["S",3,"S",0,1,6,2,0,0,0,0,"","Serviço","Serviço","-","AGETOP",81440,"TE REDUCAO 90 GRAUS SOLD.C/ROSCA 25X25X1/2\"","Un    ",6,null,null,0,""]
["S",3,"S",0,1,6,2,0,0,0,0,"","Serviço","Serviço","-","AGETOP",81541,"CURVA 90 GRAUS SOLDAVEL DIAMETRO 60 mm","Un    ",2,null,null,0,""]
[3,3,3,28,1,6,3,0,0,38,28,"","Nível 3","Nível 3","-","SINAPI",null,"ESGOTO","-",null,null,null,0,""]
["S",3,"S",0,1,6,3,0,0,0,0,"","Serviço","Serviço","-","AGETOP",81663,"CORPO CX. SIFONADA DIAM. 150 X 150 X 50","Un    ",4,null,null,0,"Referência: AGETOP - 81663"]
["S",3,"S",0,1,6,3,0,0,0,0,"","Serviço","Serviço","-","AGETOP",81696,"PROLONGAMENTO PARA CAIXA SIFONADA 150 MM","M     ",4,null,null,0,""]
["S",3,"S",0,1,6,3,0,0,0,0,"","Serviço","Serviço","-","AGETOP",81791,"GRELHA REDONDA BRANCA DIAM. 150 MM","Un    ",4,null,null,0,""]
["S",3,"S",0,1,6,3,0,0,0,0,"","Serviço","Serviço","-","AGETOP",81732,"CURVA 90 GRAUS CURTA DIAM. 75 MM","Un    ",2,null,null,0,"Referência: AGETOP - 81732"]
["S",3,"S",0,1,6,3,0,0,0,0,"","Serviço","Serviço","-","SINAPI",89525,"CURVA 90 GRAUS, PVC, SOLDÁVEL, DN 85MM, INSTALADO EM PRUMADA DE ÁGUA - FORNECIMENTO E INSTALAÇÃO. AF_12/2014","UN",4,null,null,0,""]
["S",3,"S",0,1,6,3,0,0,0,0,"","Serviço","Serviço","-","SINAPI",89726,"JOELHO 45 GRAUS, PVC, SERIE NORMAL, ESGOTO PREDIAL, DN 40 MM, JUNTA SOLDÁVEL, FORNECIDO E INSTALADO EM RAMAL DE DESCARGA OU RAMAL DE ESGOTO SANITÁRIO. AF_12/2014","UN",5,null,null,0,""]
["S",3,"S",0,1,6,3,0,0,0,0,"","Serviço","Serviço","-","SINAPI",89802,"JOELHO 45 GRAUS, PVC, SERIE NORMAL, ESGOTO PREDIAL, DN 50 MM, JUNTA ELÁSTICA, FORNECIDO E INSTALADO EM PRUMADA DE ESGOTO SANITÁRIO OU VENTILAÇÃO. AF_12/2014","UN",2,null,null,0,""]
["S",3,"S",0,1,6,3,0,0,0,0,"","Serviço","Serviço","-","SINAPI",89810,"JOELHO 45 GRAUS, PVC, SERIE NORMAL, ESGOTO PREDIAL, DN 100 MM, JUNTA ELÁSTICA, FORNECIDO E INSTALADO EM PRUMADA DE ESGOTO SANITÁRIO OU VENTILAÇÃO. AF_12/2014","UN",4,null,null,0,""]
["S",3,"S",0,1,6,3,0,0,0,0,"","Serviço","Serviço","-","AGETOP",81927,"JOELHO 90 GRAUS C/ANEL 40 mm ","Un    ",10,null,null,0,""]
["S",3,"S",0,1,6,3,0,0,0,0,"","Serviço","Serviço","-","SINAPI",89731,"JOELHO 90 GRAUS, PVC, SERIE NORMAL, ESGOTO PREDIAL, DN 50 MM, JUNTA ELÁSTICA, FORNECIDO E INSTALADO EM RAMAL DE DESCARGA OU RAMAL DE ESGOTO SANITÁRIO. AF_12/2014","UN",7,null,null,0,""]
["S",3,"S",0,1,6,3,0,0,0,0,"","Serviço","Serviço","-","AGETOP",81961,"JUNCAO 45 GRAUS DIAMETRO 40 MM","Un    ",2,null,null,0,"Referência: AGETOP - 81961"]
["S",3,"S",0,1,6,3,0,0,0,0,"","Serviço","Serviço","-","SINAPI",89785,"JUNÇÃO SIMPLES, PVC, SERIE NORMAL, ESGOTO PREDIAL, DN 50 X 50 MM, JUNTA ELÁSTICA, FORNECIDO E INSTALADO EM RAMAL DE DESCARGA OU RAMAL DE ESGOTO SANITÁRIO. AF_12/2014","UN",1,null,null,0,"Referência: AGETOP - 81970"]
["S",3,"S",0,1,6,3,0,0,0,0,"","Serviço","Serviço","-","AGETOP",81973,"JUNCAO SIMPLES DIAM. 100 X 50 MM","Un    ",4,null,null,0,"Referência: AGETOP - 81973"]
["S",3,"S",0,1,6,3,0,0,0,0,"","Serviço","Serviço","-","SINAPI",89797,"JUNÇÃO SIMPLES, PVC, SERIE NORMAL, ESGOTO PREDIAL, DN 100 X 100 MM, JUNTA ELÁSTICA, FORNECIDO E INSTALADO EM RAMAL DE DESCARGA OU RAMAL DE ESGOTO SANITÁRIO. AF_12/2014","UN",8,null,null,0,"Referência: AGETOP - 81975"]
["S",3,"S",0,1,6,3,0,0,0,0,"","Serviço","Serviço","-","AGETOP",82103,"REDUCAO EXCENTRICA 100 X 50 MM","Un    ",1,null,null,0,"Referência: AGETOP - 82103"]
["S",3,"S",0,1,6,3,0,0,0,0,"","Serviço","Serviço","-","SINAPI",89825,"TE, PVC, SERIE NORMAL, ESGOTO PREDIAL, DN 50 X 50 MM, JUNTA ELÁSTICA, FORNECIDO E INSTALADO EM PRUMADA DE ESGOTO SANITÁRIO OU VENTILAÇÃO. AF_12/2014","UN",5,null,null,0,""]
["S",3,"S",0,1,6,3,0,0,0,0,"","Serviço","Serviço","-","SINAPI",89711,"TUBO PVC, SERIE NORMAL, ESGOTO PREDIAL, DN 40 MM, FORNECIDO E INSTALADO EM RAMAL DE DESCARGA OU RAMAL DE ESGOTO SANITÁRIO. AF_12/2014","M",14,null,null,0,"Referência: AGETOP - 82301"]
["S",3,"S",0,1,6,3,0,0,0,0,"","Serviço","Serviço","-","SINAPI",89798,"TUBO PVC, SERIE NORMAL, ESGOTO PREDIAL, DN 50 MM, FORNECIDO E INSTALADO EM PRUMADA DE ESGOTO SANITÁRIO OU VENTILAÇÃO. AF_12/2014","M",24,null,null,0,""]
["S",3,"S",0,1,6,3,0,0,0,0,"","Serviço","Serviço","-","SINAPI",89800,"TUBO PVC, SERIE NORMAL, ESGOTO PREDIAL, DN 100 MM, FORNECIDO E INSTALADO EM PRUMADA DE ESGOTO SANITÁRIO OU VENTILAÇÃO. AF_12/2014","M",165,null,null,0,""]
["S",3,"S",0,1,6,3,0,0,0,0,"","Serviço","Serviço","-","SINAPI",89728,"CURVA CURTA 90 GRAUS, PVC, SERIE NORMAL, ESGOTO PREDIAL, DN 40 MM, JUNTA SOLDÁVEL, FORNECIDO E INSTALADO EM RAMAL DE DESCARGA OU RAMAL DE ESGOTO SANITÁRIO. AF_12/2014","UN",10,null,null,0,""]
["S",3,"S",0,1,6,3,0,0,{"$f":"IF(OR($C276=\"S\",$C276=0),0,MATCH(0,OFFSET($D276,1,$C276,ROW($C$826)-ROW($C276)),0))","v":0},{"$f":"IF(OR($C276=\"S\",$C276=0),0,MATCH(OFFSET($D276,0,$C276)+1,OFFSET($D276,1,$C276,ROW($C$826)-ROW($C276)),0))","v":0},"","Serviço","Serviço","-","SINAPI",89803,"CURVA CURTA 90 GRAUS, PVC, SERIE NORMAL, ESGOTO PREDIAL, DN 50 MM, JUNTA ELÁSTICA, FORNECIDO E INSTALADO EM PRUMADA DE ESGOTO SANITÁRIO OU VENTILAÇÃO. AF_12/2014","UN",4,null,null,0,""]
["S",3,"S",0,1,6,3,0,0,0,0,"","Serviço","Serviço","-","SINAPI",89811,"CURVA CURTA 90 GRAUS, PVC, SERIE NORMAL, ESGOTO PREDIAL, DN 100 MM, JUNTA ELÁSTICA, FORNECIDO E INSTALADO EM PRUMADA DE ESGOTO SANITÁRIO OU VENTILAÇÃO. AF_12/2014","UN",11,null,null,0,""]
["S",3,"S",0,1,6,3,0,0,0,0,"","Serviço","Serviço","-","AGETOP",81825,"CAIXA DE PASSAGEM 60 X 60 CM SEM TAMPA","Un    ",7,null,null,0,"Referência: AGETOP - 81825"]
["S",3,"S",0,1,6,3,0,0,0,0,"","Serviço","Serviço","-","AGETOP",81826,"TAMPA EM CONCRETO ARMADO 25 MPA E=5CM PARA A CAIXA DE PASSAGEM 60X60CM","Un    ",7,null,null,0,"Referência: AGETOP - 81826"]
["S",3,"S",0,1,6,3,0,0,0,0,"","Serviço","Serviço","-","AGETOP",81885,"TERMINAL DE VENTILACAO DIAMETRO 50 MM","Un    ",3,null,null,0,""]
["S",3,"S",0,1,6,3,0,0,0,0,"","Serviço","Serviço","-","AGETOP",81881,"RES.METALICO TAÇA AÇO PATINÁVEL-V=10M3-COL.SEC.H=6M+FUNDAÇÃO+LOGOTIPO","Un    ",1,null,null,0,"Referência: AGETOP - 81881"]
["S",3,"S",0,1,6,3,0,0,0,0,"","Serviço","Serviço","-","SINAPI",94797,"TORNEIRA DE BOIA, ROSCÁVEL, 1\u0094, FORNECIDA E INSTALADA EM RESERVAÇÃO DE ÁGUA. AF_06/2016","UN",1,null,null,0,""]
[{"$f":"CHOOSE(1+LOG(1+2*(ORÇAMENTO.Nivel=\"Nível 1\")+4*(ORÇAMENTO.Nivel=\"Nível 2\")+8*(ORÇAMENTO.Nivel=\"Nível 3\")+16*(ORÇAMENTO.Nivel=\"Nível 4\")+32*(ORÇAMENTO.Nivel=\"Serviço\"),2),0,1,2,3,4,\"S\")","v":3},{"$f":"IF(OR(C283=\"s\",C283=0),OFFSET(B283,-1,0),C283)","v":3},{"$f":"IF(OFFSET(C283,-1,0)=\"L\",1,IF(OFFSET(C283,-1,0)=1,2,IF(OR(A283=\"s\",A283=0),\"S\",IF(AND(OFFSET(C283,-1,0)=2,A283=4),3,IF(AND(OR(OFFSET(C283,-1,0)=\"s\",OFFSET(C283,-1,0)=0),A283<>\"s\",A283>OFFSET(B283,-1,0)),OFFSET(B283,-1,0),A283)))))","v":3},{"$f":"IF(OR(C283=\"S\",C283=0),0,IF(ISERROR(K283),J283,SMALL(J283:K283,1)))","v":10},{"$f":"IF($C283=1,OFFSET(E283,-1,0)+1,OFFSET(E283,-1,0))","v":1},{"$f":"IF($C283=1,0,IF($C283=2,OFFSET(F283,-1,0)+1,OFFSET(F283,-1,0)))","v":6},{"$f":"IF(AND($C283<=2,$C283<>0),0,IF($C283=3,OFFSET(G283,-1,0)+1,OFFSET(G283,-1,0)))","v":4},{"$f":"IF(AND($C283<=3,$C283<>0),0,IF($C283=4,OFFSET(H283,-1,0)+1,OFFSET(H283,-1,0)))","v":0},{"$f":"IF(AND($C283<=4,$C283<>0),0,IF(AND($C283=\"S\",$W283>0),OFFSET(I283,-1,0)+1,OFFSET(I283,-1,0)))","v":0},10,72,"","Nível 3","Nível 3","-","SINAPI",null,"EQUIPAMENTOS DE COMBATE A INCÊNDIO","-",null,null,null,0,""]
["S",3,"S",0,1,6,4,0,0,0,0,"","Serviço","Serviço","-","SINAPI","73775/2","EXTINTOR INCENDIO AGUA-PRESSURIZADA 10L INCL SUPORTE PAREDE CARGA     COMPLETA FORNECIMENTO E COLOCACAO","UN",3,null,null,0,""]
["S",3,"S",0,1,6,4,0,0,0,0,"","Serviço","Serviço","-","SINAPI",83635,"EXTINTOR INCENDIO TP PO QUIMICO 6KG - FORNECIMENTO E INSTALACAO","UN",3,null,null,0,""]
["S",3,"S",0,1,6,4,0,0,0,0,"","Serviço","Serviço","-","COMPOSIÇÃO","COMP 277_SEE","MARCAÇÃO NO PISO - 1X1 M PARA EXTINTOR","M2",6,null,null,0,""]
["S",3,"S",0,1,6,4,0,0,0,0,"","Serviço","Serviço","-","COMPOSIÇÃO","COMP 024_SEE","SINALIZADOR FOTOLUMINESCENTE PARA EXTINTOR","UN ",6,null,null,0,""]
["S",3,"S",0,1,6,4,0,0,0,0,"","Serviço","Serviço","-","AGETOP",71598,"LUMINÁRIA DE EMERGÊNCIA 30 LEDS","un    ",10,null,null,0,""]
["S",3,"S",0,1,6,4,0,0,0,0,"","Serviço","Serviço","-","COMPOSIÇÃO","COMP 235_SEE","PLACA DE SINALIZAÇÃO EM PVC COD 01 - (300X300) PROIBIDO FUMAR","UN ",1,null,null,0,""]
["S",3,"S",0,1,6,4,0,0,0,0,"","Serviço","Serviço","-","COMPOSIÇÃO","COMP 236_SEE","PLACA DE SINALIZAÇÃO EM PVC COD 06 - (300X300) PERIGO INFLAMÁVEL","UN ",1,null,null,0,""]
["S",3,"S",0,1,6,4,0,0,0,0,"","Serviço","Serviço","-","COMPOSIÇÃO","COMP 411_SEE","PLACA DE SINALIZAÇÃO EM PVC COD 13 - (316X158) SAÍDA DE EMERGÊNCIA","UN ",12,null,null,0,""]
["S",3,"S",0,1,6,4,0,0,0,0,"","Serviço","Serviço","-","COMPOSIÇÃO","COMP 412_SEE","PLACA DE SINALIZAÇÃO EM PVC COD 17 - (316X158) MENSAGEM \"SAÍDA\"","UN ",2,null,null,0,""]
[2,2,2,26,1,7,0,0,0,100,26,"","Nível 2","Nível 2","-",null,null,"INSTALAÇÕES ESPECIAIS","-",null,null,null,0,""]
["S",2,"S",0,1,7,0,0,0,0,0,"","Serviço","Serviço","-","AGETOP",91007,"CENTRAL DE GÁS PADRÃO AGETOP SEM INSTALAÇÕES (1+1 CILINDRO 45 KG)","Un    ",1,null,null,0,""]
["S",2,"S",0,1,7,0,0,0,0,0,"","Serviço","Serviço","-","AGETOP",91023,"UNIÃO S/BRONZE PRETA 3/4\" NPT 300 LBS","Un    ",3,null,null,0,""]
["S",2,"S",0,1,7,0,0,0,0,0,"","Serviço","Serviço","-","COMPOSIÇÃO","COMP 382_SEE","TE DE REDUCAO DE FERRO GALVANIZADO, COM ROSCA BSP, DE 3/4\" X 1/2\"","UN ",1,null,null,0,""]
["S",2,"S",0,1,7,0,0,0,0,0,"","Serviço","Serviço","-","COMPOSIÇÃO","COMP 383_SEE","BUCHA DE REDUCAO DE FERRO GALVANIZADO, COM ROSCA BSP, DE 1/2\" X 1/4\"","UN ",3,null,null,0,""]
["S",2,"S",0,1,7,0,0,0,0,0,"","Serviço","Serviço","-","AGETOP",91021,"LUVA GALVANIZADO DE REDUÇÃO 3/4\" X 1/2\" (GÁS)","Un    ",2,null,null,0,""]
["S",2,"S",0,1,7,0,0,0,0,0,"","Serviço","Serviço","-","SINAPI",92692,"NIPLE, EM FERRO GALVANIZADO, CONEXÃO ROSQUEADA, DN 15 (1/2\"), INSTALADO EM RAMAIS E SUB-RAMAIS DE GÁS - FORNECIMENTO E INSTALAÇÃO. AF_12/2015","UN",6,null,null,0,""]
["S",2,"S",0,1,7,0,0,0,0,0,"","Serviço","Serviço","-","AGETOP",91031,"NIPLE DUPLO 300 PSI 3/4\"","Un    ",6,null,null,0,""]
["S",2,"S",0,1,7,0,0,0,0,0,"","Serviço","Serviço","-","COMPOSIÇÃO","COMP 212_SEE","NIPLE DE REDUÇÃO 1/2\" X 1/4\" BSP","UN ",4,null,null,0,""]
["S",2,"S",0,1,7,0,0,0,0,0,"","Serviço","Serviço","-","COMPOSIÇÃO","COMP 213_SEE","NIPLE DE REDUÇÃO 3/4\" X 1/2\" BSP","UN ",4,null,null,0,""]
["S",2,"S",0,1,7,0,0,0,0,0,"","Serviço","Serviço","-","SINAPI",92688,"TUBO DE AÇO GALVANIZADO COM COSTURA, CLASSE MÉDIA, CONEXÃO ROSQUEADA, DN 20 (3/4\"), INSTALADO EM RAMAIS E SUB-RAMAIS DE GÁS - FORNECIMENTO E INSTALAÇÃO. AF_12/2015","M",12,null,null,0,""]
["S",2,"S",0,1,7,0,0,0,0,0,"","Serviço","Serviço","-","SINAPI",92701,"JOELHO 90 GRAUS, EM FERRO GALVANIZADO, CONEXÃO ROSQUEADA, DN 20 (3/4\"), INSTALADO EM RAMAIS E SUB-RAMAIS DE GÁS - FORNECIMENTO E INSTALAÇÃO. AF_12/2015","UN",5,null,null,0,""]
["S",2,"S",0,1,7,0,0,0,0,0,"","Serviço","Serviço","-","COMPOSIÇÃO","COMP 237_SEE","FITA ANTICORROSIVA","M",10,null,null,0,""]
["S",2,"S",0,1,7,0,0,0,0,0,"","Serviço","Serviço","-","AGETOP",91025,"VÁLVULA ESFERICA LATÃO 3/4\"","Un    ",3,null,null,0,""]
["S",2,"S",0,1,7,0,0,0,0,0,"","Serviço","Serviço","-","COMPOSIÇÃO","COMP 542_SEE","VÁLVULA UGV 3/4\" (S) LATÃO","UN ",1,null,null,0,""]
["S",2,"S",0,1,7,0,0,0,0,0,"","Serviço","Serviço","-","COMPOSIÇÃO","COMP 543_SEE","VÁLVULA UGV 1/2\" (S) LATÃO","UN ",1,null,null,0,""]
["S",2,"S",0,1,7,0,0,0,0,0,"","Serviço","Serviço","-","AGETOP",91029,"VALVULA DE RETENÇÃO LATÃO 1/2\" X 7/16\" NPT","Un    ",1,null,null,0,""]
["S",2,"S",0,1,7,0,0,0,0,0,"","Serviço","Serviço","-","COMPOSIÇÃO","COMP 211_SEE","REGULADOR DE 2º ESTÁGIO 5KG/H","UN ",1,null,null,0,""]
["S",2,"S",0,1,7,0,0,0,0,0,"","Serviço","Serviço","-","COMPOSIÇÃO","COMP 210_SEE","REGULADOR DE 1º ESTÁGIO 60KG/H MODELO AP-40  COM MANÔMETRO","UN ",1,null,null,0,""]
["S",2,"S",0,1,7,0,0,0,0,0,"","Serviço","Serviço","-","AGETOP",85003,"EXTINTOR PO QUIMICO SECO (6 KG) - CAPACIDADE EXTINTORA 20 BC","Un    ",1,null,null,0,""]
["S",2,"S",0,1,7,0,0,0,0,0,"","Serviço","Serviço","-","COMPOSIÇÃO","COMP 235_SEE","PLACA DE SINALIZAÇÃO EM PVC COD 01 - (300X300) PROIBIDO FUMAR","UN ",2,null,null,0,""]
["S",2,"S",0,1,7,0,0,0,0,0,"","Serviço","Serviço","-","COMPOSIÇÃO","COMP 236_SEE","PLACA DE SINALIZAÇÃO EM PVC COD 06 - (300X300) PERIGO INFLAMÁVEL","UN ",2,null,null,0,""]
["S",2,"S",0,1,7,0,0,0,0,0,"","Serviço","Serviço","-","AGETOP",91043,"BRAÇADEIRA METALICA TIPO \"D\" DIAM. 3/4\"","Un    ",5,null,null,0,""]
["S",2,"S",0,1,7,0,0,0,0,0,"","Serviço","Serviço","-","AGETOP",71863,"PARAFUSO P/BUCHA S-10","Un    ",10,null,null,0,""]
["S",2,"S",0,1,7,0,0,0,0,0,"","Serviço","Serviço","-","AGETOP",70393,"BUCHA DE NYLON S-10","Un    ",10,null,null,0,""]
[{"$f":"CHOOSE(1+LOG(1+2*(ORÇAMENTO.Nivel=\"Nível 1\")+4*(ORÇAMENTO.Nivel=\"Nível 2\")+8*(ORÇAMENTO.Nivel=\"Nível 3\")+16*(ORÇAMENTO.Nivel=\"Nível 4\")+32*(ORÇAMENTO.Nivel=\"Serviço\"),2),0,1,2,3,4,\"S\")","v":"S"},2,"S",0,1,7,0,0,{"$f":"IF(AND($C318<=4,$C318<>0),0,IF(AND($C318=\"S\",$W318>0),OFFSET(I318,-1,0)+1,OFFSET(I318,-1,0)))","v":0},0,0,"","Serviço","Serviço","-","AGETOP",91045,"SUPORTE PARA COLETOR","Un    ",2,null,null,0,""]
[{"$f":"CHOOSE(1+LOG(1+2*(ORÇAMENTO.Nivel=\"Nível 1\")+4*(ORÇAMENTO.Nivel=\"Nível 2\")+8*(ORÇAMENTO.Nivel=\"Nível 3\")+16*(ORÇAMENTO.Nivel=\"Nível 4\")+32*(ORÇAMENTO.Nivel=\"Serviço\"),2),0,1,2,3,4,\"S\")","v":2},2,2,2,1,8,0,0,{"$f":"IF(AND($C319<=4,$C319<>0),0,IF(AND($C319=\"S\",$W319>0),OFFSET(I319,-1,0)+1,OFFSET(I319,-1,0)))","v":0},74,2,"","Nível 2","Nível 2","-","AGETOP",91045,"ALVENARIAS E DIVISÓRIAS","Un    ",null,null,null,0,""]
["S",2,"S",0,{"$f":"IF($C320=1,OFFSET(E320,-1,0)+1,OFFSET(E320,-1,0))","v":1},{"$f":"IF($C320=1,0,IF($C320=2,OFFSET(F320,-1,0)+1,OFFSET(F320,-1,0)))","v":8},{"$f":"IF(AND($C320<=2,$C320<>0),0,IF($C320=3,OFFSET(G320,-1,0)+1,OFFSET(G320,-1,0)))","v":0},{"$f":"IF(AND($C320<=3,$C320<>0),0,IF($C320=4,OFFSET(H320,-1,0)+1,OFFSET(H320,-1,0)))","v":0},0,0,0,"","Serviço","Serviço","-","SINAPI",87520,"ALVENARIA DE VEDAÇÃO DE BLOCOS CERÂMICOS FURADOS NA HORIZONTAL DE 9X19X19CM (ESPESSURA 9CM) DE PAREDES COM ÁREA LÍQUIDA MAIOR OU IGUAL A 6M² COM VÃOS E ARGAMASSA DE ASSENTAMENTO COM PREPARO MANUAL. AF_06/2014","M2",58.5,null,null,0,""]
[2,{"$f":"IF(OR(C321=\"s\",C321=0),OFFSET(B321,-1,0),C321)","v":2},{"$f":"IF(OFFSET(C321,-1,0)=\"L\",1,IF(OFFSET(C321,-1,0)=1,2,IF(OR(A321=\"s\",A321=0),\"S\",IF(AND(OFFSET(C321,-1,0)=2,A321=4),3,IF(AND(OR(OFFSET(C321,-1,0)=\"s\",OFFSET(C321,-1,0)=0),A321<>\"s\",A321>OFFSET(B321,-1,0)),OFFSET(B321,-1,0),A321)))))","v":2},{"$f":"IF(OR(C321=\"S\",C321=0),0,IF(ISERROR(K321),J321,SMALL(J321:K321,1)))","v":2},1,9,0,0,0,72,2,"","Nível 2","Nível 2","-",null,null,"IMPERMEABILIZAÇÃO","-",null,null,null,0,""]
["S",2,"S",0,1,9,0,0,0,0,0,"","Serviço","Serviço","-","SINAPI",98562,"IMPERMEABILIZAÇÃO DE FLOREIRA OU VIGA BALDRAME COM ARGAMASSA DE CIMENTO E AREIA, COM ADITIVO IMPERMEABILIZANTE, E = 2 CM. AF_06/2018","M2",33.340000000000003,null,null,0,"Referência: AGETOP - 120902"]
[2,2,2,2,1,10,0,0,0,70,2,"","Nível 2","Nível 2","-",null,null,"ESTRUTURAS METÁLICAS","-",null,null,null,0,""]
["S",2,"S",0,1,10,0,0,0,0,0,"","Serviço","Serviço","-","AGETOP",150103,"ESTRUTURA METÁLICA CONVENCIONAL EM AÇO DO TIPO USI SAC-300 COM FUNDO ANTICORROSIVO","Kg    ",2448.4499999999998,null,null,0,""]
[2,2,2,8,1,11,0,0,0,68,8,"","Nível 2","Nível 2","-",null,null,"COBERTURAS","-",null,null,null,0,""]
[3,3,3,4,1,11,1,0,0,7,4,"","Nível 3","Nível 3","-",null,null,"CERÂMICA","-",null,null,null,0,""]
["S",3,"S",0,1,11,1,0,0,0,0,"","Serviço","Serviço","-","SINAPI",94445,"TELHAMENTO COM TELHA CERÂMICA CAPA-CANAL, TIPO PLAN, COM ATÉ 2 ÁGUAS, INCLUSO TRANSPORTE VERTICAL. AF_06/2016","M2",163,null,null,0,"Referência: AGETOP - 160401"]
["S",3,"S",0,1,11,1,0,0,0,0,"","Serviço","Serviço","-","SINAPI",94221,"CUMEEIRA PARA TELHA CERÂMICA EMBOÇADA COM ARGAMASSA TRAÇO 1:2:9 (CIMENTO, CAL E AREIA) PARA TELHADOS COM ATÉ 2 ÁGUAS, INCLUSO TRANSPORTE VERTICAL. AF_06/2016","M",23.2,null,null,0,""]
["S",3,"S",0,1,11,1,0,0,0,0,"","Serviço","Serviço","-","SINAPI",94224,"EMBOÇAMENTO COM ARGAMASSA TRAÇO 1:2:9 (CIMENTO, CAL E AREIA). AF_06/2016","M",31,null,null,0,"Referência: AGETOP - 160403"]
[3,3,3,3,1,11,2,0,0,3,21,"","Nível 3","Nível 3","-",null,null,"CALHA E RUFO","-",null,null,null,0,""]
["S",3,"S",0,1,11,2,0,0,0,0,"","Serviço","Serviço","-","SINAPI",94228,"CALHA EM CHAPA DE AÇO GALVANIZADO NÚMERO 24, DESENVOLVIMENTO DE 50 CM, INCLUSO TRANSPORTE VERTICAL. AF_06/2016","M",23.2,null,null,0,"Referência: AGETOP - 160601"]
["S",3,"S",0,1,11,2,0,0,0,0,"","Serviço","Serviço","-","SINAPI",94231,"RUFO EM CHAPA DE AÇO GALVANIZADO NÚMERO 24, CORTE DE 25 CM, INCLUSO TRANSPORTE VERTICAL. AF_06/2016","M",8.5,null,null,0,"Referência: AGETOP - 160602"]
[2,2,2,7,1,12,0,0,0,60,7,"","Nível 2","Nível 2","-",null,null,"ESQUADRIAS METÁLICAS","-",null,null,null,0,""]
["S",2,"S",0,1,12,0,0,0,0,0,"","Serviço","Serviço","-","SINAPI","73933/4","PORTA DE FERRO DE ABRIR TIPO BARRA CHATA, COM REQUADRO E GUARNICAO COMPLETA","M2",3.7800000000000002,null,null,0,"Referência: AGETOP - 180501"]
["S",2,"S",0,1,12,0,0,0,0,0,"","Serviço","Serviço","-","SINAPI","73933/4","PORTA DE FERRO DE ABRIR TIPO BARRA CHATA, COM REQUADRO E GUARNICAO COMPLETA","M2",7.92,null,null,0,"Referência: AGETOP - 180509"]
["S",2,"S",0,1,12,0,0,0,0,0,"","Serviço","Serviço","-","AGETOP",180504,"PORTA ABRIR/VENEZIANA PF-4 C/FERRAGENS","m2    ",4.2,null,null,0,""]
["S",2,"S",0,1,12,0,0,0,0,0,"","Serviço","Serviço","-","AGETOP",180380,"ESQ. MAXIMO AR CHAPA/VIDRO J4 C/FERRAGENS","m2    ",0.5,null,null,0,""]
["S",2,"S",0,1,12,0,0,0,{"$f":"IF(OR($C338=\"S\",$C338=0),0,MATCH(0,OFFSET($D338,1,$C338,ROW($C$826)-ROW($C338)),0))","v":0},{"$f":"IF(OR($C338=\"S\",$C338=0),0,MATCH(OFFSET($D338,0,$C338)+1,OFFSET($D338,1,$C338,ROW($C$826)-ROW($C338)),0))","v":0},"","Serviço","Serviço","-","AGETOP",180381,"ESQ. MAXIMO AR CHAPA/VIDRO J3/J5/J6/J8 C/FERRAGENS","m2    ",17.28,null,null,0,""]
["S",2,"S",0,1,12,0,0,0,0,0,"","Serviço","Serviço","-","COMPOSIÇÃO","COMP 083_SEE","CORRIMÃO PISO - SEDUC","M",20.100000000000001,null,null,0,""]
[2,2,2,5,1,13,0,0,0,53,5,"","Nível 2","Nível 2","-",null,null,"REVESTIMENTO DE PAREDE","-",null,null,null,0,""]
["S",2,"S",0,1,13,0,0,0,0,0,"","Serviço","Serviço","-","SINAPI",87553,"EMBOÇO, PARA RECEBIMENTO DE CERÂMICA, EM ARGAMASSA TRAÇO 1:2:8, PREPARO MECÂNICO COM BETONEIRA 400L, APLICADO MANUALMENTE EM FACES INTERNAS DE PAREDES, PARA AMBIENTE COM ÁREA MAIOR QUE 10M2, ESPESSURA DE 10MM, COM EXECUÇÃO DE TALISCAS. AF_06/2014","M2",30.4,null,null,0,""]
[{"$f":"CHOOSE(1+LOG(1+2*(ORÇAMENTO.Nivel=\"Nível 1\")+4*(ORÇAMENTO.Nivel=\"Nível 2\")+8*(ORÇAMENTO.Nivel=\"Nível 3\")+16*(ORÇAMENTO.Nivel=\"Nível 4\")+32*(ORÇAMENTO.Nivel=\"Serviço\"),2),0,1,2,3,4,\"S\")","v":"S"},2,"S",0,1,13,0,0,{"$f":"IF(AND($C342<=4,$C342<>0),0,IF(AND($C342=\"S\",$W342>0),OFFSET(I342,-1,0)+1,OFFSET(I342,-1,0)))","v":0},0,0,"","Serviço","Serviço","-","SINAPI",87904,"CHAPISCO APLICADO EM ALVENARIA (COM PRESENÇA DE VÃOS) E ESTRUTURAS DE CONCRETO DE FACHADA, COM COLHER DE PEDREIRO.  ARGAMASSA TRAÇO 1:3 COM PREPARO MANUAL. AF_06/2014","M2",117,null,null,0,"Referência: AGETOP - 200101"]
["S",2,"S",0,{"$f":"IF($C343=1,OFFSET(E343,-1,0)+1,OFFSET(E343,-1,0))","v":1},{"$f":"IF($C343=1,0,IF($C343=2,OFFSET(F343,-1,0)+1,OFFSET(F343,-1,0)))","v":13},{"$f":"IF(AND($C343<=2,$C343<>0),0,IF($C343=3,OFFSET(G343,-1,0)+1,OFFSET(G343,-1,0)))","v":0},{"$f":"IF(AND($C343<=3,$C343<>0),0,IF($C343=4,OFFSET(H343,-1,0)+1,OFFSET(H343,-1,0)))","v":0},0,0,0,"","Serviço","Serviço","-","SINAPI",87547,"MASSA ÚNICA, PARA RECEBIMENTO DE PINTURA, EM ARGAMASSA TRAÇO 1:2:8, PREPARO MECÂNICO COM BETONEIRA 400L, APLICADA MANUALMENTE EM FACES INTERNAS DE PAREDES, ESPESSURA DE 10MM, COM EXECUÇÃO DE TALISCAS. AF_06/2014","M2",113.8,null,null,0,""]
["S",2,"S",0,1,13,0,0,0,0,0,"","Serviço","Serviço","-","SINAPI",87273,"REVESTIMENTO CERÂMICO PARA PAREDES INTERNAS COM PLACAS TIPO ESMALTADA EXTRA DE DIMENSÕES 33X45 CM APLICADAS EM AMBIENTES DE ÁREA MAIOR QUE 5 M² NA ALTURA INTEIRA DAS PAREDES. AF_06/2014","M2",168.2,null,null,0,""]
[2,{"$f":"IF(OR(C345=\"s\",C345=0),OFFSET(B345,-1,0),C345)","v":2},{"$f":"IF(OFFSET(C345,-1,0)=\"L\",1,IF(OFFSET(C345,-1,0)=1,2,IF(OR(A345=\"s\",A345=0),\"S\",IF(AND(OFFSET(C345,-1,0)=2,A345=4),3,IF(AND(OR(OFFSET(C345,-1,0)=\"s\",OFFSET(C345,-1,0)=0),A345<>\"s\",A345>OFFSET(B345,-1,0)),OFFSET(B345,-1,0),A345)))))","v":2},{"$f":"IF(OR(C345=\"S\",C345=0),0,IF(ISERROR(K345),J345,SMALL(J345:K345,1)))","v":13},1,14,0,0,0,48,13,"","Nível 2","Nível 2","-",null,null,"REVESTIMENTO DE PISO","-",null,null,null,0,""]
[3,3,3,2,1,14,1,0,0,12,2,"","Nível 3","Nível 3","-","SINAPI",null,"CONTRAPISO","-",null,null,null,0,""]
["S",3,"S",0,1,14,1,0,0,0,0,"","Serviço","Serviço","-","SINAPI",87622,"CONTRAPISO EM ARGAMASSA TRAÇO 1:4 (CIMENTO E AREIA), PREPARO MANUAL, APLICADO EM ÁREAS SECAS SOBRE LAJE, ADERIDO, ESPESSURA 2CM. AF_06/2014","M2",3.45,null,null,0,""]
[3,3,3,3,1,14,2,0,0,10,3,"","Nível 3","Nível 3","-",null,null,"GRANITINA","-",null,null,null,0,""]
["S",3,"S",0,1,14,2,0,0,0,0,"","Serviço","Serviço","-","AGETOP",221104,"RASPAGEM E APLICAÇÃO RESINA ACRÍLICA DUAS DEMÃOS","m2    ",181.45,null,null,0,""]
["S",3,"S",0,1,14,2,0,0,0,0,"","Serviço","Serviço","-","AGETOP",221106,"GRANITINA 8MM FUNDIDA COM CONTRAPISO (1CI:3ARML) E=2CM E JUNTA PLASTICA 27MM (COM ÓXIDO DE FERRO)","m2    ",181.45,null,null,0,""]
[3,3,3,2,1,14,3,0,0,7,2,"","Nível 3","Nível 3","-",null,null,"CONCRETO","-",null,null,null,0,""]
["S",3,"S",0,1,14,3,0,0,0,0,"","Serviço","Serviço","-","AGETOP",220060,"PISO LAMINADO COM CONCRETO 20MPA E=7CM ","m2    ",558,null,null,0,"Referência: AGETOP - 220104"]
[3,3,3,2,1,14,4,0,0,5,2,"","Nível 3","Nível 3","-",null,null,"PASSEIO (CALÇADA)","-",null,null,null,0,""]
["S",3,"S",0,1,14,4,0,0,0,0,"","Serviço","Serviço","-","AGETOP",220100,"PASSEIO PROTECAO EM CONC.DESEMPEN.5 CM 1:2,5:3,5 ( INCLUSO ESPELHO DE 30CM/ESCAVAÇÃO/REATERRO/APILOAMENTO/ATERRO INTERNO)","m2    ",5.41,null,null,0,""]
[3,3,3,3,1,14,5,0,0,3,27,"","Nível 3","Nível 3","-",null,null,"PODOTÁTIL","-",null,null,null,0,""]
["S",3,"S",0,1,14,5,0,0,0,0,"","Serviço","Serviço","-","AGETOP",221120,"PISO DE BORRACHA COLORIDO MODELO TÁTIL ( ALERTA OU DIRECIONAL) INCLUSO CONTRAPISO (1CI:3ARML) C/ E=2CM E NATA DE CIMENTO","m2    ",3.58,null,null,0,""]
["S",3,"S",0,1,14,5,0,0,0,0,"","Serviço","Serviço","-","AGETOP",221126,"PISO DE LADRILHO HIDRÁULICO COLORIDO MODELO TÁTIL ( ALERTA OU DIRECIONAL) SEM LASTRO","m2    ",40.520000000000003,null,null,0,""]
[2,2,2,4,1,15,0,0,0,35,4,"","Nível 2","Nível 2","-",null,null,"FERRAGENS","-",null,null,null,0,""]
["S",2,"S",0,1,15,0,0,0,0,0,"","Serviço","Serviço","-","SINAPI",91304,"FECHADURA DE EMBUTIR COM CILINDRO, EXTERNA, COMPLETA, ACABAMENTO PADRÃO POPULAR, INCLUSO EXECUÇÃO DE FURO - FORNECIMENTO E INSTALAÇÃO. AF_08/2015","UN",4,null,null,0,""]
["S",2,"S",0,1,15,0,0,0,0,0,"","Serviço","Serviço","-","AGETOP",230174,"BARRA DE APOIO EM AÇO INOX - 40 CM","un    ",6,null,null,0,""]
["S",2,"S",0,1,15,0,0,0,0,0,"","Serviço","Serviço","-","AGETOP",230176,"BARRA DE APOIO EM AÇO INOX - 80 CM ","un    ",6,null,null,0,""]
[2,2,2,6,1,16,0,0,0,31,6,"","Nível 2","Nível 2","-",null,null,"ADMINISTRAÇÃO","-",null,null,null,0,""]
[3,3,3,3,1,16,1,0,0,5,3,"","Nível 3","Nível 3","-",null,null,"MENSALISTAS","-",null,null,null,0,""]
["S",3,"S",0,1,16,1,0,0,0,0,"","Serviço","Serviço","-","SINAPI",90778,"ENGENHEIRO CIVIL DE OBRA PLENO COM ENCARGOS COMPLEMENTARES","H",176,null,null,0,"Referência: AGETOP - 250101"]
["S",3,"S",0,1,16,1,0,0,0,0,"","Serviço","Serviço","-","SINAPI",90776,"ENCARREGADO GERAL COM ENCARGOS COMPLEMENTARES","H",880,null,null,0,"Referência: AGETOP - 250103"]
[3,3,3,2,1,16,2,0,0,2,9,"","Nível 3","Nível 3","-",null,null,"LAUDO DE ESTANQUEIDADE","-",null,null,null,0,""]
["S",3,"S",0,1,16,2,0,0,0,0,"","Serviço","Serviço","-","SINAPI",90778,"ENGENHEIRO CIVIL DE OBRA PLENO COM ENCARGOS COMPLEMENTARES","H",16,null,null,0,"Referência: AGETOP - 250101"]
[2,2,2,19,1,17,0,0,0,25,19,"","Nível 2","Nível 2","-",null,null,"PINTURA","-",null,null,null,0,""]
[3,3,3,2,1,17,1,0,0,18,2,"","Nível 3","Nível 3","-",null,null,"ESMALTE SINTÉTICO","-",null,null,null,0,""]
[{"$f":"CHOOSE(1+LOG(1+2*(ORÇAMENTO.Nivel=\"Nível 1\")+4*(ORÇAMENTO.Nivel=\"Nível 2\")+8*(ORÇAMENTO.Nivel=\"Nível 3\")+16*(ORÇAMENTO.Nivel=\"Nível 4\")+32*(ORÇAMENTO.Nivel=\"Serviço\"),2),0,1,2,3,4,\"S\")","v":"S"},3,"S",0,1,17,1,0,{"$f":"IF(AND($C370<=4,$C370<>0),0,IF(AND($C370=\"S\",$W370>0),OFFSET(I370,-1,0)+1,OFFSET(I370,-1,0)))","v":0},0,0,"","Serviço","Serviço","-","AGETOP",261550,"PINT.ESMALTE SINT.PAREDES - 2 DEM.C/SELADOR","m2    ",1292,null,null,0,""]
[3,3,3,4,1,17,2,0,0,16,4,"","Nível 3","Nível 3","-","AGETOP",null,"LÁTEX ACRÍLICA","-",null,null,null,0,""]
["S",3,"S",0,1,17,2,0,0,0,0,"","Serviço","Serviço","-","SINAPI",88497,"APLICAÇÃO E LIXAMENTO DE MASSA LÁTEX EM PAREDES, DUAS DEMÃOS. AF_06/2014","M2",50,null,null,0,"Referência: AGETOP - 261300"]
["S",3,"S",0,{"$f":"IF($C373=1,OFFSET(E373,-1,0)+1,OFFSET(E373,-1,0))","v":1},{"$f":"IF($C373=1,0,IF($C373=2,OFFSET(F373,-1,0)+1,OFFSET(F373,-1,0)))","v":17},{"$f":"IF(AND($C373<=2,$C373<>0),0,IF($C373=3,OFFSET(G373,-1,0)+1,OFFSET(G373,-1,0)))","v":2},{"$f":"IF(AND($C373<=3,$C373<>0),0,IF($C373=4,OFFSET(H373,-1,0)+1,OFFSET(H373,-1,0)))","v":0},0,0,0,"","Serviço","Serviço","-","AGETOP",261304,"EMASSAMENTO ACRILICO 2 DEMAOS","m2    ",20,null,null,0,""]
["S",3,"S",0,{"$f":"IF($C374=1,OFFSET(E374,-1,0)+1,OFFSET(E374,-1,0))","v":1},{"$f":"IF($C374=1,0,IF($C374=2,OFFSET(F374,-1,0)+1,OFFSET(F374,-1,0)))","v":17},{"$f":"IF(AND($C374<=2,$C374<>0),0,IF($C374=3,OFFSET(G374,-1,0)+1,OFFSET(G374,-1,0)))","v":2},{"$f":"IF(AND($C374<=3,$C374<>0),0,IF($C374=4,OFFSET(H374,-1,0)+1,OFFSET(H374,-1,0)))","v":0},0,0,0,"","Serviço","Serviço","-","SINAPI",88489,"APLICAÇÃO MANUAL DE PINTURA COM TINTA LÁTEX ACRÍLICA EM PAREDES, DUAS DEMÃOS. AF_06/2014","M2",1292,null,null,0,"Referência: AGETOP - 261001"]
[3,3,3,3,1,17,3,0,0,12,3,"","Nível 3","Nível 3","-","AGETOP",null,"TETO","-",null,null,null,0,""]
["S",3,"S",0,1,17,3,0,0,0,0,"","Serviço","Serviço","-","AGETOP",260104,"REMOCAO DE PINTURA ANTIGA A LATEX","m2    ",120,null,null,0,""]
["S",3,"S",0,1,17,3,0,0,0,0,"","Serviço","Serviço","-","SINAPI",88486,"APLICAÇÃO MANUAL DE PINTURA COM TINTA LÁTEX PVA EM TETO, DUAS DEMÃOS. AF_06/2014","M2",283,null,null,0,"Referência: AGETOP - 261302"]
[3,3,3,2,1,17,4,0,0,9,2,"","Nível 3","Nível 3","-","AGETOP",null,"EXTERNA","-",null,null,null,0,""]
["S",{"$f":"IF(OR(C379=\"s\",C379=0),OFFSET(B379,-1,0),C379)","v":3},{"$f":"IF(OFFSET(C379,-1,0)=\"L\",1,IF(OFFSET(C379,-1,0)=1,2,IF(OR(A379=\"s\",A379=0),\"S\",IF(AND(OFFSET(C379,-1,0)=2,A379=4),3,IF(AND(OR(OFFSET(C379,-1,0)=\"s\",OFFSET(C379,-1,0)=0),A379<>\"s\",A379>OFFSET(B379,-1,0)),OFFSET(B379,-1,0),A379)))))","v":"S"},{"$f":"IF(OR(C379=\"S\",C379=0),0,IF(ISERROR(K379),J379,SMALL(J379:K379,1)))","v":0},1,17,4,0,0,0,0,"","Serviço","Serviço","-","AGETOP",260202,"CAIACAO DUAS DEMAOS MUROS E PAREDES - (OB.C.)","m2    ",155,null,null,0,""]
[3,3,3,2,1,17,5,0,0,7,2,"","Nível 3","Nível 3","-","AGETOP",null,"ESQUADRIAS EXISTENTES","-",null,null,null,0,""]
["S",3,"S",0,1,17,5,0,0,0,0,"","Serviço","Serviço","-","SINAPI","73924/3","PINTURA ESMALTE FOSCO, DUAS DEMAOS, SOBRE SUPERFICIE METALICA","M2",248,null,null,0,"Referência: AGETOP - 261503"]
[3,3,3,2,1,17,6,0,0,5,2,"","Nível 3","Nível 3","-","AGETOP",null,"ESQUADRIAS NOVAS","-",null,null,null,0,""]
["S",3,"S",0,1,17,6,0,0,0,0,"","Serviço","Serviço","-","SINAPI","74145/1","PINTURA ESMALTE FOSCO, DUAS DEMAOS, SOBRE SUPERFICIE METALICA, INCLUSO UMA DEMAO DE FUNDO ANTICORROSIVO. UTILIZACAO DE REVOLVER ( AR-COMPRIMIDO).","M2",70.599999999999994,null,null,0,"Referência: AGETOP - 261602"]
[3,3,3,3,1,17,7,0,0,3,{"$error":"#N/A"},"","Nível 3","Nível 3","-","AGETOP",null,"QUADRA DE ESPORTES","-",null,null,null,0,""]
["S",3,"S",0,1,17,7,0,0,0,0,"","Serviço","Serviço","-","SINAPI",41595,"PINTURA ACRILICA DE FAIXAS DE DEMARCACAO EM QUADRA POLIESPORTIVA, 5 CM DE LARGURA","M",192,null,null,0,"Referência: AGETOP - 261700"]
["S",3,"S",0,1,17,7,0,0,0,0,"","Serviço","Serviço","-","AGETOP",261620,"LETREIRO MÉDIO A GRANDE PORTE EM PAREDE FEITO A PINCEL","m2    ",7.2,null,null,0,""]
[2,2,2,6,1,18,0,0,0,6,189,"","Nível 2","Nível 2","-",null,null,"DIVERSOS","-",null,null,null,0,""]
["S",2,"S",0,1,18,0,0,0,0,0,"","Serviço","Serviço","-","AGETOP",271208,"QD.GIZ EMBOCO/LAM.MELAMINICO COMPL.-ESC.2000 6,87X1,39M","Un    ",8,null,null,0,""]
["S",2,"S",0,1,18,0,0,0,0,0,"","Serviço","Serviço","-","AGETOP",270501,"LIMPEZA FINAL DE OBRA - (OBRAS CIVIS)","m2    ",500,null,null,0,""]
["S",2,"S",0,1,18,0,0,0,0,0,"","Serviço","Serviço","-","AGETOP",271099,"TABELA PARA BASQUETE ESTRUTURA METÁLICA E COMPENSADO (ASSENT./PINTADAS) ARO METÁLICO - 2 UNID.","CJ    ",1,null,null,0,""]
["S",2,"S",0,1,18,0,0,0,0,0,"","Serviço","Serviço","-","AGETOP",271101,"TRAVES FERRO GALVANIZADO PARA FUTEBOL DE SALÃO PINTADAS - 3,00 x 2,00M - 2 UNID.","CJ    ",1,null,null,0,""]
["S",2,"S",0,1,18,0,0,0,0,0,"","Serviço","Serviço","-","AGETOP",271103,"CONJUNTO PARA VOLEIBOL EM FERRO GALVANIZADO COM PINTURA (2 SUPORTES)","CJ    ",1,null,null,0,""]
[1,1,1,186,2,0,0,0,0,433,186,"F","Nível 1","Nível 1","2.","SINAPI",null,"COZINHA PADRÃO SEDUCE","-",null,null,null,0,""]
[2,2,2,2,2,1,0,0,0,185,2,"","Nível 2","Nível 2","-","SINAPI",null,"SERVIÇOS PRELIMINARES","-",null,null,null,0,""]
["S",2,"S",0,2,1,0,0,0,0,0,"","Serviço","Serviço","-","AGETOP",20701,"LOCAÇÃO DA OBRA, EXECUÇÃO DE GABARITO SEM REAPROVEITAMENTO, INCLUSO PINTURA (FACE INTERNA DO RIPÃO 15CM) E PIQUETE COM TESTEMUNHA","m2    ",139.75,null,null,0,""]
[2,2,2,3,2,2,0,0,0,183,3,"","Nível 2","Nível 2","-","AGETOP",null,"TRANSPORTES","-",null,null,null,0,""]
["S",2,"S",0,2,2,0,0,0,0,0,"","Serviço","Serviço","-","SINAPI",72900,"TRANSPORTE DE ENTULHO COM CAMINHAO BASCULANTE 6 M3, RODOVIA PAVIMENTADA, DMT 0,5 A 1,0 KM","M3",10,null,null,0,""]
["S",2,"S",0,2,2,0,0,0,0,0,"","Serviço","Serviço","-","SINAPI",72897,"CARGA MANUAL DE ENTULHO EM CAMINHAO BASCULANTE 6 M3","M3",10,null,null,0,""]
[2,2,2,2,2,3,0,0,0,180,2,"","Nível 2","Nível 2","-","AGETOP",null,"SERVIÇO EM TERRA","-",null,null,null,0,""]
["S",2,"S",0,2,3,0,0,0,0,0,"","Serviço","Serviço","-","AGETOP",41002,"APILOAMENTO","m2    ",139.75,null,null,0,""]
[2,2,2,20,2,4,0,0,0,178,20,"","Nível 2","Nível 2","-","AGETOP",null,"FUNDAÇÕES E SONDAGENS","-",null,null,null,0,""]
[3,3,3,9,2,4,1,0,0,{"$f":"IF(OR($C402=\"S\",$C402=0),0,MATCH(0,OFFSET($D402,1,$C402,ROW($C$826)-ROW($C402)),0))","v":19},{"$f":"IF(OR($C402=\"S\",$C402=0),0,MATCH(OFFSET($D402,0,$C402)+1,OFFSET($D402,1,$C402,ROW($C$826)-ROW($C402)),0))","v":9},"","Nível 3","Nível 3","-","SINAPI",null,"ESTACAS E BLOCOS","-",null,null,null,0,""]
["S",3,"S",0,2,4,1,0,0,0,0,"","Serviço","Serviço","-","SINAPI",98230,"ESTACA BROCA DE CONCRETO, DIÂMETRO DE 30 CM, PROFUNDIDADE DE ATÉ 3 M, ESCAVAÇÃO MANUAL COM TRADO CONCHA, NÃO ARMADA. AF_03/2018","M",101.5,null,null,0,"Referência: AGETOP - 50302"]
["S",3,"S",0,2,4,1,0,0,0,0,"","Serviço","Serviço","-","SINAPI",96522,"ESCAVAÇÃO MANUAL PARA BLOCO DE COROAMENTO OU SAPATA, SEM PREVISÃO DE FÔRMA. AF_06/2017","M3",5.19,null,null,0,"Referência: AGETOP - 50901"]
["S",3,"S",0,2,4,1,0,0,0,0,"","Serviço","Serviço","-","SINAPI",94963,"CONCRETO FCK = 15MPA, TRAÇO 1:3,4:3,5 (CIMENTO/ AREIA MÉDIA/ BRITA 1)  - PREPARO MECÂNICO COM BETONEIRA 400 L. AF_07/2016","M3",3.4,null,null,0,""]
["S",3,"S",0,2,4,1,0,0,0,0,"","Serviço","Serviço","-","SINAPI","74157/4","LANCAMENTO/APLICACAO MANUAL DE CONCRETO EM FUNDACOES","M3",3.4,null,null,0,"Referência: AGETOP - 51055"]
["S",3,"S",0,2,4,1,0,0,0,0,"","Serviço","Serviço","-","AGETOP",60191,"FORMA DE TABUA CINTA BALDRAME U=8 VEZES","m2    ",23.7,null,null,0,""]
["S",3,"S",0,2,4,1,0,0,0,0,"","Serviço","Serviço","-","SINAPI",96543,"ARMAÇÃO DE BLOCO, VIGA BALDRAME E SAPATA UTILIZANDO AÇO CA-60 DE 5 MM - MONTAGEM. AF_06/2017","KG",98.2,null,null,0,"Referência: AGETOP - 52014"]
["S",3,"S",0,2,4,1,0,0,0,0,"","Serviço","Serviço","-","SINAPI",96546,"ARMAÇÃO DE BLOCO, VIGA BALDRAME OU SAPATA UTILIZANDO AÇO CA-50 DE 10 MM - MONTAGEM. AF_06/2017","KG",226.54,null,null,0,"Referência: AGETOP - 52005"]
["S",3,"S",0,2,4,1,0,0,0,0,"","Serviço","Serviço","-","SINAPI",96547,"ARMAÇÃO DE BLOCO, VIGA BALDRAME OU SAPATA UTILIZANDO AÇO CA-50 DE 12,5 MM - MONTAGEM. AF_06/2017","KG",240,null,null,0,"Referência: AGETOP - 52006"]
[3,3,3,8,2,4,2,0,0,10,8,"","Nível 3","Nível 3","-","SINAPI",null,"VIGAS BALDRAMES","-",null,null,null,0,""]
["S",3,"S",0,2,4,2,0,0,0,0,"","Serviço","Serviço","-","AGETOP",60191,"FORMA DE TABUA CINTA BALDRAME U=8 VEZES","m2    ",41.5,null,null,0,""]
[{"$f":"CHOOSE(1+LOG(1+2*(ORÇAMENTO.Nivel=\"Nível 1\")+4*(ORÇAMENTO.Nivel=\"Nível 2\")+8*(ORÇAMENTO.Nivel=\"Nível 3\")+16*(ORÇAMENTO.Nivel=\"Nível 4\")+32*(ORÇAMENTO.Nivel=\"Serviço\"),2),0,1,2,3,4,\"S\")","v":"S"},3,"S",0,2,4,2,0,{"$f":"IF(AND($C413<=4,$C413<>0),0,IF(AND($C413=\"S\",$W413>0),OFFSET(I413,-1,0)+1,OFFSET(I413,-1,0)))","v":0},0,0,"","Serviço","Serviço","-","SINAPI",94964,"CONCRETO FCK = 20MPA, TRAÇO 1:2,7:3 (CIMENTO/ AREIA MÉDIA/ BRITA 1)  - PREPARO MECÂNICO COM BETONEIRA 400 L. AF_07/2016","M3",2.4,null,null,0,""]
["S",3,"S",0,2,4,2,0,0,0,0,"","Serviço","Serviço","-","SINAPI","74157/4","LANCAMENTO/APLICACAO MANUAL DE CONCRETO EM FUNDACOES","M3",2.4,null,null,0,"Referência: AGETOP - 51055"]
["S",3,"S",0,2,4,2,0,0,0,0,"","Serviço","Serviço","-","SINAPI",96544,"ARMAÇÃO DE BLOCO, VIGA BALDRAME OU SAPATA UTILIZANDO AÇO CA-50 DE 6,3 MM - MONTAGEM. AF_06/2017","KG",47,null,null,0,"Referência: AGETOP - 52003"]
["S",3,"S",0,{"$f":"IF($C416=1,OFFSET(E416,-1,0)+1,OFFSET(E416,-1,0))","v":2},{"$f":"IF($C416=1,0,IF($C416=2,OFFSET(F416,-1,0)+1,OFFSET(F416,-1,0)))","v":4},{"$f":"IF(AND($C416<=2,$C416<>0),0,IF($C416=3,OFFSET(G416,-1,0)+1,OFFSET(G416,-1,0)))","v":2},{"$f":"IF(AND($C416<=3,$C416<>0),0,IF($C416=4,OFFSET(H416,-1,0)+1,OFFSET(H416,-1,0)))","v":0},0,0,0,"","Serviço","Serviço","-","SINAPI",96545,"ARMAÇÃO DE BLOCO, VIGA BALDRAME OU SAPATA UTILIZANDO AÇO CA-50 DE 8 MM - MONTAGEM. AF_06/2017","KG",49,null,null,0,"Referência: AGETOP - 52004"]
["S",3,"S",0,2,4,2,0,0,0,0,"","Serviço","Serviço","-","SINAPI",96546,"ARMAÇÃO DE BLOCO, VIGA BALDRAME OU SAPATA UTILIZANDO AÇO CA-50 DE 10 MM - MONTAGEM. AF_06/2017","KG",38,null,null,0,"Referência: AGETOP - 52005"]
["S",3,"S",0,2,4,2,0,0,0,0,"","Serviço","Serviço","-","SINAPI",96543,"ARMAÇÃO DE BLOCO, VIGA BALDRAME E SAPATA UTILIZANDO AÇO CA-60 DE 5 MM - MONTAGEM. AF_06/2017","KG",72,null,null,0,"Referência: AGETOP - 52014"]
[3,3,3,2,2,4,3,0,0,2,{"$error":"#N/A"},"","Nível 3","Nível 3","-","SINAPI",null,"OUTROS","-",null,null,null,0,""]
["S",3,"S",0,2,4,3,0,0,0,0,"","Serviço","Serviço","-","AGETOP",50101,"SONDAGENS P/INTERIOR - (OBRAS CIVIS)","m     ",28,null,null,0,""]
[2,2,2,20,2,5,0,0,0,158,20,"","Nível 2","Nível 2","-","AGETOP",null,"ESTRUTURA","-",null,null,null,0,""]
[3,{"$f":"IF(OR(C422=\"s\",C422=0),OFFSET(B422,-1,0),C422)","v":3},{"$f":"IF(OFFSET(C422,-1,0)=\"L\",1,IF(OFFSET(C422,-1,0)=1,2,IF(OR(A422=\"s\",A422=0),\"S\",IF(AND(OFFSET(C422,-1,0)=2,A422=4),3,IF(AND(OR(OFFSET(C422,-1,0)=\"s\",OFFSET(C422,-1,0)=0),A422<>\"s\",A422>OFFSET(B422,-1,0)),OFFSET(B422,-1,0),A422)))))","v":3},{"$f":"IF(OR(C422=\"S\",C422=0),0,IF(ISERROR(K422),J422,SMALL(J422:K422,1)))","v":8},2,5,1,0,0,19,8,"","Nível 3","Nível 3","-","AGETOP",null,"PILARES","-",null,null,null,0,""]
["S",3,"S",0,2,5,1,0,0,0,0,"","Serviço","Serviço","-","SINAPI",92426,"MONTAGEM E DESMONTAGEM DE FÔRMA DE PILARES RETANGULARES E ESTRUTURAS SIMILARES COM ÁREA MÉDIA DAS SEÇÕES MENOR OU IGUAL A 0,25 M², PÉ-DIREITO SIMPLES, EM CHAPA DE MADEIRA COMPENSADA RESINADA, 8 UTILIZAÇÕES. AF_12/2015","M2",59.6,null,null,0,""]
["S",3,"S",0,2,5,1,0,0,0,0,"","Serviço","Serviço","-","SINAPI",94964,"CONCRETO FCK = 20MPA, TRAÇO 1:2,7:3 (CIMENTO/ AREIA MÉDIA/ BRITA 1)  - PREPARO MECÂNICO COM BETONEIRA 400 L. AF_07/2016","M3",2.5,null,null,0,""]
["S",3,"S",0,2,5,1,0,0,0,0,"","Serviço","Serviço","-","SINAPI",92873,"LANÇAMENTO COM USO DE BALDES, ADENSAMENTO E ACABAMENTO DE CONCRETO EM ESTRUTURAS. AF_12/2015","M3",2.5,null,null,0,"Referência: AGETOP - 51055"]
["S",3,"S",0,2,5,1,0,0,0,0,"","Serviço","Serviço","-","SINAPI",92776,"ARMAÇÃO DE PILAR OU VIGA DE UMA ESTRUTURA CONVENCIONAL DE CONCRETO ARMADO EM UMA EDIFICAÇÃO TÉRREA OU SOBRADO UTILIZANDO AÇO CA-50 DE 6,3 MM - MONTAGEM. AF_12/2015","KG",42,null,null,0,"Referência: AGETOP - 60303"]
["S",3,"S",0,2,5,1,0,0,0,0,"","Serviço","Serviço","-","SINAPI",92777,"ARMAÇÃO DE PILAR OU VIGA DE UMA ESTRUTURA CONVENCIONAL DE CONCRETO ARMADO EM UMA EDIFICAÇÃO TÉRREA OU SOBRADO UTILIZANDO AÇO CA-50 DE 8,0 MM - MONTAGEM. AF_12/2015","KG",64,null,null,0,"Referência: AGETOP - 60304"]
["S",3,"S",0,2,5,1,0,0,0,0,"","Serviço","Serviço","-","SINAPI",92778,"ARMAÇÃO DE PILAR OU VIGA DE UMA ESTRUTURA CONVENCIONAL DE CONCRETO ARMADO EM UMA EDIFICAÇÃO TÉRREA OU SOBRADO UTILIZANDO AÇO CA-50 DE 10,0 MM - MONTAGEM. AF_12/2015","KG",165.46,null,null,0,"Referência: AGETOP - 60305"]
["S",3,"S",0,2,5,1,0,0,0,0,"","Serviço","Serviço","-","SINAPI",92775,"ARMAÇÃO DE PILAR OU VIGA DE UMA ESTRUTURA CONVENCIONAL DE CONCRETO ARMADO EM UMA EDIFICAÇÃO TÉRREA OU SOBRADO UTILIZANDO AÇO CA-60 DE 5,0 MM - MONTAGEM. AF_12/2015","KG",22.8,null,null,0,"Referência: AGETOP - 60314"]
[3,3,3,9,2,5,2,0,0,11,9,"","Nível 3","Nível 3","-",null,null,"VIGAS DE COBERTURA","-",null,null,null,0,""]
["S",3,"S",0,2,5,2,0,0,0,0,"","Serviço","Serviço","-","SINAPI",92464,"MONTAGEM E DESMONTAGEM DE FÔRMA DE VIGA, ESCORAMENTO METÁLICO, PÉ-DIREITO SIMPLES, EM CHAPA DE MADEIRA RESINADA, 8 UTILIZAÇÕES. AF_12/2015","M2",40.9,null,null,0,"Referência: AGETOP - 60204"]
["S",3,"S",0,2,5,2,0,0,0,0,"","Serviço","Serviço","-","SINAPI",94964,"CONCRETO FCK = 20MPA, TRAÇO 1:2,7:3 (CIMENTO/ AREIA MÉDIA/ BRITA 1)  - PREPARO MECÂNICO COM BETONEIRA 400 L. AF_07/2016","M3",2.4,null,null,0,""]
["S",3,"S",0,2,5,2,0,0,0,0,"","Serviço","Serviço","-","SINAPI",92873,"LANÇAMENTO COM USO DE BALDES, ADENSAMENTO E ACABAMENTO DE CONCRETO EM ESTRUTURAS. AF_12/2015","M3",2.4,null,null,0,"Referência: AGETOP - 51055"]
["S",3,"S",0,2,5,2,0,0,0,0,"","Serviço","Serviço","-","SINAPI",92776,"ARMAÇÃO DE PILAR OU VIGA DE UMA ESTRUTURA CONVENCIONAL DE CONCRETO ARMADO EM UMA EDIFICAÇÃO TÉRREA OU SOBRADO UTILIZANDO AÇO CA-50 DE 6,3 MM - MONTAGEM. AF_12/2015","KG",18,null,null,0,"Referência: AGETOP - 60303"]
["S",3,"S",0,2,5,2,0,0,0,0,"","Serviço","Serviço","-","SINAPI",92777,"ARMAÇÃO DE PILAR OU VIGA DE UMA ESTRUTURA CONVENCIONAL DE CONCRETO ARMADO EM UMA EDIFICAÇÃO TÉRREA OU SOBRADO UTILIZANDO AÇO CA-50 DE 8,0 MM - MONTAGEM. AF_12/2015","KG",35,null,null,0,"Referência: AGETOP - 60304"]
["S",3,"S",0,2,5,2,0,0,0,0,"","Serviço","Serviço","-","SINAPI",92778,"ARMAÇÃO DE PILAR OU VIGA DE UMA ESTRUTURA CONVENCIONAL DE CONCRETO ARMADO EM UMA EDIFICAÇÃO TÉRREA OU SOBRADO UTILIZANDO AÇO CA-50 DE 10,0 MM - MONTAGEM. AF_12/2015","KG",89,null,null,0,"Referência: AGETOP - 60305"]
["S",3,"S",0,2,5,2,0,0,0,0,"","Serviço","Serviço","-","SINAPI",92779,"ARMAÇÃO DE PILAR OU VIGA DE UMA ESTRUTURA CONVENCIONAL DE CONCRETO ARMADO EM UMA EDIFICAÇÃO TÉRREA OU SOBRADO UTILIZANDO AÇO CA-50 DE 12,5 MM - MONTAGEM. AF_12/2015","KG",24,null,null,0,"Referência: AGETOP - 60306"]
["S",3,"S",0,2,5,2,0,0,0,0,"","Serviço","Serviço","-","SINAPI",92775,"ARMAÇÃO DE PILAR OU VIGA DE UMA ESTRUTURA CONVENCIONAL DE CONCRETO ARMADO EM UMA EDIFICAÇÃO TÉRREA OU SOBRADO UTILIZANDO AÇO CA-60 DE 5,0 MM - MONTAGEM. AF_12/2015","KG",57,null,null,0,"Referência: AGETOP - 60314"]
[3,3,3,2,2,5,3,0,0,2,{"$error":"#N/A"},"","Nível 3","Nível 3","-",null,null,"LAJE","-",null,null,null,0,""]
["S",3,"S",0,2,5,3,0,0,0,0,"","Serviço","Serviço","-","SINAPI","74202/1","LAJE PRE-MOLDADA P/FORRO, SOBRECARGA 100KG/M2, VAOS ATE 3,50M/E=8CM, C/LAJOTAS E CAP.C/CONC FCK=20MPA, 3CM, INTER-EIXO 38CM, C/ESCORAMENTO (REAPR.3X) E FERRAGEM NEGATIVA","M2",40.75,null,null,0,""]
[2,2,2,28,2,6,0,0,0,138,28,"","Nível 2","Nível 2","-",null,null,"INSTALAÇÕES ELÉTRICAS","-",null,null,null,0,""]
["S",2,"S",0,2,6,0,0,0,0,0,"","Serviço","Serviço","-","AGETOP",70421,"BUCHA E ARRUELA METALICA DIAM. 3/4\"","PR    ",3,null,null,0,""]
["S",2,"S",0,2,6,0,0,0,0,0,"","Serviço","Serviço","-","SINAPI",92868,"CAIXA RETANGULAR 4\" X 2\" MÉDIA (1,30 M DO PISO), METÁLICA, INSTALADA EM PAREDE - FORNECIMENTO E INSTALAÇÃO. AF_12/2015","UN",26,null,null,0,"Referência: AGETOP - 70691"]
["S",2,"S",0,2,6,0,0,0,0,0,"","Serviço","Serviço","-","SINAPI",92866,"CAIXA SEXTAVADA 3\" X 3\", METÁLICA, INSTALADA EM LAJE - FORNECIMENTO E INSTALAÇÃO. AF_12/2015","UN",10,null,null,0,"Referência: AGETOP - 70680"]
["S",2,"S",0,2,6,0,0,0,0,0,"","Serviço","Serviço","-","SINAPI",91902,"CURVA 90 GRAUS PARA ELETRODUTO, PVC, ROSCÁVEL, DN 25 MM (3/4\"), PARA CIRCUITOS TERMINAIS, INSTALADA EM LAJE - FORNECIMENTO E INSTALAÇÃO. AF_12/2015","UN",6,null,null,0,"Referência: AGETOP - 71141"]
["S",2,"S",0,2,6,0,0,0,0,0,"","Serviço","Serviço","-","SINAPI",97585,"LUMINÁRIA TIPO CALHA, DE SOBREPOR, COM 2 LÂMPADAS TUBULARES DE 18 W - FORNECIMENTO E INSTALAÇÃO. AF_11/2017","UN",2,null,null,0,""]
["S",2,"S",0,2,6,0,0,0,0,0,"","Serviço","Serviço","-","SINAPI",97586,"LUMINÁRIA TIPO CALHA, DE SOBREPOR, COM 2 LÂMPADAS TUBULARES DE 36 W - FORNECIMENTO E INSTALAÇÃO. AF_11/2017","UN",14,null,null,0,""]
["S",2,"S",0,2,6,0,0,0,0,0,"","Serviço","Serviço","-","SINAPI",97584,"LUMINÁRIA TIPO CALHA, DE SOBREPOR, COM 1 LÂMPADA TUBULAR DE 36 W - FORNECIMENTO E INSTALAÇÃO. AF_11/2017","UN",2,null,null,0,""]
["S",2,"S",0,2,6,0,0,0,0,0,"","Serviço","Serviço","-","SINAPI",91884,"LUVA PARA ELETRODUTO, PVC, ROSCÁVEL, DN 25 MM (3/4\"), PARA CIRCUITOS TERMINAIS, INSTALADA EM PAREDE - FORNECIMENTO E INSTALAÇÃO. AF_12/2015","UN",3,null,null,0,"Referência: AGETOP - 71741"]
["S",2,"S",0,2,6,0,0,0,0,0,"","Serviço","Serviço","-","SINAPI",91927,"CABO DE COBRE FLEXÍVEL ISOLADO, 2,5 MM², ANTI-CHAMA 0,6/1,0 KV, PARA CIRCUITOS TERMINAIS - FORNECIMENTO E INSTALAÇÃO. AF_12/2015","M",723.31000000000006,null,null,0,"Referência: AGETOP - 70581"]
["S",2,"S",0,2,6,0,0,0,0,0,"","Serviço","Serviço","-","SINAPI",91931,"CABO DE COBRE FLEXÍVEL ISOLADO, 6 MM², ANTI-CHAMA 0,6/1,0 KV, PARA CIRCUITOS TERMINAIS - FORNECIMENTO E INSTALAÇÃO. AF_12/2015","M",60.8,null,null,0,"Referência: AGETOP - 70583"]
["S",2,"S",0,2,6,0,0,0,0,0,"","Serviço","Serviço","-","SINAPI",93654,"DISJUNTOR MONOPOLAR TIPO DIN, CORRENTE NOMINAL DE 16A - FORNECIMENTO E INSTALAÇÃO. AF_04/2016","UN",11,null,null,0,""]
["S",2,"S",0,2,6,0,0,0,0,0,"","Serviço","Serviço","-","SINAPI",93656,"DISJUNTOR MONOPOLAR TIPO DIN, CORRENTE NOMINAL DE 25A - FORNECIMENTO E INSTALAÇÃO. AF_04/2016","UN",1,null,null,0,""]
["S",2,"S",0,2,6,0,0,0,0,0,"","Serviço","Serviço","-","SINAPI",93673,"DISJUNTOR TRIPOLAR TIPO DIN, CORRENTE NOMINAL DE 50A - FORNECIMENTO E INSTALAÇÃO. AF_04/2016","UN",1,null,null,0,"Referência: AGETOP - 71172"]
["S",2,"S",0,2,6,0,0,0,0,0,"","Serviço","Serviço","-","AGETOP",71456,"INTERRUPTOR DIFERENCIAL RESIDUAL (D.R.) TETRAPOLAR DE 40A-30mA","Un    ",1,null,null,0,"Referência: AGETOP - 71450"]
["S",2,"S",0,2,6,0,0,0,0,0,"","Serviço","Serviço","-","SINAPI",91844,"ELETRODUTO FLEXÍVEL CORRUGADO, PVC, DN 25 MM (3/4\"), PARA CIRCUITOS TERMINAIS, INSTALADO EM LAJE - FORNECIMENTO E INSTALAÇÃO. AF_12/2015","M",96.82,null,null,0,""]
["S",2,"S",0,2,6,0,0,0,0,0,"","Serviço","Serviço","-","SINAPI",91846,"ELETRODUTO FLEXÍVEL CORRUGADO, PVC, DN 32 MM (1\"), PARA CIRCUITOS TERMINAIS, INSTALADO EM LAJE - FORNECIMENTO E INSTALAÇÃO. AF_12/2015","M",10.1,null,null,0,""]
["S",2,"S",0,2,6,0,0,0,0,0,"","Serviço","Serviço","-","SINAPI","73798/1","DUTO ESPIRAL FLEXIVEL SINGELO PEAD D=50MM(2\") REVESTIDO COM PVC COM FIO GUIA DE ACO GALVANIZADO, LANCADO DIRETO NO SOLO, INCL CONEXOES","M",31.1,null,null,0,"Referência: AGETOP - 71197"]
["S",2,"S",0,2,6,0,0,0,0,0,"","Serviço","Serviço","-","COMPOSIÇÃO","COMP 387_SEE","LÂMPADA LED TUBULAR 18W ","UN ",29,null,null,0,""]
["S",2,"S",0,2,6,0,0,0,0,0,"","Serviço","Serviço","-","SINAPI",97611,"LÂMPADA COMPACTA FLUORESCENTE DE 15 W, BASE E27 - FORNECIMENTO E INSTALAÇÃO. AF_11/2017","UN",2,null,null,0,"Referência: AGETOP - 71567"]
["S",2,"S",0,2,6,0,0,0,0,0,"","Serviço","Serviço","-","SINAPI",92000,"TOMADA BAIXA DE EMBUTIR (1 MÓDULO), 2P+T 10 A, INCLUINDO SUPORTE E PLACA - FORNECIMENTO E INSTALAÇÃO. AF_12/2015","UN",3,null,null,0,"Referência: AGETOP - 72578"]
["S",2,"S",0,2,6,0,0,0,0,0,"","Serviço","Serviço","-","SINAPI",91996,"TOMADA MÉDIA DE EMBUTIR (1 MÓDULO), 2P+T 10 A, INCLUINDO SUPORTE E PLACA - FORNECIMENTO E INSTALAÇÃO. AF_12/2015","UN",14,null,null,0,"Referência: AGETOP - 72578"]
["S",2,"S",0,2,6,0,0,0,0,0,"","Serviço","Serviço","-","SINAPI",91992,"TOMADA ALTA DE EMBUTIR (1 MÓDULO), 2P+T 10 A, INCLUINDO SUPORTE E PLACA - FORNECIMENTO E INSTALAÇÃO. AF_12/2015","UN",1,null,null,0,"Referência: AGETOP - 72578"]
["S",2,"S",0,2,6,0,0,0,0,0,"","Serviço","Serviço","-","SINAPI",91955,"INTERRUPTOR PARALELO (1 MÓDULO), 10A/250V, INCLUINDO SUPORTE E PLACA - FORNECIMENTO E INSTALAÇÃO. AF_12/2015","UN",4,null,null,0,"Referência: AGETOP - 71431"]
["S",2,"S",0,2,6,0,0,0,0,0,"","Serviço","Serviço","-","SINAPI",91953,"INTERRUPTOR SIMPLES (1 MÓDULO), 10A/250V, INCLUINDO SUPORTE E PLACA - FORNECIMENTO E INSTALAÇÃO. AF_12/2015","UN",5,null,null,0,"Referência: AGETOP - 71440"]
["S",2,"S",0,2,6,0,0,0,{"$f":"IF(OR($C466=\"S\",$C466=0),0,MATCH(0,OFFSET($D466,1,$C466,ROW($C$826)-ROW($C466)),0))","v":0},{"$f":"IF(OR($C466=\"S\",$C466=0),0,MATCH(OFFSET($D466,0,$C466)+1,OFFSET($D466,1,$C466,ROW($C$826)-ROW($C466)),0))","v":0},"","Serviço","Serviço","-","SINAPI",91959,"INTERRUPTOR SIMPLES (2 MÓDULOS), 10A/250V, INCLUINDO SUPORTE E PLACA - FORNECIMENTO E INSTALAÇÃO. AF_12/2015","UN",1,null,null,0,"Referência: AGETOP - 71441"]
["S",2,"S",0,2,6,0,0,0,0,0,"","Serviço","Serviço","-","SINAPI",96986,"HASTE DE ATERRAMENTO 3/4  PARA SPDA - FORNECIMENTO E INSTALAÇÃO. AF_12/2017","UN",3,null,null,0,"Referência: AGETOP - 71380"]
["S",2,"S",0,2,6,0,0,0,0,0,"","Serviço","Serviço","-","SINAPI","74131/4","QUADRO DE DISTRIBUICAO DE ENERGIA DE EMBUTIR, EM CHAPA METALICA, PARA 18 DISJUNTORES TERMOMAGNETICOS MONOPOLARES, COM BARRAMENTO TRIFASICO E NEUTRO, FORNECIMENTO E INSTALACAO","UN",1,null,null,0,""]
[2,2,2,60,2,7,0,0,0,110,60,"","Nível 2","Nível 2","-",null,null,"INSTALAÇÕES HIDROSSANITÁRIAS","-",null,null,null,0,""]
["S",2,"S",0,2,7,0,0,0,0,0,"","Serviço","Serviço","-","AGETOP",80502,"VASO SANITARIO","Un    ",1,null,null,0,""]
["S",2,"S",0,2,7,0,0,0,0,0,"","Serviço","Serviço","-","AGETOP",80510,"ANEL DE VEDAÇÃO PARA VASO SANITÁRIO","Un    ",1,null,null,0,""]
["S",2,"S",0,2,7,0,0,0,0,0,"","Serviço","Serviço","-","AGETOP",80513,"TUBO PARA VÁLVULA DE DESCARGA ( CURTO 1.1/4\" )","Un    ",1,null,null,0,""]
["S",2,"S",0,2,7,0,0,0,0,0,"","Serviço","Serviço","-","AGETOP",80514,"TUBO DE LIGACAO PVC CROMADO 1.1/2\" / ESPUDE  - (ENTRADA)","Un    ",1,null,null,0,""]
["S",2,"S",0,2,7,0,0,0,0,0,"","Serviço","Serviço","-","AGETOP",80517,"VÁLVULA DE DESCARGA DUPLO ACIONAMENTO COM ACABAMENTO CROMADO ANTIVANDALISMO","Un    ",1,null,null,0,""]
["S",2,"S",0,2,7,0,0,0,0,0,"","Serviço","Serviço","-","AGETOP",80520,"CONJUNTO DE FIXACAO P/VASO SANITARIO (PAR)","CJ    ",1,null,null,0,""]
["S",2,"S",0,2,7,0,0,0,0,0,"","Serviço","Serviço","-","AGETOP",80526,"ASSENTO EM POLIPROPILENO COM SISTEMA DE FECHAMENTO SUAVE PARA VASO SANITÁRIO","Un    ",1,null,null,0,""]
[{"$f":"CHOOSE(1+LOG(1+2*(ORÇAMENTO.Nivel=\"Nível 1\")+4*(ORÇAMENTO.Nivel=\"Nível 2\")+8*(ORÇAMENTO.Nivel=\"Nível 3\")+16*(ORÇAMENTO.Nivel=\"Nível 4\")+32*(ORÇAMENTO.Nivel=\"Serviço\"),2),0,1,2,3,4,\"S\")","v":"S"},2,"S",0,2,7,0,0,{"$f":"IF(AND($C477<=4,$C477<>0),0,IF(AND($C477=\"S\",$W477>0),OFFSET(I477,-1,0)+1,OFFSET(I477,-1,0)))","v":0},0,0,"","Serviço","Serviço","-","SINAPI",95544,"PAPELEIRA DE PAREDE EM METAL CROMADO SEM TAMPA, INCLUSO FIXAÇÃO. AF_10/2016","UN",1,null,null,0,""]
["S",2,"S",0,2,7,0,0,0,0,0,"","Serviço","Serviço","-","COMPOSIÇÃO","COMP 209_SEE","TOALHEIRO PLÁSTICO TIPO DISPENSER PARA PAPEL TOALHA INTERFOLHADO","UN ",1,null,null,0,""]
["S",2,"S",0,2,7,0,0,0,0,0,"","Serviço","Serviço","-","AGETOP",80542,"LAVATÓRIO MÉDIO SEM COLUNA","Un    ",2,null,null,0,""]
["S",2,"S",0,{"$f":"IF($C480=1,OFFSET(E480,-1,0)+1,OFFSET(E480,-1,0))","v":2},{"$f":"IF($C480=1,0,IF($C480=2,OFFSET(F480,-1,0)+1,OFFSET(F480,-1,0)))","v":7},{"$f":"IF(AND($C480<=2,$C480<>0),0,IF($C480=3,OFFSET(G480,-1,0)+1,OFFSET(G480,-1,0)))","v":0},{"$f":"IF(AND($C480<=3,$C480<>0),0,IF($C480=4,OFFSET(H480,-1,0)+1,OFFSET(H480,-1,0)))","v":0},0,0,0,"","Serviço","Serviço","-","AGETOP",80550,"FIXACAO P/LAVATORIO (PAR)","PAR   ",2,null,null,0,""]
["S",2,"S",0,2,7,0,0,0,0,0,"","Serviço","Serviço","-","SINAPI",86885,"ENGATE FLEXÍVEL EM PLÁSTICO BRANCO, 1/2\" X 40CM - FORNECIMENTO E INSTALAÇÃO. AF_12/2013","UN",2,null,null,0,""]
["S",2,"S",0,2,7,0,0,0,0,0,"","Serviço","Serviço","-","SINAPI",86883,"SIFÃO DO TIPO FLEXÍVEL EM PVC 1\u0094 X 1.1/2\u0094 - FORNECIMENTO E INSTALAÇÃO. AF_12/2013","UN",2,null,null,0,""]
["S",2,"S",0,2,7,0,0,0,0,0,"","Serviço","Serviço","-","SINAPI",86906,"TORNEIRA CROMADA DE MESA, 1/2\" OU 3/4\", PARA LAVATÓRIO, PADRÃO POPULAR - FORNECIMENTO E INSTALAÇÃO. AF_12/2013","UN",2,null,null,0,"Referência: AGETOP - 80570"]
["S",2,"S",0,2,7,0,0,0,0,0,"","Serviço","Serviço","-","AGETOP",80580,"VALVULA P/LAVATORIO OU BEBEDOURO METALICO DIAMETRO 1\"","Un    ",2,null,null,0,""]
["S",2,"S",0,2,7,0,0,0,0,0,"","Serviço","Serviço","-","SINAPI",86911,"TORNEIRA CROMADA LONGA, DE PAREDE, 1/2\" OU 3/4\", PARA PIA DE COZINHA, PADRÃO POPULAR - FORNECIMENTO E INSTALAÇÃO. AF_12/2013","UN",5,null,null,0,""]
["S",{"$f":"IF(OR(C486=\"s\",C486=0),OFFSET(B486,-1,0),C486)","v":2},{"$f":"IF(OFFSET(C486,-1,0)=\"L\",1,IF(OFFSET(C486,-1,0)=1,2,IF(OR(A486=\"s\",A486=0),\"S\",IF(AND(OFFSET(C486,-1,0)=2,A486=4),3,IF(AND(OR(OFFSET(C486,-1,0)=\"s\",OFFSET(C486,-1,0)=0),A486<>\"s\",A486>OFFSET(B486,-1,0)),OFFSET(B486,-1,0),A486)))))","v":"S"},{"$f":"IF(OR(C486=\"S\",C486=0),0,IF(ISERROR(K486),J486,SMALL(J486:K486,1)))","v":0},2,7,0,0,0,0,0,"","Serviço","Serviço","-","AGETOP",80671,"SIFAO PVC P/PIA 1.1/2\" X 2\"","Un    ",5,null,null,0,""]
["S",2,"S",0,2,7,0,0,0,0,0,"","Serviço","Serviço","-","SINAPI",86878,"VÁLVULA EM METAL CROMADO TIPO AMERICANA 3.1/2\" X 1.1/2\" PARA PIA - FORNECIMENTO E INSTALAÇÃO. AF_12/2013","UN",5,null,null,0,""]
["S",2,"S",0,2,7,0,0,0,0,0,"","Serviço","Serviço","-","AGETOP",80687,"CUBA INOX 35X40X15CM E=0,6MM-AÇO 304 (CUBA Nº 3)","Un    ",4,null,null,0,""]
["S",2,"S",0,2,7,0,0,0,0,0,"","Serviço","Serviço","-","AGETOP",80693,"TANQUE (PANELAO) INOX 60 X 70 X 40 CM CH.18","Un    ",1,null,null,0,""]
["S",2,"S",0,2,7,0,0,0,0,0,"","Serviço","Serviço","-","AGETOP",80819,"SIFÃO METÁLICO PARA TANQUE DE 1 1/4\" X 1 1/2\"","un    ",1,null,null,0,""]
["S",2,"S",0,2,7,0,0,0,0,0,"","Serviço","Serviço","-","AGETOP",80830,"VALVULA P/TANQUE METALICA DIAM.1\" S/LADRAO","Un    ",1,null,null,0,""]
["S",2,"S",0,2,7,0,0,0,0,0,"","Serviço","Serviço","-","AGETOP",81846,"CAIXA DE GORDURA E INSPEÇÃO EM PVC/ABS 19 LITROS COM TAMPA E PORTA TAMPA E CESTO DE LIMPEZA REMOVÍVEL","un    ",1,null,null,0,""]
["S",2,"S",0,2,7,0,0,0,0,0,"","Serviço","Serviço","-","SINAPI",94495,"REGISTRO DE GAVETA BRUTO, LATÃO, ROSCÁVEL, 1\u0094, INSTALADO EM RESERVAÇÃO DE ÁGUA DE EDIFICAÇÃO QUE POSSUA RESERVATÓRIO DE FIBRA/FIBROCIMENTO \u0096 FORNECIMENTO E INSTALAÇÃO. AF_06/2016","UN",1,null,null,0,"Referência: AGETOP - 80903"]
["S",2,"S",0,2,7,0,0,0,0,0,"","Serviço","Serviço","-","SINAPI",89353,"REGISTRO DE GAVETA BRUTO, LATÃO, ROSCÁVEL, 3/4\", FORNECIDO E INSTALADO EM RAMAL DE ÁGUA. AF_12/2014","UN",4,null,null,0,"Referência: AGETOP - 80902"]
["S",2,"S",0,2,7,0,0,0,0,0,"","Serviço","Serviço","-","SINAPI",95141,"ADAPTADOR COM FLANGES LIVRES, PVC, SOLDÁVEL LONGO, DN  25 MM X 3/4 , INSTALADO EM RESERVAÇÃO DE ÁGUA DE EDIFICAÇÃO QUE POSSUA RESERVATÓRIO DE FIBRA/FIBROCIMENTO    FORNECIMENTO E INSTALAÇÃO. AF_06/2016","UN",14,null,null,0,"Referência: AGETOP - 81041"]
["S",2,"S",0,2,7,0,0,0,0,0,"","Serviço","Serviço","-","SINAPI",94785,"ADAPTADOR COM FLANGES LIVRES, PVC, SOLDÁVEL LONGO, DN 32 MM X 1 , INSTALADO EM RESERVAÇÃO DE ÁGUA DE EDIFICAÇÃO QUE POSSUA RESERVATÓRIO DE FIBRA/FIBROCIMENTO   FORNECIMENTO E INSTALAÇÃO. AF_06/2016","UN",2,null,null,0,"Referência: AGETOP - 81042"]
["S",2,"S",0,2,7,0,0,0,0,0,"","Serviço","Serviço","-","AGETOP",81504,"SOLUCAO LIMPADORA 1000 CM3","Un    ",5,null,null,0,""]
["S",2,"S",0,2,7,0,0,0,0,0,"","Serviço","Serviço","-","AGETOP",81663,"CORPO CX. SIFONADA DIAM. 150 X 150 X 50","Un    ",2,null,null,0,""]
["S",2,"S",0,2,7,0,0,0,0,0,"","Serviço","Serviço","-","SINAPI",89708,"CAIXA SIFONADA, PVC, DN 150 X 185 X 75 MM, JUNTA ELÁSTICA, FORNECIDA E INSTALADA EM RAMAL DE DESCARGA OU EM RAMAL DE ESGOTO SANITÁRIO. AF_12/2014","UN",2,null,null,0,"Referência: AGETOP - 81664"]
["S",2,"S",0,2,7,0,0,0,0,0,"","Serviço","Serviço","-","AGETOP",81771,"GRELHA QUADRADA BRANCA DIAM. 150 MM","Un    ",2,null,null,0,""]
["S",2,"S",0,2,7,0,0,0,0,0,"","Serviço","Serviço","-","AGETOP",81885,"TERMINAL DE VENTILACAO DIAMETRO 50 MM","Un    ",1,null,null,0,""]
["S",2,"S",0,2,7,0,0,0,0,0,"","Serviço","Serviço","-","AGETOP",81831,"CAIXA DE INSPEÇÃO - ALVENARIA DE 1/2 VEZ COM REVESTIMENTO INTERNO EM REBOCO PAULISTA A-14 (COM ADIÇÃO DE IMPERMEABILIZANTE)","m2    ",3,null,null,0,""]
["S",2,"S",0,2,7,0,0,0,0,0,"","Serviço","Serviço","-","AGETOP",81825,"CAIXA DE PASSAGEM 60 X 60 CM SEM TAMPA","Un    ",5,null,null,0,""]
["S",2,"S",0,2,7,0,0,0,0,0,"","Serviço","Serviço","-","AGETOP",81826,"TAMPA EM CONCRETO ARMADO 25 MPA E=5CM PARA A CAIXA DE PASSAGEM 60X60CM","Un    ",5,null,null,0,""]
["S",2,"S",0,2,7,0,0,0,0,0,"","Serviço","Serviço","-","SINAPI",89402,"TUBO, PVC, SOLDÁVEL, DN 25MM, INSTALADO EM RAMAL DE DISTRIBUIÇÃO DE ÁGUA - FORNECIMENTO E INSTALAÇÃO. AF_12/2014","M",25,null,null,0,"Referência: AGETOP - 81003"]
["S",2,"S",0,2,7,0,0,0,0,0,"","Serviço","Serviço","-","SINAPI",89403,"TUBO, PVC, SOLDÁVEL, DN 32MM, INSTALADO EM RAMAL DE DISTRIBUIÇÃO DE ÁGUA - FORNECIMENTO E INSTALAÇÃO. AF_12/2014","M",20,null,null,0,"Referência: AGETOP - 81004"]
["S",2,"S",0,2,7,0,0,0,0,0,"","Serviço","Serviço","-","SINAPI",89617,"TE, PVC, SOLDÁVEL, DN 25MM, INSTALADO EM PRUMADA DE ÁGUA - FORNECIMENTO E INSTALAÇÃO. AF_12/2014","UN",3,null,null,0,""]
["S",2,"S",0,2,7,0,0,0,0,0,"","Serviço","Serviço","-","SINAPI",89620,"TE, PVC, SOLDÁVEL, DN 32MM, INSTALADO EM PRUMADA DE ÁGUA - FORNECIMENTO E INSTALAÇÃO. AF_12/2014","UN",3,null,null,0,"Referência: AGETOP - 81403"]
["S",2,"S",0,2,7,0,0,0,0,0,"","Serviço","Serviço","-","SINAPI",89622,"TÊ DE REDUÇÃO, PVC, SOLDÁVEL, DN 32MM X 25MM, INSTALADO EM PRUMADA DE ÁGUA - FORNECIMENTO E INSTALAÇÃO. AF_12/2014","UN",2,null,null,0,"Referência: AGETOP - 81421"]
["S",2,"S",0,2,7,0,0,0,0,0,"","Serviço","Serviço","-","SINAPI",89802,"JOELHO 45 GRAUS, PVC, SERIE NORMAL, ESGOTO PREDIAL, DN 50 MM, JUNTA ELÁSTICA, FORNECIDO E INSTALADO EM PRUMADA DE ESGOTO SANITÁRIO OU VENTILAÇÃO. AF_12/2014","UN",7,null,null,0,""]
["S",2,"S",0,2,7,0,0,0,0,0,"","Serviço","Serviço","-","SINAPI",89724,"JOELHO 90 GRAUS, PVC, SERIE NORMAL, ESGOTO PREDIAL, DN 40 MM, JUNTA SOLDÁVEL, FORNECIDO E INSTALADO EM RAMAL DE DESCARGA OU RAMAL DE ESGOTO SANITÁRIO. AF_12/2014","UN",12,null,null,0,""]
["S",2,"S",0,2,7,0,0,0,0,0,"","Serviço","Serviço","-","SINAPI",89731,"JOELHO 90 GRAUS, PVC, SERIE NORMAL, ESGOTO PREDIAL, DN 50 MM, JUNTA ELÁSTICA, FORNECIDO E INSTALADO EM RAMAL DE DESCARGA OU RAMAL DE ESGOTO SANITÁRIO. AF_12/2014","UN",3,null,null,0,""]
["S",2,"S",0,2,7,0,0,0,0,0,"","Serviço","Serviço","-","AGETOP",81973,"JUNCAO SIMPLES DIAM. 100 X 50 MM","Un    ",1,null,null,0,""]
["S",2,"S",0,2,7,0,0,0,0,0,"","Serviço","Serviço","-","SINAPI",89834,"JUNÇÃO SIMPLES, PVC, SERIE NORMAL, ESGOTO PREDIAL, DN 100 X 100 MM, JUNTA ELÁSTICA, FORNECIDO E INSTALADO EM PRUMADA DE ESGOTO SANITÁRIO OU VENTILAÇÃO. AF_12/2014","UN",1,null,null,0,"Referência: AGETOP - 81975"]
["S",2,"S",0,2,7,0,0,0,0,0,"","Serviço","Serviço","-","AGETOP",81981,"JUNÇÃO DUPLA DIAMETRO 75 MM","Un    ",1,null,null,0,""]
["S",2,"S",0,2,7,0,0,0,0,0,"","Serviço","Serviço","-","SINAPI",89753,"LUVA SIMPLES, PVC, SERIE NORMAL, ESGOTO PREDIAL, DN 50 MM, JUNTA ELÁSTICA, FORNECIDO E INSTALADO EM RAMAL DE DESCARGA OU RAMAL DE ESGOTO SANITÁRIO. AF_12/2014","UN",8,null,null,0,"Referência: AGETOP - 82002"]
["S",2,"S",0,2,7,0,0,0,0,0,"","Serviço","Serviço","-","SINAPI",89778,"LUVA SIMPLES, PVC, SERIE NORMAL, ESGOTO PREDIAL, DN 100 MM, JUNTA ELÁSTICA, FORNECIDO E INSTALADO EM RAMAL DE DESCARGA OU RAMAL DE ESGOTO SANITÁRIO. AF_12/2014","UN",2,null,null,0,"Referência: AGETOP - 82004"]
["S",2,"S",0,2,7,0,0,0,0,0,"","Serviço","Serviço","-","AGETOP",82051,"PORTA GRELHA QUADRADA BRANCO DIAM. 150 MM","Un    ",2,null,null,0,""]
["S",2,"S",0,2,7,0,0,0,0,0,"","Serviço","Serviço","-","AGETOP",82103,"REDUCAO EXCENTRICA 100 X 50 MM","Un    ",1,null,null,0,""]
["S",2,"S",0,2,7,0,0,0,0,0,"","Serviço","Serviço","-","AGETOP",82233,"TE SANITARIO DIAMETRO 100 X 50 MM","Un    ",1,null,null,0,""]
["S",2,"S",0,2,7,0,0,0,0,0,"","Serviço","Serviço","-","SINAPI",89711,"TUBO PVC, SERIE NORMAL, ESGOTO PREDIAL, DN 40 MM, FORNECIDO E INSTALADO EM RAMAL DE DESCARGA OU RAMAL DE ESGOTO SANITÁRIO. AF_12/2014","M",14,null,null,0,"Referência: AGETOP - 82301"]
["S",2,"S",0,2,7,0,0,0,0,0,"","Serviço","Serviço","-","SINAPI",89712,"TUBO PVC, SERIE NORMAL, ESGOTO PREDIAL, DN 50 MM, FORNECIDO E INSTALADO EM RAMAL DE DESCARGA OU RAMAL DE ESGOTO SANITÁRIO. AF_12/2014","M",26,null,null,0,"Referência: AGETOP - 82302"]
["S",2,"S",0,2,7,0,0,0,0,0,"","Serviço","Serviço","-","AGETOP",82374,"TUBO FERRO GALVANIZADO DIAM.3/4\"","m     ",10,null,null,0,""]
["S",2,"S",0,2,7,0,0,0,0,0,"","Serviço","Serviço","-","SINAPI",83635,"EXTINTOR INCENDIO TP PO QUIMICO 6KG - FORNECIMENTO E INSTALACAO","UN",1,null,null,0,"Referência: AGETOP - 85003"]
["S",2,"S",0,2,7,0,0,0,0,0,"","Serviço","Serviço","-","SINAPI",96702,"BUCHA DE REDUÇÃO, PPR, 32 X 25, CLASSE PN 25, INSTALADO EM PRUMADA DE ÁGUA \u0096 FORNECIMENTO E INSTALAÇÃO . AF_06/2015","UN",25,null,null,0,"Referência: AGETOP - 81162"]
["S",2,"S",0,2,7,0,0,0,0,0,"","Serviço","Serviço","-","SINAPI",94672,"JOELHO 90 GRAUS COM BUCHA DE LATÃO, PVC, SOLDÁVEL, DN  25 MM, X 3/4\u0094 INSTALADO EM RESERVAÇÃO DE ÁGUA DE EDIFICAÇÃO QUE POSSUA RESERVATÓRIO DE FIBRA/FIBROCIMENTO   FORNECIMENTO E INSTALAÇÃO. AF_06/2016","UN",6,null,null,0,""]
["S",2,"S",0,2,7,0,0,0,0,0,"","Serviço","Serviço","-","SINAPI",89362,"JOELHO 90 GRAUS, PVC, SOLDÁVEL, DN 25MM, INSTALADO EM RAMAL OU SUB-RAMAL DE ÁGUA - FORNECIMENTO E INSTALAÇÃO. AF_12/2014","UN",6,null,null,0,"Referência: AGETOP - 81321"]
["S",2,"S",0,2,7,0,0,0,0,0,"","Serviço","Serviço","-","SINAPI",89546,"BUCHA DE REDUÇÃO LONGA, PVC, SERIE R, ÁGUA PLUVIAL, DN 50 X 40 MM, JUNTA ELÁSTICA, FORNECIDO E INSTALADO EM RAMAL DE ENCAMINHAMENTO. AF_12/2014","UN",6,null,null,0,"Referência: AGETOP - 81602"]
[2,2,2,5,2,8,0,0,0,50,5,"","Nível 2","Nível 2","-",null,null,"ALVENARIAS E DIVISÓRIAS","-",null,null,null,0,""]
["S",2,"S",0,2,8,0,0,0,{"$f":"IF(OR($C530=\"S\",$C530=0),0,MATCH(0,OFFSET($D530,1,$C530,ROW($C$826)-ROW($C530)),0))","v":0},{"$f":"IF(OR($C530=\"S\",$C530=0),0,MATCH(OFFSET($D530,0,$C530)+1,OFFSET($D530,1,$C530,ROW($C$826)-ROW($C530)),0))","v":0},"","Serviço","Serviço","-","SINAPI","73937/1","COBOGO DE CONCRETO (ELEMENTO VAZADO), 7X50X50CM, ASSENTADO COM ARGAMASSA TRACO 1:4 (CIMENTO E AREIA)","M2",16.3,null,null,0,"Referência: AGETOP - 100501"]
["S",2,"S",0,2,8,0,0,0,0,0,"","Serviço","Serviço","-","SINAPI",72132,"ALVENARIA EM TIJOLO CERAMICO MACICO 5X10X20CM 1/2 VEZ (ESPESSURA 10CM), ASSENTADO COM ARGAMASSA TRACO 1:2:8 (CIMENTO, CAL E AREIA)","M2",17.11,null,null,0,""]
["S",2,"S",0,2,8,0,0,0,0,0,"","Serviço","Serviço","-","SINAPI",87489,"ALVENARIA DE VEDAÇÃO DE BLOCOS CERÂMICOS FURADOS NA VERTICAL DE 9X19X39CM (ESPESSURA 9CM) DE PAREDES COM ÁREA LÍQUIDA MAIOR OU IGUAL A 6M² COM VÃOS E ARGAMASSA DE ASSENTAMENTO COM PREPARO EM BETONEIRA. AF_06/2014","M2",142.08000000000001,null,null,0,"Referência: AGETOP - 100201"]
["S",2,"S",0,2,8,0,0,0,0,0,"","Serviço","Serviço","-","SINAPI",93202,"FIXAÇÃO (ENCUNHAMENTO) DE ALVENARIA DE VEDAÇÃO COM TIJOLO MACIÇO. AF_03/2016","M",27,null,null,0,"Referência: AGETOP - 100204"]
[2,2,2,2,2,9,0,0,0,45,2,"","Nível 2","Nível 2","-",null,null,"IMPERMEABILIZAÇÃO","-",null,null,null,0,""]
["S",2,"S",0,2,9,0,0,0,0,0,"","Serviço","Serviço","-","SINAPI",98562,"IMPERMEABILIZAÇÃO DE FLOREIRA OU VIGA BALDRAME COM ARGAMASSA DE CIMENTO E AREIA, COM ADITIVO IMPERMEABILIZANTE, E = 2 CM. AF_06/2018","M2",43.03,null,null,0,"Referência: AGETOP - 120902"]
[2,2,2,2,2,10,0,0,0,43,2,"","Nível 2","Nível 2","-",null,null,"ESTRUTURAS METÁLICAS","-",null,null,null,0,""]
["S",2,"S",0,2,10,0,0,0,0,0,"","Serviço","Serviço","-","AGETOP",150103,"ESTRUTURA METÁLICA CONVENCIONAL EM AÇO DO TIPO USI SAC-300 COM FUNDO ANTICORROSIVO","Kg    ",1956.5,null,null,0,""]
[2,2,2,6,2,11,0,0,0,41,6,"","Nível 2","Nível 2","-",null,null,"COBERTURAS","-",null,null,null,0,""]
[3,3,3,5,2,11,1,0,0,5,22,"","Nível 3","Nível 3","-",null,null,"CERÂMICA","-",null,null,null,0,""]
["S",3,"S",0,2,11,1,0,0,0,0,"","Serviço","Serviço","-","SINAPI",94445,"TELHAMENTO COM TELHA CERÂMICA CAPA-CANAL, TIPO PLAN, COM ATÉ 2 ÁGUAS, INCLUSO TRANSPORTE VERTICAL. AF_06/2016","M2",182.07,null,null,0,"Referência: AGETOP - 160401"]
[{"$f":"CHOOSE(1+LOG(1+2*(ORÇAMENTO.Nivel=\"Nível 1\")+4*(ORÇAMENTO.Nivel=\"Nível 2\")+8*(ORÇAMENTO.Nivel=\"Nível 3\")+16*(ORÇAMENTO.Nivel=\"Nível 4\")+32*(ORÇAMENTO.Nivel=\"Serviço\"),2),0,1,2,3,4,\"S\")","v":"S"},3,"S",0,2,11,1,0,{"$f":"IF(AND($C541<=4,$C541<>0),0,IF(AND($C541=\"S\",$W541>0),OFFSET(I541,-1,0)+1,OFFSET(I541,-1,0)))","v":0},0,0,"","Serviço","Serviço","-","SINAPI",94221,"CUMEEIRA PARA TELHA CERÂMICA EMBOÇADA COM ARGAMASSA TRAÇO 1:2:9 (CIMENTO, CAL E AREIA) PARA TELHADOS COM ATÉ 2 ÁGUAS, INCLUSO TRANSPORTE VERTICAL. AF_06/2016","M",17.68,null,null,0,""]
["S",3,"S",0,2,11,1,0,0,0,0,"","Serviço","Serviço","-","SINAPI",94224,"EMBOÇAMENTO COM ARGAMASSA TRAÇO 1:2:9 (CIMENTO, CAL E AREIA). AF_06/2016","M",20.399999999999999,null,null,0,"Referência: AGETOP - 160403"]
["S",3,"S",0,2,11,1,0,0,0,0,"","Serviço","Serviço","-","SINAPI",94224,"EMBOÇAMENTO COM ARGAMASSA TRAÇO 1:2:9 (CIMENTO, CAL E AREIA). AF_06/2016","M",35.36,null,null,0,"Referência: AGETOP - 160404"]
[2,2,2,5,{"$f":"IF($C544=1,OFFSET(E544,-1,0)+1,OFFSET(E544,-1,0))","v":2},{"$f":"IF($C544=1,0,IF($C544=2,OFFSET(F544,-1,0)+1,OFFSET(F544,-1,0)))","v":12},{"$f":"IF(AND($C544<=2,$C544<>0),0,IF($C544=3,OFFSET(G544,-1,0)+1,OFFSET(G544,-1,0)))","v":0},{"$f":"IF(AND($C544<=3,$C544<>0),0,IF($C544=4,OFFSET(H544,-1,0)+1,OFFSET(H544,-1,0)))","v":0},0,35,5,"","Nível 2","Nível 2","-",null,null,"ESQUADRIAS METÁLICAS","-",null,null,null,0,""]
["S",2,"S",0,2,12,0,0,0,0,0,"","Serviço","Serviço","-","SINAPI",94570,"JANELA DE ALUMÍNIO DE CORRER, 2 FOLHAS, FIXAÇÃO COM PARAFUSO SOBRE CONTRAMARCO (EXCLUSIVE CONTRAMARCO), COM VIDROS PADRONIZADA. AF_07/2016","M2",5.52,null,null,0,"Referência: AGETOP - 180381"]
["S",2,"S",0,2,12,0,0,0,0,0,"","Serviço","Serviço","-","SINAPI","74136/3","PORTA DE ACO CHAPA 24, DE ENROLAR, RAIADA, LARGA COM ACABAMENTO GALVANIZADO NATURAL","M2",5.74,null,null,0,"Referência: AGETOP - 180303"]
["S",2,"S",0,2,12,0,0,0,0,0,"","Serviço","Serviço","-","SINAPI","73933/4","PORTA DE FERRO DE ABRIR TIPO BARRA CHATA, COM REQUADRO E GUARNICAO COMPLETA","M2",8.64,null,null,0,"Referência: AGETOP - 180501"]
["S",2,"S",0,2,12,0,0,0,0,0,"","Serviço","Serviço","-","AGETOP",180307,"PORTAO /CHAPA TRAPEZ / TUBO DE ACO PT-5 C/FERRAGEM","m2    ",4,null,null,0,""]
[2,2,2,2,2,13,0,0,0,30,2,"","Nível 2","Nível 2","-",null,null,"VIDROS","-",null,null,null,0,""]
["S",{"$f":"IF(OR(C550=\"s\",C550=0),OFFSET(B550,-1,0),C550)","v":2},{"$f":"IF(OFFSET(C550,-1,0)=\"L\",1,IF(OFFSET(C550,-1,0)=1,2,IF(OR(A550=\"s\",A550=0),\"S\",IF(AND(OFFSET(C550,-1,0)=2,A550=4),3,IF(AND(OR(OFFSET(C550,-1,0)=\"s\",OFFSET(C550,-1,0)=0),A550<>\"s\",A550>OFFSET(B550,-1,0)),OFFSET(B550,-1,0),A550)))))","v":"S"},{"$f":"IF(OR(C550=\"S\",C550=0),0,IF(ISERROR(K550),J550,SMALL(J550:K550,1)))","v":0},2,13,0,0,0,0,0,"","Serviço","Serviço","-","SINAPI",72117,"VIDRO LISO COMUM TRANSPARENTE, ESPESSURA 4MM","M2",5.52,null,null,0,"Referência: AGETOP - 190102"]
[2,2,2,4,2,14,0,0,0,28,4,"","Nível 2","Nível 2","-",null,null,"REVESTIMENTO DE PAREDE","-",null,null,null,0,""]
["S",2,"S",0,2,14,0,0,0,0,0,"","Serviço","Serviço","-","SINAPI",87553,"EMBOÇO, PARA RECEBIMENTO DE CERÂMICA, EM ARGAMASSA TRAÇO 1:2:8, PREPARO MECÂNICO COM BETONEIRA 400L, APLICADO MANUALMENTE EM FACES INTERNAS DE PAREDES, PARA AMBIENTE COM ÁREA MAIOR QUE 10M2, ESPESSURA DE 10MM, COM EXECUÇÃO DE TALISCAS. AF_06/2014","M2",186.65,null,null,0,""]
["S",2,"S",0,2,14,0,0,0,0,0,"","Serviço","Serviço","-","SINAPI",87904,"CHAPISCO APLICADO EM ALVENARIA (COM PRESENÇA DE VÃOS) E ESTRUTURAS DE CONCRETO DE FACHADA, COM COLHER DE PEDREIRO.  ARGAMASSA TRAÇO 1:3 COM PREPARO MANUAL. AF_06/2014","M2",284.16000000000003,null,null,0,"Referência: AGETOP - 200101"]
["S",2,"S",0,2,14,0,0,0,0,0,"","Serviço","Serviço","-","SINAPI",87273,"REVESTIMENTO CERÂMICO PARA PAREDES INTERNAS COM PLACAS TIPO ESMALTADA EXTRA DE DIMENSÕES 33X45 CM APLICADAS EM AMBIENTES DE ÁREA MAIOR QUE 5 M² NA ALTURA INTEIRA DAS PAREDES. AF_06/2014","M2",127.56500000000001,null,null,0,""]
[2,2,2,3,2,15,0,0,0,24,3,"","Nível 2","Nível 2","-",null,null,"FORROS","-",null,null,null,0,""]
["S",2,"S",0,2,15,0,0,0,0,0,"","Serviço","Serviço","-","SINAPI",87884,"CHAPISCO APLICADO NO TETO, COM ROLO PARA TEXTURA ACRÍLICA. ARGAMASSA INDUSTRIALIZADA COM PREPARO MANUAL. AF_06/2014","M2",40.75,null,null,0,"Referência: AGETOP - 210102"]
["S",2,"S",0,2,15,0,0,0,0,0,"","Serviço","Serviço","-","SINAPI",90408,"MASSA ÚNICA, PARA RECEBIMENTO DE PINTURA, EM ARGAMASSA TRAÇO 1:2:8, PREPARO MECÂNICO COM BETONEIRA 400L, APLICADA MANUALMENTE EM TETO, ESPESSURA DE 10MM, COM EXECUÇÃO DE TALISCAS. AF_03/2015","M2",40.75,null,null,0,"Referência: AGETOP - 210401"]
[2,2,2,8,2,16,0,0,0,21,8,"","Nível 2","Nível 2","-",null,null,"REVESTIMENTO DE PISO","-",null,null,null,0,""]
[3,3,3,2,2,16,1,0,0,7,2,"","Nível 3","Nível 3","-",null,null,"LASTRO","-",null,null,null,0,""]
["S",3,"S",0,2,16,1,0,0,0,0,"","Serviço","Serviço","-","AGETOP",220101,"LASTRO DE CONCRETO REGULARIZADO IMPERMEABILIZADO 1:3:6 ESP=5CM (BASE)","m2    ",139.75,null,null,0,""]
[3,3,3,3,2,16,2,0,0,5,3,"","Nível 3","Nível 3","-",null,null,"GRANITINA","-",null,null,null,0,""]
["S",3,"S",0,2,16,2,0,0,0,0,"","Serviço","Serviço","-","SINAPI",84191,"PISO EM GRANILITE, MARMORITE OU GRANITINA ESPESSURA 8 MM, INCLUSO JUNTAS DE DILATACAO PLASTICAS","M2",144.74029999999999,null,null,0,"Referência: AGETOP - 221101"]
["S",3,"S",0,2,16,2,0,0,0,0,"","Serviço","Serviço","-","AGETOP",221104,"RASPAGEM E APLICAÇÃO RESINA ACRÍLICA DUAS DEMÃOS","m2    ",144.74029999999999,null,null,0,""]
[3,3,3,2,2,16,3,0,0,2,{"$error":"#N/A"},"","Nível 3","Nível 3","-",null,null,"PASSEIO (CALÇADA)","-",null,null,null,0,""]
["S",3,"S",0,2,16,3,0,0,0,0,"","Serviço","Serviço","-","AGETOP",220100,"PASSEIO PROTECAO EM CONC.DESEMPEN.5 CM 1:2,5:3,5 ( INCLUSO ESPELHO DE 30CM/ESCAVAÇÃO/REATERRO/APILOAMENTO/ATERRO INTERNO)","m2    ",35.04,null,null,0,""]
[2,2,2,2,2,17,0,0,0,13,2,"","Nível 2","Nível 2","-",null,null,"MARCENARIA","-",null,null,null,0,""]
["S",2,"S",0,2,17,0,0,0,0,0,"","Serviço","Serviço","-","AGETOP",240209,"PRATELEIRA EST.CAIBRO 4+1 TABUAS APARELHADAS E ENVERNIZADAS","m     ",3.2,null,null,0,""]
[2,2,2,8,2,18,0,0,0,11,8,"","Nível 2","Nível 2","-",null,null,"PINTURA","-",null,null,null,0,""]
[3,3,3,7,2,18,1,0,0,7,27,"","Nível 3","Nível 3","-",null,null,"ESMALTE SINTÉTICO","-",null,null,null,0,""]
["S",3,"S",0,2,18,1,0,0,0,0,"","Serviço","Serviço","-","SINAPI",88497,"APLICAÇÃO E LIXAMENTO DE MASSA LÁTEX EM PAREDES, DUAS DEMÃOS. AF_06/2014","M2",128,null,null,0,"Referência: AGETOP - 261300"]
["S",3,"S",0,2,18,1,0,0,0,0,"","Serviço","Serviço","-","SINAPI",88486,"APLICAÇÃO MANUAL DE PINTURA COM TINTA LÁTEX PVA EM TETO, DUAS DEMÃOS. AF_06/2014","M2",40.75,null,null,0,"Referência: AGETOP - 261307"]
["S",3,"S",0,2,18,1,0,0,0,0,"","Serviço","Serviço","-","AGETOP",261550,"PINT.ESMALTE SINT.PAREDES - 2 DEM.C/SELADOR","m2    ",87.25,null,null,0,""]
["S",3,"S",0,2,18,1,0,0,0,0,"","Serviço","Serviço","-","SINAPI",88489,"APLICAÇÃO MANUAL DE PINTURA COM TINTA LÁTEX ACRÍLICA EM PAREDES, DUAS DEMÃOS. AF_06/2014","M2",87.25,null,null,0,"Referência: AGETOP - 261000"]
["S",3,"S",0,2,18,1,0,0,0,0,"","Serviço","Serviço","-","SINAPI","74145/1","PINTURA ESMALTE FOSCO, DUAS DEMAOS, SOBRE SUPERFICIE METALICA, INCLUSO UMA DEMAO DE FUNDO ANTICORROSIVO. UTILIZACAO DE REVOLVER ( AR-COMPRIMIDO).","M2",87.25,null,null,0,"Referência: AGETOP - 261602"]
["S",3,"S",0,2,18,1,0,0,0,0,"","Serviço","Serviço","-","SINAPI","74145/1","PINTURA ESMALTE FOSCO, DUAS DEMAOS, SOBRE SUPERFICIE METALICA, INCLUSO UMA DEMAO DE FUNDO ANTICORROSIVO. UTILIZACAO DE REVOLVER ( AR-COMPRIMIDO).","M2",364.14,null,null,0,"Referência: AGETOP - 261609"]
[2,2,2,3,2,19,0,0,0,3,{"$error":"#N/A"},"","Nível 2","Nível 2","-",null,null,"DIVERSOS","-",null,null,null,0,""]
["S",2,"S",0,2,19,0,0,0,0,0,"","Serviço","Serviço","-","AGETOP",270501,"LIMPEZA FINAL DE OBRA - (OBRAS CIVIS)","m2    ",139.75,null,null,0,""]
["S",2,"S",0,2,19,0,0,0,0,0,"","Serviço","Serviço","-","AGETOP",271608,"BANCADA DE GRANITO C/ESPELHO","m2    ",6.8250000000000002,null,null,0,""]
[1,1,1,181,3,0,0,0,0,247,181,"F","Nível 1","Nível 1","3.","SINAPI",null,"VESTIÁRIO PADRÃO SEDUCE","-",null,null,null,0,""]
[2,2,2,2,3,1,0,0,0,180,2,"","Nível 2","Nível 2","-","SINAPI",null,"SERVIÇOS PRELIMINARES","-",null,null,null,0,""]
["S",2,"S",0,3,1,0,0,0,0,0,"","Serviço","Serviço","-","AGETOP",20701,"LOCAÇÃO DA OBRA, EXECUÇÃO DE GABARITO SEM REAPROVEITAMENTO, INCLUSO PINTURA (FACE INTERNA DO RIPÃO 15CM) E PIQUETE COM TESTEMUNHA","m2    ",55.42,null,null,0,""]
[2,2,2,3,3,2,0,0,0,178,3,"","Nível 2","Nível 2","-",null,null,"TRANSPORTES","-",null,null,null,0,""]
["S",2,"S",0,3,2,0,0,0,0,0,"","Serviço","Serviço","-","SINAPI",72900,"TRANSPORTE DE ENTULHO COM CAMINHAO BASCULANTE 6 M3, RODOVIA PAVIMENTADA, DMT 0,5 A 1,0 KM","M3",3.88,null,null,0,""]
["S",2,"S",0,3,2,0,0,0,0,0,"","Serviço","Serviço","-","SINAPI",72897,"CARGA MANUAL DE ENTULHO EM CAMINHAO BASCULANTE 6 M3","M3",3.88,null,null,0,""]
[2,2,2,22,3,3,0,0,0,175,22,"","Nível 2","Nível 2","-",null,null,"FUNDAÇÕES E SONDAGENS","-",null,null,null,0,""]
[3,3,3,10,3,3,1,0,0,21,10,"","Nível 3","Nível 3","-","SINAPI",null,"ESTACAS E BLOCOS","-",null,null,null,0,""]
["S",3,"S",0,3,3,1,0,0,0,0,"","Serviço","Serviço","-","SINAPI",98230,"ESTACA BROCA DE CONCRETO, DIÂMETRO DE 30 CM, PROFUNDIDADE DE ATÉ 3 M, ESCAVAÇÃO MANUAL COM TRADO CONCHA, NÃO ARMADA. AF_03/2018","M",69.5,null,null,0,"Referência: AGETOP - 50302"]
["S",3,"S",0,3,3,1,0,0,0,0,"","Serviço","Serviço","-","SINAPI",96522,"ESCAVAÇÃO MANUAL PARA BLOCO DE COROAMENTO OU SAPATA, SEM PREVISÃO DE FÔRMA. AF_06/2017","M3",4.08,null,null,0,"Referência: AGETOP - 50901"]
["S",3,"S",0,3,3,1,0,0,0,0,"","Serviço","Serviço","-","SINAPI",93382,"REATERRO MANUAL DE VALAS COM COMPACTAÇÃO MECANIZADA. AF_04/2016","M3",1.98,null,null,0,"Referência: AGETOP - 50905"]
["S",3,"S",0,3,3,1,0,0,0,0,"","Serviço","Serviço","-","SINAPI",94964,"CONCRETO FCK = 20MPA, TRAÇO 1:2,7:3 (CIMENTO/ AREIA MÉDIA/ BRITA 1)  - PREPARO MECÂNICO COM BETONEIRA 400 L. AF_07/2016","M3",2.1,null,null,0,""]
["S",3,"S",0,3,3,1,0,0,0,0,"","Serviço","Serviço","-","SINAPI","74157/4","LANCAMENTO/APLICACAO MANUAL DE CONCRETO EM FUNDACOES","M3",2.1,null,null,0,"Referência: AGETOP - 51060"]
["S",3,"S",0,3,3,1,0,0,0,0,"","Serviço","Serviço","-","SINAPI",94103,"LASTRO DE VALA COM PREPARO DE FUNDO, LARGURA MENOR QUE 1,5 M, COM CAMADA DE BRITA, LANÇAMENTO MANUAL, EM LOCAL COM NÍVEL BAIXO DE INTERFERÊNCIA. AF_06/2016","M3",3.5,null,null,0,"Referência: AGETOP - 51027"]
["S",3,"S",0,3,3,1,0,0,0,0,"","Serviço","Serviço","-","SINAPI",96545,"ARMAÇÃO DE BLOCO, VIGA BALDRAME OU SAPATA UTILIZANDO AÇO CA-50 DE 8 MM - MONTAGEM. AF_06/2017","KG",43.51,null,null,0,"Referência: AGETOP - 52004"]
["S",3,"S",0,3,3,1,0,0,{"$f":"IF(OR($C594=\"S\",$C594=0),0,MATCH(0,OFFSET($D594,1,$C594,ROW($C$826)-ROW($C594)),0))","v":0},{"$f":"IF(OR($C594=\"S\",$C594=0),0,MATCH(OFFSET($D594,0,$C594)+1,OFFSET($D594,1,$C594,ROW($C$826)-ROW($C594)),0))","v":0},"","Serviço","Serviço","-","SINAPI",96546,"ARMAÇÃO DE BLOCO, VIGA BALDRAME OU SAPATA UTILIZANDO AÇO CA-50 DE 10 MM - MONTAGEM. AF_06/2017","KG",24.99,null,null,0,"Referência: AGETOP - 52005"]
["S",3,"S",0,3,3,1,0,0,0,0,"","Serviço","Serviço","-","SINAPI",96543,"ARMAÇÃO DE BLOCO, VIGA BALDRAME E SAPATA UTILIZANDO AÇO CA-60 DE 5 MM - MONTAGEM. AF_06/2017","KG",36.79,null,null,0,"Referência: AGETOP - 52014"]
[3,3,3,11,3,3,2,0,0,11,28,"","Nível 3","Nível 3","-","SINAPI",null,"VIGAS BALDRAMES","-",null,null,null,0,""]
["S",3,"S",0,3,3,2,0,0,0,0,"","Serviço","Serviço","-","SINAPI",96527,"ESCAVAÇÃO MANUAL DE VALA PARA VIGA BALDRAME, COM PREVISÃO DE FÔRMA. AF_06/2017","M3",5.6750400000000019,null,null,0,"Referência: AGETOP - 40101"]
["S",3,"S",0,3,3,2,0,0,0,0,"","Serviço","Serviço","-","SINAPI",94103,"LASTRO DE VALA COM PREPARO DE FUNDO, LARGURA MENOR QUE 1,5 M, COM CAMADA DE BRITA, LANÇAMENTO MANUAL, EM LOCAL COM NÍVEL BAIXO DE INTERFERÊNCIA. AF_06/2016","M3",0.40536000000000005,null,null,0,"Referência: AGETOP - 51027"]
["S",3,"S",0,3,3,2,0,0,0,0,"","Serviço","Serviço","-","SINAPI",96995,"REATERRO MANUAL APILOADO COM SOQUETE. AF_10/2017","M3",4.0536000000000021,null,null,0,"Referência: AGETOP - 50903"]
["S",3,"S",0,3,3,2,0,0,0,0,"","Serviço","Serviço","-","AGETOP",60191,"FORMA DE TABUA CINTA BALDRAME U=8 VEZES","m2    ",27.024000000000001,null,null,0,""]
["S",3,"S",0,3,3,2,0,0,0,0,"","Serviço","Serviço","-","SINAPI",94964,"CONCRETO FCK = 20MPA, TRAÇO 1:2,7:3 (CIMENTO/ AREIA MÉDIA/ BRITA 1)  - PREPARO MECÂNICO COM BETONEIRA 400 L. AF_07/2016","M3",1.62144,null,null,0,""]
["S",3,"S",0,3,3,2,0,0,0,0,"","Serviço","Serviço","-","SINAPI",92873,"LANÇAMENTO COM USO DE BALDES, ADENSAMENTO E ACABAMENTO DE CONCRETO EM ESTRUTURAS. AF_12/2015","M3",1.62144,null,null,0,"Referência: AGETOP - 51055"]
["S",3,"S",0,3,3,2,0,0,0,0,"","Serviço","Serviço","-","SINAPI",96544,"ARMAÇÃO DE BLOCO, VIGA BALDRAME OU SAPATA UTILIZANDO AÇO CA-50 DE 6,3 MM - MONTAGEM. AF_06/2017","KG",49.29,null,null,0,"Referência: AGETOP - 52003"]
["S",3,"S",0,3,3,2,0,0,0,0,"","Serviço","Serviço","-","SINAPI",96545,"ARMAÇÃO DE BLOCO, VIGA BALDRAME OU SAPATA UTILIZANDO AÇO CA-50 DE 8 MM - MONTAGEM. AF_06/2017","KG",30.49,null,null,0,"Referência: AGETOP - 52004"]
[{"$f":"CHOOSE(1+LOG(1+2*(ORÇAMENTO.Nivel=\"Nível 1\")+4*(ORÇAMENTO.Nivel=\"Nível 2\")+8*(ORÇAMENTO.Nivel=\"Nível 3\")+16*(ORÇAMENTO.Nivel=\"Nível 4\")+32*(ORÇAMENTO.Nivel=\"Serviço\"),2),0,1,2,3,4,\"S\")","v":"S"},3,"S",0,3,3,2,0,{"$f":"IF(AND($C605<=4,$C605<>0),0,IF(AND($C605=\"S\",$W605>0),OFFSET(I605,-1,0)+1,OFFSET(I605,-1,0)))","v":0},0,0,"","Serviço","Serviço","-","SINAPI",96546,"ARMAÇÃO DE BLOCO, VIGA BALDRAME OU SAPATA UTILIZANDO AÇO CA-50 DE 10 MM - MONTAGEM. AF_06/2017","KG",12.15,null,null,0,"Referência: AGETOP - 52005"]
["S",3,"S",0,3,3,2,0,0,0,0,"","Serviço","Serviço","-","SINAPI",96543,"ARMAÇÃO DE BLOCO, VIGA BALDRAME E SAPATA UTILIZANDO AÇO CA-60 DE 5 MM - MONTAGEM. AF_06/2017","KG",55.9,null,null,0,"Referência: AGETOP - 52014"]
[2,2,2,19,3,4,0,0,0,153,19,"","Nível 2","Nível 2","-",null,null,"ESTRUTURA","-",null,null,null,0,""]
[3,3,3,7,{"$f":"IF($C608=1,OFFSET(E608,-1,0)+1,OFFSET(E608,-1,0))","v":3},{"$f":"IF($C608=1,0,IF($C608=2,OFFSET(F608,-1,0)+1,OFFSET(F608,-1,0)))","v":4},{"$f":"IF(AND($C608<=2,$C608<>0),0,IF($C608=3,OFFSET(G608,-1,0)+1,OFFSET(G608,-1,0)))","v":1},{"$f":"IF(AND($C608<=3,$C608<>0),0,IF($C608=4,OFFSET(H608,-1,0)+1,OFFSET(H608,-1,0)))","v":0},0,18,7,"","Nível 3","Nível 3","-","SINAPI",null,"PILARES","-",null,null,null,0,""]
["S",3,"S",0,3,4,1,0,0,0,0,"","Serviço","Serviço","-","SINAPI",92418,"MONTAGEM E DESMONTAGEM DE FÔRMA DE PILARES RETANGULARES E ESTRUTURAS SIMILARES COM ÁREA MÉDIA DAS SEÇÕES MENOR OU IGUAL A 0,25 M², PÉ-DIREITO SIMPLES, EM CHAPA DE MADEIRA COMPENSADA RESINADA, 4 UTILIZAÇÕES. AF_12/2015","M2",18.143999999999998,null,null,0,"Referência: AGETOP - 60209"]
["S",3,"S",0,3,4,1,0,0,0,0,"","Serviço","Serviço","-","SINAPI",94964,"CONCRETO FCK = 20MPA, TRAÇO 1:2,7:3 (CIMENTO/ AREIA MÉDIA/ BRITA 1)  - PREPARO MECÂNICO COM BETONEIRA 400 L. AF_07/2016","M3",0.72575999999999996,null,null,0,""]
["S",3,"S",0,3,4,1,0,0,0,0,"","Serviço","Serviço","-","SINAPI",92873,"LANÇAMENTO COM USO DE BALDES, ADENSAMENTO E ACABAMENTO DE CONCRETO EM ESTRUTURAS. AF_12/2015","M3",0.72575999999999996,null,null,0,"Referência: AGETOP - 51055"]
["S",3,"S",0,3,4,1,0,0,0,0,"","Serviço","Serviço","-","SINAPI",92777,"ARMAÇÃO DE PILAR OU VIGA DE UMA ESTRUTURA CONVENCIONAL DE CONCRETO ARMADO EM UMA EDIFICAÇÃO TÉRREA OU SOBRADO UTILIZANDO AÇO CA-50 DE 8,0 MM - MONTAGEM. AF_12/2015","KG",24.49,null,null,0,"Referência: AGETOP - 52004"]
["S",3,"S",0,3,4,1,0,0,0,0,"","Serviço","Serviço","-","SINAPI",92778,"ARMAÇÃO DE PILAR OU VIGA DE UMA ESTRUTURA CONVENCIONAL DE CONCRETO ARMADO EM UMA EDIFICAÇÃO TÉRREA OU SOBRADO UTILIZANDO AÇO CA-50 DE 10,0 MM - MONTAGEM. AF_12/2015","KG",87.29,null,null,0,"Referência: AGETOP - 52005"]
["S",{"$f":"IF(OR(C614=\"s\",C614=0),OFFSET(B614,-1,0),C614)","v":3},{"$f":"IF(OFFSET(C614,-1,0)=\"L\",1,IF(OFFSET(C614,-1,0)=1,2,IF(OR(A614=\"s\",A614=0),\"S\",IF(AND(OFFSET(C614,-1,0)=2,A614=4),3,IF(AND(OR(OFFSET(C614,-1,0)=\"s\",OFFSET(C614,-1,0)=0),A614<>\"s\",A614>OFFSET(B614,-1,0)),OFFSET(B614,-1,0),A614)))))","v":"S"},{"$f":"IF(OR(C614=\"S\",C614=0),0,IF(ISERROR(K614),J614,SMALL(J614:K614,1)))","v":0},3,4,1,0,0,0,0,"","Serviço","Serviço","-","SINAPI",92775,"ARMAÇÃO DE PILAR OU VIGA DE UMA ESTRUTURA CONVENCIONAL DE CONCRETO ARMADO EM UMA EDIFICAÇÃO TÉRREA OU SOBRADO UTILIZANDO AÇO CA-60 DE 5,0 MM - MONTAGEM. AF_12/2015","KG",30.95,null,null,0,"Referência: AGETOP - 52014"]
[3,3,3,9,3,4,2,0,0,11,9,"","Nível 3","Nível 3","-","SINAPI",null,"VIGAS DE COBERTURA","-",null,null,null,0,""]
["S",3,"S",0,3,4,2,0,0,0,0,"","Serviço","Serviço","-","SINAPI",92475,"MONTAGEM E DESMONTAGEM DE FÔRMA DE VIGA, ESCORAMENTO COM GARFO DE MADEIRA, PÉ-DIREITO SIMPLES, EM CHAPA DE MADEIRA PLASTIFICADA, 14 UTILIZAÇÕES. AF_12/2015","M2",35.1312,null,null,0,""]
["S",3,"S",0,3,4,2,0,0,0,0,"","Serviço","Serviço","-","SINAPI",94964,"CONCRETO FCK = 20MPA, TRAÇO 1:2,7:3 (CIMENTO/ AREIA MÉDIA/ BRITA 1)  - PREPARO MECÂNICO COM BETONEIRA 400 L. AF_07/2016","M3",1.62144,null,null,0,""]
["S",3,"S",0,3,4,2,0,0,0,0,"","Serviço","Serviço","-","SINAPI",92873,"LANÇAMENTO COM USO DE BALDES, ADENSAMENTO E ACABAMENTO DE CONCRETO EM ESTRUTURAS. AF_12/2015","M3",1.62144,null,null,0,"Referência: AGETOP - 51055"]
["S",3,"S",0,3,4,2,0,0,0,0,"","Serviço","Serviço","-","SINAPI",92776,"ARMAÇÃO DE PILAR OU VIGA DE UMA ESTRUTURA CONVENCIONAL DE CONCRETO ARMADO EM UMA EDIFICAÇÃO TÉRREA OU SOBRADO UTILIZANDO AÇO CA-50 DE 6,3 MM - MONTAGEM. AF_12/2015","KG",30.09,null,null,0,"Referência: AGETOP - 52003"]
["S",3,"S",0,3,4,2,0,0,0,0,"","Serviço","Serviço","-","SINAPI",92777,"ARMAÇÃO DE PILAR OU VIGA DE UMA ESTRUTURA CONVENCIONAL DE CONCRETO ARMADO EM UMA EDIFICAÇÃO TÉRREA OU SOBRADO UTILIZANDO AÇO CA-50 DE 8,0 MM - MONTAGEM. AF_12/2015","KG",4.49,null,null,0,"Referência: AGETOP - 52004"]
["S",3,"S",0,3,4,2,0,0,0,0,"","Serviço","Serviço","-","SINAPI",92778,"ARMAÇÃO DE PILAR OU VIGA DE UMA ESTRUTURA CONVENCIONAL DE CONCRETO ARMADO EM UMA EDIFICAÇÃO TÉRREA OU SOBRADO UTILIZANDO AÇO CA-50 DE 10,0 MM - MONTAGEM. AF_12/2015","KG",51.33,null,null,0,"Referência: AGETOP - 52005"]
["S",3,"S",0,3,4,2,0,0,0,0,"","Serviço","Serviço","-","SINAPI",92779,"ARMAÇÃO DE PILAR OU VIGA DE UMA ESTRUTURA CONVENCIONAL DE CONCRETO ARMADO EM UMA EDIFICAÇÃO TÉRREA OU SOBRADO UTILIZANDO AÇO CA-50 DE 12,5 MM - MONTAGEM. AF_12/2015","KG",36.590000000000003,null,null,0,"Referência: AGETOP - 52006"]
["S",3,"S",0,3,4,2,0,0,0,0,"","Serviço","Serviço","-","SINAPI",92775,"ARMAÇÃO DE PILAR OU VIGA DE UMA ESTRUTURA CONVENCIONAL DE CONCRETO ARMADO EM UMA EDIFICAÇÃO TÉRREA OU SOBRADO UTILIZANDO AÇO CA-60 DE 5,0 MM - MONTAGEM. AF_12/2015","KG",43.37,null,null,0,"Referência: AGETOP - 52014"]
[3,3,3,2,3,4,3,0,0,2,{"$error":"#N/A"},"","Nível 3","Nível 3","-","SINAPI",null,"LAJE","-",null,null,null,0,""]
["S",3,"S",0,3,4,3,0,0,0,0,"","Serviço","Serviço","-","SINAPI","74202/1","LAJE PRE-MOLDADA P/FORRO, SOBRECARGA 100KG/M2, VAOS ATE 3,50M/E=8CM, C/LAJOTAS E CAP.C/CONC FCK=20MPA, 3CM, INTER-EIXO 38CM, C/ESCORAMENTO (REAPR.3X) E FERRAGEM NEGATIVA","M2",55.42,null,null,0,""]
[2,2,2,25,3,5,0,0,0,134,25,"","Nível 2","Nível 2","-",null,null,"INSTALAÇÕES ELÉTRICAS","-",null,null,null,0,""]
["S",2,"S",0,3,5,0,0,0,0,0,"","Serviço","Serviço","-","SINAPI",91173,"FIXAÇÃO DE TUBOS VERTICAIS DE PPR DIÂMETROS MENORES OU IGUAIS A 40 MM COM ABRAÇADEIRA METÁLICA RÍGIDA TIPO D 1/2\", FIXADA EM PERFILADO EM ALVENARIA. AF_05/2015","M",30,null,null,0,""]
["S",2,"S",0,3,5,0,0,0,0,0,"","Serviço","Serviço","-","SINAPI",91168,"FIXAÇÃO DE TUBOS HORIZONTAIS DE PPR DIÂMETROS MAIORES QUE 40 MM E MENORES OU IGUAIS A 75 MM COM ABRAÇADEIRA METÁLICA RÍGIDA TIPO D 1 1/2\", FIXADA EM PERFILADO EM LAJE. AF_05/2015","M",18,null,null,0,""]
["S",2,"S",0,3,5,0,0,0,0,0,"","Serviço","Serviço","-","SINAPI",91872,"ELETRODUTO RÍGIDO ROSCÁVEL, PVC, DN 32 MM (1\"), PARA CIRCUITOS TERMINAIS, INSTALADO EM PAREDE - FORNECIMENTO E INSTALAÇÃO. AF_12/2015","M",30,null,null,0,"Referência: AGETOP - 71202"]
["S",2,"S",0,3,5,0,0,0,0,0,"","Serviço","Serviço","-","SINAPI",91885,"LUVA PARA ELETRODUTO, PVC, ROSCÁVEL, DN 32 MM (1\"), PARA CIRCUITOS TERMINAIS, INSTALADA EM PAREDE - FORNECIMENTO E INSTALAÇÃO. AF_12/2015","UN",10,null,null,0,"Referência: AGETOP - 71742"]
["S",2,"S",0,3,5,0,0,0,0,0,"","Serviço","Serviço","-","SINAPI",93009,"ELETRODUTO RÍGIDO ROSCÁVEL, PVC, DN 60 MM (2\") - FORNECIMENTO E INSTALAÇÃO. AF_12/2015","M",20,null,null,0,""]
["S",2,"S",0,3,5,0,0,0,0,0,"","Serviço","Serviço","-","SINAPI",93014,"LUVA PARA ELETRODUTO, PVC, ROSCÁVEL, DN 60 MM (2\") - FORNECIMENTO E INSTALAÇÃO. AF_12/2015","UN",6,null,null,0,"Referência: AGETOP - 71745"]
["S",2,"S",0,3,5,0,0,0,0,0,"","Serviço","Serviço","-","SINAPI",91905,"CURVA 90 GRAUS PARA ELETRODUTO, PVC, ROSCÁVEL, DN 32 MM (1\"), PARA CIRCUITOS TERMINAIS, INSTALADA EM LAJE - FORNECIMENTO E INSTALAÇÃO. AF_12/2015","UN",2,null,null,0,"Referência: AGETOP - 71142"]
["S",2,"S",0,3,5,0,0,0,0,0,"","Serviço","Serviço","-","SINAPI",93020,"CURVA 90 GRAUS PARA ELETRODUTO, PVC, ROSCÁVEL, DN 60 MM (2\") - FORNECIMENTO E INSTALAÇÃO. AF_12/2015","UN",2,null,null,0,""]
["S",2,"S",0,3,5,0,0,0,0,0,"","Serviço","Serviço","-","SINAPI",91927,"CABO DE COBRE FLEXÍVEL ISOLADO, 2,5 MM², ANTI-CHAMA 0,6/1,0 KV, PARA CIRCUITOS TERMINAIS - FORNECIMENTO E INSTALAÇÃO. AF_12/2015","M",150,null,null,0,"Referência: AGETOP - 70581"]
["S",2,"S",0,3,5,0,0,0,0,0,"","Serviço","Serviço","-","SINAPI",91931,"CABO DE COBRE FLEXÍVEL ISOLADO, 6 MM², ANTI-CHAMA 0,6/1,0 KV, PARA CIRCUITOS TERMINAIS - FORNECIMENTO E INSTALAÇÃO. AF_12/2015","M",200,null,null,0,"Referência: AGETOP - 70583"]
["S",2,"S",0,3,5,0,0,0,0,0,"","Serviço","Serviço","-","SINAPI",97591,"LUMINÁRIA TIPO PLAFON REDONDO COM VIDRO FOSCO, DE SOBREPOR, COM 2 LÂMPADAS DE 15 W - FORNECIMENTO E INSTALAÇÃO. AF_11/2017","UN",8,null,null,0,""]
["S",2,"S",0,3,5,0,0,0,0,0,"","Serviço","Serviço","-","SINAPI",91940,"CAIXA RETANGULAR 4\" X 2\" MÉDIA (1,30 M DO PISO), PVC, INSTALADA EM PAREDE - FORNECIMENTO E INSTALAÇÃO. AF_12/2015","UN",12,null,null,0,""]
["S",2,"S",0,3,5,0,0,0,0,0,"","Serviço","Serviço","-","SINAPI",83446,"CAIXA DE PASSAGEM 30X30X40 COM TAMPA E DRENO BRITA","UN",1,null,null,0,""]
["S",2,"S",0,3,5,0,0,0,0,0,"","Serviço","Serviço","-","SINAPI",93654,"DISJUNTOR MONOPOLAR TIPO DIN, CORRENTE NOMINAL DE 16A - FORNECIMENTO E INSTALAÇÃO. AF_04/2016","UN",1,null,null,0,""]
["S",2,"S",0,3,5,0,0,0,0,0,"","Serviço","Serviço","-","SINAPI",93670,"DISJUNTOR TRIPOLAR TIPO DIN, CORRENTE NOMINAL DE 25A - FORNECIMENTO E INSTALAÇÃO. AF_04/2016","UN",8,null,null,0,""]
["S",2,"S",0,3,5,0,0,0,0,0,"","Serviço","Serviço","-","SINAPI",93672,"DISJUNTOR TRIPOLAR TIPO DIN, CORRENTE NOMINAL DE 40A - FORNECIMENTO E INSTALAÇÃO. AF_04/2016","UN",1,null,null,0,""]
["S",2,"S",0,3,5,0,0,0,0,0,"","Serviço","Serviço","-","AGETOP",71331,"FITA ISOLANTE, ROLO DE 20,00 M","Un    ",1,null,null,0,""]
["S",2,"S",0,3,5,0,0,0,0,0,"","Serviço","Serviço","-","AGETOP",71321,"FITA DE AUTO FUSAO, ROLO E 10,00 MM","Un    ",1,null,null,0,""]
["S",2,"S",0,3,5,0,0,0,0,0,"","Serviço","Serviço","-","SINAPI",93043,"LÂMPADA LED 10 W BIVOLT BRANCA, FORMATO TRADICIONAL (BASE E27) - FORNECIMENTO E INSTALAÇÃO","UN",16,null,null,0,""]
["S",2,"S",0,3,5,0,0,0,0,0,"","Serviço","Serviço","-","AGETOP",71450,"INTERRUPTOR DIFERENCIAL RESIDUAL (D.R.) BIPOLAR DE 25A-30mA","Un    ",8,null,null,0,""]
["S",2,"S",0,3,5,0,0,0,0,0,"","Serviço","Serviço","-","SINAPI","74131/4","QUADRO DE DISTRIBUICAO DE ENERGIA DE EMBUTIR, EM CHAPA METALICA, PARA 18 DISJUNTORES TERMOMAGNETICOS MONOPOLARES, COM BARRAMENTO TRIFASICO E NEUTRO, FORNECIMENTO E INSTALACAO","UN",1,null,null,0,""]
["S",2,"S",0,3,5,0,0,0,0,0,"","Serviço","Serviço","-","SINAPI",91996,"TOMADA MÉDIA DE EMBUTIR (1 MÓDULO), 2P+T 10 A, INCLUINDO SUPORTE E PLACA - FORNECIMENTO E INSTALAÇÃO. AF_12/2015","UN",4,null,null,0,"Referência: AGETOP - 72578"]
["S",2,"S",0,3,5,0,0,0,0,0,"","Serviço","Serviço","-","SINAPI",91991,"TOMADA ALTA DE EMBUTIR (1 MÓDULO), 2P+T 20 A, SEM SUPORTE E SEM PLACA - FORNECIMENTO E INSTALAÇÃO. AF_12/2015","UN",8,null,null,0,""]
["S",2,"S",0,3,5,0,0,0,0,0,"","Serviço","Serviço","-","SINAPI",97599,"LUMINÁRIA DE EMERGÊNCIA - FORNECIMENTO E INSTALAÇÃO. AF_11/2017","UN",2,null,null,0,""]
[2,2,2,68,3,6,0,0,0,109,68,"","Nível 2","Nível 2","-",null,null,"INSTALAÇÕES HIDROSSANITÁRIAS","-",null,null,null,0,""]
[3,3,3,67,3,6,1,0,0,67,119,"","Nível 3","Nível 3","-","SINAPI",null,"PEÇAS E ACESSÓRIOS","-",null,null,null,0,""]
["S",3,"S",0,3,6,1,0,0,0,0,"","Serviço","Serviço","-","SINAPI",95470,"VASO SANITARIO SIFONADO CONVENCIONAL COM LOUÇA BRANCA, INCLUSO CONJUNTO DE LIGAÇÃO PARA BACIA SANITÁRIA AJUSTÁVEL - FORNECIMENTO E INSTALAÇÃO. AF_10/2016","UN",4,null,null,0,""]
["S",3,"S",0,3,6,1,0,0,0,0,"","Serviço","Serviço","-","SINAPI",99635,"VÁLVULA DE DESCARGA METÁLICA, BASE 1 1/2 \", ACABAMENTO METALICO CROMADO - FORNECIMENTO E INSTALAÇÃO. AF_01/2019","UN",4,null,null,0,"Referência: AGETOP - 80515"]
["S",3,"S",0,3,6,1,0,0,0,0,"","Serviço","Serviço","-","AGETOP",80526,"ASSENTO EM POLIPROPILENO COM SISTEMA DE FECHAMENTO SUAVE PARA VASO SANITÁRIO","Un    ",4,null,null,0,"Referência: AGETOP - 80526"]
["S",3,"S",0,3,6,1,0,0,0,0,"","Serviço","Serviço","-","SINAPI",95544,"PAPELEIRA DE PAREDE EM METAL CROMADO SEM TAMPA, INCLUSO FIXAÇÃO. AF_10/2016","UN",4,null,null,0,""]
["S",3,"S",0,3,6,1,0,0,0,0,"","Serviço","Serviço","-","SINAPI",86884,"ENGATE FLEXÍVEL EM PLÁSTICO BRANCO, 1/2\" X 30CM - FORNECIMENTO E INSTALAÇÃO. AF_12/2013","UN",8,null,null,0,""]
["S",3,"S",0,3,6,1,0,0,{"$f":"IF(OR($C658=\"S\",$C658=0),0,MATCH(0,OFFSET($D658,1,$C658,ROW($C$826)-ROW($C658)),0))","v":0},{"$f":"IF(OR($C658=\"S\",$C658=0),0,MATCH(OFFSET($D658,0,$C658)+1,OFFSET($D658,1,$C658,ROW($C$826)-ROW($C658)),0))","v":0},"","Serviço","Serviço","-","SINAPI",86903,"LAVATÓRIO LOUÇA BRANCA COM COLUNA, 45 X 55CM OU EQUIVALENTE, PADRÃO MÉDIO - FORNECIMENTO E INSTALAÇÃO. AF_12/2013","UN",6,null,null,0,"Referência: AGETOP - 80541"]
["S",3,"S",0,3,6,1,0,0,0,0,"","Serviço","Serviço","-","AGETOP",80550,"FIXACAO P/LAVATORIO (PAR)","PAR   ",6,null,null,0,""]
["S",3,"S",0,3,6,1,0,0,0,0,"","Serviço","Serviço","-","SINAPI",86906,"TORNEIRA CROMADA DE MESA, 1/2\" OU 3/4\", PARA LAVATÓRIO, PADRÃO POPULAR - FORNECIMENTO E INSTALAÇÃO. AF_12/2013","UN",8,null,null,0,""]
["S",3,"S",0,3,6,1,0,0,0,0,"","Serviço","Serviço","-","SINAPI",86883,"SIFÃO DO TIPO FLEXÍVEL EM PVC 1\u0094 X 1.1/2\u0094 - FORNECIMENTO E INSTALAÇÃO. AF_12/2013","UN",8,null,null,0,""]
["S",3,"S",0,3,6,1,0,0,0,0,"","Serviço","Serviço","-","SINAPI",86877,"VÁLVULA EM METAL CROMADO 1.1/2\" X 1.1/2\" PARA TANQUE OU LAVATÓRIO, COM OU SEM LADRÃO - FORNECIMENTO E INSTALAÇÃO. AF_12/2013","UN",8,null,null,0,"Referência: AGETOP - 80830"]
["S",3,"S",0,3,6,1,0,0,0,0,"","Serviço","Serviço","-","SINAPI",86901,"CUBA DE EMBUTIR OVAL EM LOUÇA BRANCA, 35 X 50CM OU EQUIVALENTE - FORNECIMENTO E INSTALAÇÃO. AF_12/2013","UN",2,null,null,0,"Referência: AGETOP - 80587"]
["S",3,"S",0,3,6,1,0,0,0,0,"","Serviço","Serviço","-","SINAPI","74234/1","MICTORIO SIFONADO DE LOUCA BRANCA COM PERTENCES, COM REGISTRO DE PRESSAO 1/2\" COM CANOPLA CROMADA ACABAMENTO SIMPLES E CONJUNTO PARA FIXACAO  - FORNECIMENTO E INSTALACAO","UN",2,null,null,0,"Referência: AGETOP - 80601"]
["S",3,"S",0,3,6,1,0,0,0,0,"","Serviço","Serviço","-","AGETOP",81501,"ADESIVO PLASTICO - FRASCO 850 G","Un    ",8,null,null,0,""]
["S",3,"S",0,3,6,1,0,0,0,0,"","Serviço","Serviço","-","AGETOP",80730,"CABIDE TIPO GANCHO EM LOUÇA","Un    ",8,null,null,0,""]
["S",3,"S",0,3,6,1,0,0,0,0,"","Serviço","Serviço","-","SINAPI",95547,"SABONETEIRA PLASTICA TIPO DISPENSER PARA SABONETE LIQUIDO COM RESERVATORIO 800 A 1500 ML, INCLUSO FIXAÇÃO. AF_10/2016","UN",8,null,null,0,""]
["S",3,"S",0,3,6,1,0,0,0,0,"","Serviço","Serviço","-","SINAPI",89353,"REGISTRO DE GAVETA BRUTO, LATÃO, ROSCÁVEL, 3/4\", FORNECIDO E INSTALADO EM RAMAL DE ÁGUA. AF_12/2014","UN",9,null,null,0,"Referência: AGETOP - 80902"]
[{"$f":"CHOOSE(1+LOG(1+2*(ORÇAMENTO.Nivel=\"Nível 1\")+4*(ORÇAMENTO.Nivel=\"Nível 2\")+8*(ORÇAMENTO.Nivel=\"Nível 3\")+16*(ORÇAMENTO.Nivel=\"Nível 4\")+32*(ORÇAMENTO.Nivel=\"Serviço\"),2),0,1,2,3,4,\"S\")","v":"S"},3,"S",0,3,6,1,0,{"$f":"IF(AND($C669<=4,$C669<>0),0,IF(AND($C669=\"S\",$W669>0),OFFSET(I669,-1,0)+1,OFFSET(I669,-1,0)))","v":0},0,0,"","Serviço","Serviço","-","AGETOP",80927,"REGISTRO DE GAVETA C/CANOPLA DIAMETRO 1\"","Un    ",2,null,null,0,""]
["S",3,"S",0,3,6,1,0,0,0,0,"","Serviço","Serviço","-","SINAPI",89351,"REGISTRO DE PRESSÃO BRUTO, LATÃO,  ROSCÁVEL, 3/4\u0094, FORNECIDO E INSTALADO EM RAMAL DE ÁGUA. AF_12/2014","UN",8,null,null,0,""]
["S",3,"S",0,3,6,1,0,0,0,0,"","Serviço","Serviço","-","SINAPI",89446,"TUBO, PVC, SOLDÁVEL, DN 25MM, INSTALADO EM PRUMADA DE ÁGUA - FORNECIMENTO E INSTALAÇÃO. AF_12/2014","M",42,null,null,0,""]
["S",3,"S",0,{"$f":"IF($C672=1,OFFSET(E672,-1,0)+1,OFFSET(E672,-1,0))","v":3},{"$f":"IF($C672=1,0,IF($C672=2,OFFSET(F672,-1,0)+1,OFFSET(F672,-1,0)))","v":6},{"$f":"IF(AND($C672<=2,$C672<>0),0,IF($C672=3,OFFSET(G672,-1,0)+1,OFFSET(G672,-1,0)))","v":1},{"$f":"IF(AND($C672<=3,$C672<>0),0,IF($C672=4,OFFSET(H672,-1,0)+1,OFFSET(H672,-1,0)))","v":0},0,0,0,"","Serviço","Serviço","-","SINAPI",89447,"TUBO, PVC, SOLDÁVEL, DN 32MM, INSTALADO EM PRUMADA DE ÁGUA - FORNECIMENTO E INSTALAÇÃO. AF_12/2014","M",15,null,null,0,""]
["S",3,"S",0,3,6,1,0,0,0,0,"","Serviço","Serviço","-","SINAPI",89449,"TUBO, PVC, SOLDÁVEL, DN 50MM, INSTALADO EM PRUMADA DE ÁGUA - FORNECIMENTO E INSTALAÇÃO. AF_12/2014","M",15,null,null,0,""]
["S",3,"S",0,3,6,1,0,0,0,0,"","Serviço","Serviço","-","SINAPI",89450,"TUBO, PVC, SOLDÁVEL, DN 60MM, INSTALADO EM PRUMADA DE ÁGUA - FORNECIMENTO E INSTALAÇÃO. AF_12/2014","M",72,null,null,0,""]
["S",3,"S",0,3,6,1,0,0,0,0,"","Serviço","Serviço","-","SINAPI",94656,"ADAPTADOR CURTO COM BOLSA E ROSCA PARA REGISTRO, PVC, SOLDÁVEL, DN  25 MM X 3/4 , INSTALADO EM RESERVAÇÃO DE ÁGUA DE EDIFICAÇÃO QUE POSSUA RESERVATÓRIO DE FIBRA/FIBROCIMENTO   FORNECIMENTO E INSTALAÇÃO. AF_06/2016","UN",26,null,null,0,""]
["S",3,"S",0,3,6,1,0,0,0,0,"","Serviço","Serviço","-","SINAPI",89436,"ADAPTADOR CURTO COM BOLSA E ROSCA PARA REGISTRO, PVC, SOLDÁVEL, DN 32MM X 1\u0094, INSTALADO EM RAMAL DE DISTRIBUIÇÃO DE ÁGUA - FORNECIMENTO E INSTALAÇÃO. AF_12/2014","UN",4,null,null,0,""]
["S",3,"S",0,3,6,1,0,0,0,0,"","Serviço","Serviço","-","SINAPI",89596,"ADAPTADOR CURTO COM BOLSA E ROSCA PARA REGISTRO, PVC, SOLDÁVEL, DN 50MM X 1.1/2\u0094, INSTALADO EM PRUMADA DE ÁGUA - FORNECIMENTO E INSTALAÇÃO. AF_12/2014","UN",4,null,null,0,""]
["S",{"$f":"IF(OR(C678=\"s\",C678=0),OFFSET(B678,-1,0),C678)","v":3},{"$f":"IF(OFFSET(C678,-1,0)=\"L\",1,IF(OFFSET(C678,-1,0)=1,2,IF(OR(A678=\"s\",A678=0),\"S\",IF(AND(OFFSET(C678,-1,0)=2,A678=4),3,IF(AND(OR(OFFSET(C678,-1,0)=\"s\",OFFSET(C678,-1,0)=0),A678<>\"s\",A678>OFFSET(B678,-1,0)),OFFSET(B678,-1,0),A678)))))","v":"S"},{"$f":"IF(OR(C678=\"S\",C678=0),0,IF(ISERROR(K678),J678,SMALL(J678:K678,1)))","v":0},3,6,1,0,0,0,0,"","Serviço","Serviço","-","SINAPI",94657,"LUVA PVC, SOLDÁVEL, DN  25 MM, INSTALADA EM RESERVAÇÃO DE ÁGUA DE EDIFICAÇÃO QUE POSSUA RESERVATÓRIO DE FIBRA/FIBROCIMENTO   FORNECIMENTO E INSTALAÇÃO. AF_06/2016","UN",4,null,null,0,""]
["S",3,"S",0,3,6,1,0,0,0,0,"","Serviço","Serviço","-","AGETOP",81162,"BUCHA DE REDUCAO SOLD.CURTA 32 X 25 MM","Un    ",3,null,null,0,""]
["S",3,"S",0,3,6,1,0,0,0,0,"","Serviço","Serviço","-","AGETOP",81165,"BUCHA DE REDUCAO SOLD. CURTA 60 X 50 mm","Un    ",4,null,null,0,""]
["S",3,"S",0,3,6,1,0,0,0,0,"","Serviço","Serviço","-","AGETOP",81179,"BUCHA DE REDUCAO SOLDAVEL LONGA 50 X 25 mm","Un    ",4,null,null,0,""]
["S",3,"S",0,3,6,1,0,0,0,0,"","Serviço","Serviço","-","AGETOP",81180,"BUCHA DE REDUCAO SOLDAVEL LONGA 50 X 32 mm","Un    ",3,null,null,0,""]
["S",3,"S",0,3,6,1,0,0,0,0,"","Serviço","Serviço","-","SINAPI",89362,"JOELHO 90 GRAUS, PVC, SOLDÁVEL, DN 25MM, INSTALADO EM RAMAL OU SUB-RAMAL DE ÁGUA - FORNECIMENTO E INSTALAÇÃO. AF_12/2014","UN",28,null,null,0,""]
["S",3,"S",0,3,6,1,0,0,0,0,"","Serviço","Serviço","-","SINAPI",89367,"JOELHO 90 GRAUS, PVC, SOLDÁVEL, DN 32MM, INSTALADO EM RAMAL OU SUB-RAMAL DE ÁGUA - FORNECIMENTO E INSTALAÇÃO. AF_12/2014","UN",6,null,null,0,""]
["S",3,"S",0,3,6,1,0,0,0,0,"","Serviço","Serviço","-","SINAPI",89501,"JOELHO 90 GRAUS, PVC, SOLDÁVEL, DN 50MM, INSTALADO EM PRUMADA DE ÁGUA - FORNECIMENTO E INSTALAÇÃO. AF_12/2014","UN",9,null,null,0,""]
["S",3,"S",0,3,6,1,0,0,0,0,"","Serviço","Serviço","-","SINAPI",89505,"JOELHO 90 GRAUS, PVC, SOLDÁVEL, DN 60MM, INSTALADO EM PRUMADA DE ÁGUA - FORNECIMENTO E INSTALAÇÃO. AF_12/2014","UN",2,null,null,0,""]
["S",3,"S",0,3,6,1,0,0,0,0,"","Serviço","Serviço","-","AGETOP",81360,"JOELHO RED.90 GRAUS SOLD.C/BUCHA LATAO 25X1/2\"","Un    ",16,null,null,0,""]
["S",3,"S",0,3,6,1,0,0,0,0,"","Serviço","Serviço","-","SINAPI",89395,"TE, PVC, SOLDÁVEL, DN 25MM, INSTALADO EM RAMAL OU SUB-RAMAL DE ÁGUA - FORNECIMENTO E INSTALAÇÃO. AF_12/2014","UN",1,null,null,0,""]
["S",3,"S",0,3,6,1,0,0,0,0,"","Serviço","Serviço","-","SINAPI",89398,"TE, PVC, SOLDÁVEL, DN 32MM, INSTALADO EM RAMAL OU SUB-RAMAL DE ÁGUA - FORNECIMENTO E INSTALAÇÃO. AF_12/2014","UN",1,null,null,0,""]
["S",3,"S",0,3,6,1,0,0,0,0,"","Serviço","Serviço","-","SINAPI",89625,"TE, PVC, SOLDÁVEL, DN 50MM, INSTALADO EM PRUMADA DE ÁGUA - FORNECIMENTO E INSTALAÇÃO. AF_12/2014","UN",4,null,null,0,"Referência: AGETOP - 81405"]
["S",3,"S",0,3,6,1,0,0,0,0,"","Serviço","Serviço","-","SINAPI",89628,"TE, PVC, SOLDÁVEL, DN 60MM, INSTALADO EM PRUMADA DE ÁGUA - FORNECIMENTO E INSTALAÇÃO. AF_12/2014","UN",5,null,null,0,""]
["S",3,"S",0,3,6,1,0,0,0,0,"","Serviço","Serviço","-","AGETOP",81445,"TE RED.SOLD.90GR.BUC.LATAO BOLSA CENT.25X25X1/2\"","Un    ",6,null,null,0,""]
["S",3,"S",0,3,6,1,0,0,0,0,"","Serviço","Serviço","-","AGETOP",81501,"ADESIVO PLASTICO - FRASCO 850 G","Un    ",1,null,null,0,""]
["S",3,"S",0,3,6,1,0,0,0,0,"","Serviço","Serviço","-","AGETOP",81504,"SOLUCAO LIMPADORA 1000 CM3","Un    ",1,null,null,0,""]
["S",3,"S",0,3,6,1,0,0,0,0,"","Serviço","Serviço","-","AGETOP",81664,"CORPO CX. SIFONADA DIAM. 150 X 185 X 75","Un    ",4,null,null,0,""]
["S",3,"S",0,3,6,1,0,0,0,0,"","Serviço","Serviço","-","SINAPI",89710,"RALO SECO, PVC, DN 100 X 40 MM, JUNTA SOLDÁVEL, FORNECIDO E INSTALADO EM RAMAL DE DESCARGA OU EM RAMAL DE ESGOTO SANITÁRIO. AF_12/2014","UN",6,null,null,0,""]
["S",3,"S",0,3,6,1,0,0,0,0,"","Serviço","Serviço","-","SINAPI",94677,"CURVA 90 GRAUS, PVC, SOLDÁVEL, DN 40 MM, INSTALADO EM RESERVAÇÃO DE ÁGUA DE EDIFICAÇÃO QUE POSSUA RESERVATÓRIO DE FIBRA/FIBROCIMENTO   FORNECIMENTO E INSTALAÇÃO. AF_06/2016","UN",18,null,null,0,""]
["S",3,"S",0,3,6,1,0,0,0,0,"","Serviço","Serviço","-","SINAPI",95694,"CURVA 90 GRAUS, PVC, SERIE R, ÁGUA PLUVIAL, DN 100 MM, JUNTA ELÁSTICA, FORNECIDO E INSTALADO EM RAMAL DE ENCAMINHAMENTO. AF_12/2014","UN",4,null,null,0,""]
["S",3,"S",0,3,6,1,0,0,0,0,"","Serviço","Serviço","-","AGETOP",81778,"GRELHA QUADRADA CROMADA DIAM. 150 MM","Un    ",4,null,null,0,""]
["S",3,"S",0,3,6,1,0,0,0,0,"","Serviço","Serviço","-","AGETOP",81790,"GRELHA REDONDA BRANCA DIAM. 100 MM","Un    ",6,null,null,0,""]
["S",3,"S",0,3,6,1,0,0,0,0,"","Serviço","Serviço","-","AGETOP",81825,"CAIXA DE PASSAGEM 60 X 60 CM SEM TAMPA","Un    ",2,null,null,0,""]
["S",3,"S",0,3,6,1,0,0,0,0,"","Serviço","Serviço","-","AGETOP",81825,"CAIXA DE PASSAGEM 60 X 60 CM SEM TAMPA","Un    ",2,null,null,0,""]
["S",3,"S",0,3,6,1,0,0,0,0,"","Serviço","Serviço","-","AGETOP",81885,"TERMINAL DE VENTILACAO DIAMETRO 50 MM","Un    ",2,null,null,0,""]
["S",3,"S",0,3,6,1,0,0,0,0,"","Serviço","Serviço","-","SINAPI",94676,"JOELHO 90 GRAUS, PVC, SOLDÁVEL, DN 40 MM INSTALADO EM RESERVAÇÃO DE ÁGUA DE EDIFICAÇÃO QUE POSSUA RESERVATÓRIO DE FIBRA/FIBROCIMENTO   FORNECIMENTO E INSTALAÇÃO. AF_06/2016","UN",20,null,null,0,""]
["S",3,"S",0,3,6,1,0,0,0,0,"","Serviço","Serviço","-","SINAPI",94676,"JOELHO 90 GRAUS, PVC, SOLDÁVEL, DN 40 MM INSTALADO EM RESERVAÇÃO DE ÁGUA DE EDIFICAÇÃO QUE POSSUA RESERVATÓRIO DE FIBRA/FIBROCIMENTO   FORNECIMENTO E INSTALAÇÃO. AF_06/2016","UN",2,null,null,0,""]
["S",3,"S",0,3,6,1,0,0,0,0,"","Serviço","Serviço","-","SINAPI",89732,"JOELHO 45 GRAUS, PVC, SERIE NORMAL, ESGOTO PREDIAL, DN 50 MM, JUNTA ELÁSTICA, FORNECIDO E INSTALADO EM RAMAL DE DESCARGA OU RAMAL DE ESGOTO SANITÁRIO. AF_12/2014","UN",2,null,null,0,""]
["S",3,"S",0,3,6,1,0,0,0,0,"","Serviço","Serviço","-","SINAPI",89726,"JOELHO 45 GRAUS, PVC, SERIE NORMAL, ESGOTO PREDIAL, DN 40 MM, JUNTA SOLDÁVEL, FORNECIDO E INSTALADO EM RAMAL DE DESCARGA OU RAMAL DE ESGOTO SANITÁRIO. AF_12/2014","UN",12,null,null,0,""]
["S",3,"S",0,3,6,1,0,0,0,0,"","Serviço","Serviço","-","SINAPI",89731,"JOELHO 90 GRAUS, PVC, SERIE NORMAL, ESGOTO PREDIAL, DN 50 MM, JUNTA ELÁSTICA, FORNECIDO E INSTALADO EM RAMAL DE DESCARGA OU RAMAL DE ESGOTO SANITÁRIO. AF_12/2014","UN",2,null,null,0,""]
["S",3,"S",0,3,6,1,0,0,0,0,"","Serviço","Serviço","-","SINAPI",89744,"JOELHO 90 GRAUS, PVC, SERIE NORMAL, ESGOTO PREDIAL, DN 100 MM, JUNTA ELÁSTICA, FORNECIDO E INSTALADO EM RAMAL DE DESCARGA OU RAMAL DE ESGOTO SANITÁRIO. AF_12/2014","UN",4,null,null,0,""]
["S",3,"S",0,3,6,1,0,0,0,0,"","Serviço","Serviço","-","AGETOP",82055,"PORTA GRELHA QUADRADO P/GRELHA RED.CROM.DIAM.100 M","Un    ",6,null,null,0,""]
["S",3,"S",0,3,6,1,0,0,0,0,"","Serviço","Serviço","-","AGETOP",82052,"PORTA GRELHA QUADRADO CROMADO DIAM.150 MM","Un    ",4,null,null,0,""]
["S",3,"S",0,3,6,1,0,0,0,0,"","Serviço","Serviço","-","AGETOP",82230,"TE SANITARIO DIAMETRO 50 X 50 MM","Un    ",6,null,null,0,""]
["S",3,"S",0,3,6,1,0,0,0,0,"","Serviço","Serviço","-","SINAPI",89630,"TE DE REDUÇÃO, PVC, SOLDÁVEL, DN 75MM X 50MM, INSTALADO EM PRUMADA DE ÁGUA - FORNECIMENTO E INSTALAÇÃO. AF_12/2014","UN",4,null,null,0,""]
["S",3,"S",0,3,6,1,0,0,0,0,"","Serviço","Serviço","-","AGETOP",82233,"TE SANITARIO DIAMETRO 100 X 50 MM","Un    ",4,null,null,0,""]
["S",3,"S",0,3,6,1,0,0,0,0,"","Serviço","Serviço","-","SINAPI",89508,"TUBO PVC, SÉRIE R, ÁGUA PLUVIAL, DN 40 MM, FORNECIDO E INSTALADO EM RAMAL DE ENCAMINHAMENTO. AF_12/2014","M",31,null,null,0,""]
["S",3,"S",0,3,6,1,0,0,0,0,"","Serviço","Serviço","-","SINAPI",89509,"TUBO PVC, SÉRIE R, ÁGUA PLUVIAL, DN 50 MM, FORNECIDO E INSTALADO EM RAMAL DE ENCAMINHAMENTO. AF_12/2014","M",18,null,null,0,""]
["S",3,"S",0,3,6,1,0,0,0,0,"","Serviço","Serviço","-","SINAPI",89511,"TUBO PVC, SÉRIE R, ÁGUA PLUVIAL, DN 75 MM, FORNECIDO E INSTALADO EM RAMAL DE ENCAMINHAMENTO. AF_12/2014","M",18,null,null,0,""]
["S",3,"S",0,3,6,1,0,0,0,0,"","Serviço","Serviço","-","SINAPI",89512,"TUBO PVC, SÉRIE R, ÁGUA PLUVIAL, DN 100 MM, FORNECIDO E INSTALADO EM RAMAL DE ENCAMINHAMENTO. AF_12/2014","M",38,null,null,0,""]
[2,2,2,4,3,7,0,0,0,41,4,"","Nível 2","Nível 2","-","SINAPI",null,"ALVENARIAS E DIVISÓRIAS","-",null,null,null,0,""]
["S",2,"S",0,3,7,0,0,0,0,0,"","Serviço","Serviço","-","SINAPI",87511,"ALVENARIA DE VEDAÇÃO DE BLOCOS CERÂMICOS FURADOS NA HORIZONTAL DE 9X19X19CM (ESPESSURA 9CM) DE PAREDES COM ÁREA LÍQUIDA MENOR QUE 6M² COM VÃOS E ARGAMASSA DE ASSENTAMENTO COM PREPARO EM BETONEIRA. AF_06/2014","M2",51.947999999999993,null,null,0,"Referência: AGETOP - 100201"]
["S",2,"S",0,3,7,0,0,0,0,0,"","Serviço","Serviço","-","AGETOP",100602,"ALVENARIA DE TIJOLO LAMINADO 1/2 VEZ  - ARG. (1CI : 1CH : 5ARML)","m2    ",64.94,null,null,0,""]
["S",2,"S",0,3,7,0,0,0,{"$f":"IF(OR($C722=\"S\",$C722=0),0,MATCH(0,OFFSET($D722,1,$C722,ROW($C$826)-ROW($C722)),0))","v":0},{"$f":"IF(OR($C722=\"S\",$C722=0),0,MATCH(OFFSET($D722,0,$C722)+1,OFFSET($D722,1,$C722,ROW($C$826)-ROW($C722)),0))","v":0},"","Serviço","Serviço","-","SINAPI",79627,"DIVISORIA EM GRANITO BRANCO POLIDO, ESP = 3CM, ASSENTADO COM ARGAMASSA TRACO 1:4, ARREMATE EM CIMENTO BRANCO, EXCLUSIVE FERRAGENS","M2",0.9,null,null,0,"Referência: AGETOP - 100320"]
[2,2,2,2,3,8,0,0,0,37,2,"","Nível 2","Nível 2","-","SINAPI",null,"IMPERMEABILIZAÇÃO","-",null,null,null,0,""]
["S",2,"S",0,3,8,0,0,0,0,0,"","Serviço","Serviço","-","SINAPI","74106/1","IMPERMEABILIZACAO DE ESTRUTURAS ENTERRADAS, COM TINTA ASFALTICA, DUAS DEMAOS.","M2",48,null,null,0,""]
[2,2,2,2,3,9,0,0,0,35,2,"","Nível 2","Nível 2","-","AGETOP",null,"ESTRUTURA DE MADEIRA","-",null,null,null,0,""]
["S",2,"S",0,3,9,0,0,0,0,0,"","Serviço","Serviço","-","AGETOP",140200,"EST.MAD.TELHA FIBROCIM. COM APOIOS EM LAJES/VIGAS OU PAREDES(SOMENTE TERÇAS) C/FERRAGENS","m2    ",55.42,null,null,0,""]
[2,2,2,4,3,10,0,0,0,33,4,"","Nível 2","Nível 2","-","AGETOP",null,"COBERTURAS","-",null,null,null,0,""]
["S",2,"S",0,3,10,0,0,0,0,0,"","Serviço","Serviço","-","SINAPI",94210,"TELHAMENTO COM TELHA ONDULADA DE FIBROCIMENTO E = 6 MM, COM RECOBRIMENTO LATERAL DE 1 1/4 DE ONDA PARA TELHADO COM INCLINAÇÃO MÁXIMA DE 10°, COM ATÉ 2 ÁGUAS, INCLUSO IÇAMENTO. AF_06/2016","M2",55.42,null,null,0,"Referência: AGETOP - 160501"]
["S",2,"S",0,3,10,0,0,0,0,0,"","Serviço","Serviço","-","SINAPI",94228,"CALHA EM CHAPA DE AÇO GALVANIZADO NÚMERO 24, DESENVOLVIMENTO DE 50 CM, INCLUSO TRANSPORTE VERTICAL. AF_06/2016","M",10.039999999999999,null,null,0,"Referência: AGETOP - 160601"]
["S",2,"S",0,3,10,0,0,0,0,0,"","Serviço","Serviço","-","SINAPI",94231,"RUFO EM CHAPA DE AÇO GALVANIZADO NÚMERO 24, CORTE DE 25 CM, INCLUSO TRANSPORTE VERTICAL. AF_06/2016","M",29.519999999999996,null,null,0,"Referência: AGETOP - 160602"]
[2,2,2,4,3,11,0,0,0,29,4,"","Nível 2","Nível 2","-","AGETOP",null,"ESQUADRIAS METÁLICAS","-",null,null,null,0,""]
["S",2,"S",0,3,11,0,0,0,0,0,"","Serviço","Serviço","-","SINAPI",94559,"JANELA DE AÇO BASCULANTE, FIXAÇÃO COM ARGAMASSA, SEM VIDROS, PADRONIZADA. AF_07/2016","M2",6.2799999999999994,null,null,0,"Referência: AGETOP - 180404"]
[{"$f":"CHOOSE(1+LOG(1+2*(ORÇAMENTO.Nivel=\"Nível 1\")+4*(ORÇAMENTO.Nivel=\"Nível 2\")+8*(ORÇAMENTO.Nivel=\"Nível 3\")+16*(ORÇAMENTO.Nivel=\"Nível 4\")+32*(ORÇAMENTO.Nivel=\"Serviço\"),2),0,1,2,3,4,\"S\")","v":"S"},2,"S",0,3,11,0,0,{"$f":"IF(AND($C733<=4,$C733<>0),0,IF(AND($C733=\"S\",$W733>0),OFFSET(I733,-1,0)+1,OFFSET(I733,-1,0)))","v":0},0,0,"","Serviço","Serviço","-","SINAPI","73933/4","PORTA DE FERRO DE ABRIR TIPO BARRA CHATA, COM REQUADRO E GUARNICAO COMPLETA","M2",3.7800000000000002,null,null,0,"Referência: AGETOP - 180501"]
["S",2,"S",0,3,11,0,0,0,0,0,"","Serviço","Serviço","-","SINAPI","73933/4","PORTA DE FERRO DE ABRIR TIPO BARRA CHATA, COM REQUADRO E GUARNICAO COMPLETA","M2",10.240000000000002,null,null,0,"Referência: AGETOP - 180509"]
[2,2,2,2,3,12,0,0,0,25,2,"","Nível 2","Nível 2","-","AGETOP",null,"VIDROS","-",null,null,null,0,""]
["S",2,"S",0,{"$f":"IF($C736=1,OFFSET(E736,-1,0)+1,OFFSET(E736,-1,0))","v":3},{"$f":"IF($C736=1,0,IF($C736=2,OFFSET(F736,-1,0)+1,OFFSET(F736,-1,0)))","v":12},{"$f":"IF(AND($C736<=2,$C736<>0),0,IF($C736=3,OFFSET(G736,-1,0)+1,OFFSET(G736,-1,0)))","v":0},{"$f":"IF(AND($C736<=3,$C736<>0),0,IF($C736=4,OFFSET(H736,-1,0)+1,OFFSET(H736,-1,0)))","v":0},0,0,0,"","Serviço","Serviço","-","SINAPI",72117,"VIDRO LISO COMUM TRANSPARENTE, ESPESSURA 4MM","M2",5.3379999999999992,null,null,0,"Referência: AGETOP - 190102"]
[2,2,2,5,3,13,0,0,0,23,5,"","Nível 2","Nível 2","-","AGETOP",null,"REVESTIMENTO DE PAREDE","-",null,null,null,0,""]
["S",2,"S",0,3,13,0,0,0,0,0,"","Serviço","Serviço","-","SINAPI",87548,"MASSA ÚNICA, PARA RECEBIMENTO DE PINTURA, EM ARGAMASSA TRAÇO 1:2:8, PREPARO MANUAL, APLICADA MANUALMENTE EM FACES INTERNAS DE PAREDES, ESPESSURA DE 10MM, COM EXECUÇÃO DE TALISCAS. AF_06/2014","M2",54.575999999999965,null,null,0,"Referência: AGETOP - 200403"]
["S",2,"S",0,3,13,0,0,0,0,0,"","Serviço","Serviço","-","SINAPI",87273,"REVESTIMENTO CERÂMICO PARA PAREDES INTERNAS COM PLACAS TIPO ESMALTADA EXTRA DE DIMENSÕES 33X45 CM APLICADAS EM AMBIENTES DE ÁREA MAIOR QUE 5 M² NA ALTURA INTEIRA DAS PAREDES. AF_06/2014","M2",145.80000000000001,null,null,0,""]
["S",2,"S",0,3,13,0,0,0,0,0,"","Serviço","Serviço","-","SINAPI",87549,"EMBOÇO, PARA RECEBIMENTO DE CERÂMICA, EM ARGAMASSA TRAÇO 1:2:8, PREPARO MECÂNICO COM BETONEIRA 400L, APLICADO MANUALMENTE EM FACES INTERNAS DE PAREDES, PARA AMBIENTE COM ÁREA ENTRE 5M2 E 10M2, ESPESSURA DE 10MM, COM EXECUÇÃO DE TALISCAS. AF_06/2014","M2",145.80000000000001,null,null,0,"Referência: AGETOP - 200201"]
["S",2,"S",0,3,13,0,0,0,0,0,"","Serviço","Serviço","-","SINAPI",87904,"CHAPISCO APLICADO EM ALVENARIA (COM PRESENÇA DE VÃOS) E ESTRUTURAS DE CONCRETO DE FACHADA, COM COLHER DE PEDREIRO.  ARGAMASSA TRAÇO 1:3 COM PREPARO MANUAL. AF_06/2014","M2",200.37599999999998,null,null,0,"Referência: AGETOP - 200101"]
[2,{"$f":"IF(OR(C742=\"s\",C742=0),OFFSET(B742,-1,0),C742)","v":2},{"$f":"IF(OFFSET(C742,-1,0)=\"L\",1,IF(OFFSET(C742,-1,0)=1,2,IF(OR(A742=\"s\",A742=0),\"S\",IF(AND(OFFSET(C742,-1,0)=2,A742=4),3,IF(AND(OR(OFFSET(C742,-1,0)=\"s\",OFFSET(C742,-1,0)=0),A742<>\"s\",A742>OFFSET(B742,-1,0)),OFFSET(B742,-1,0),A742)))))","v":2},{"$f":"IF(OR(C742=\"S\",C742=0),0,IF(ISERROR(K742),J742,SMALL(J742:K742,1)))","v":3},3,14,0,0,0,18,3,"","Nível 2","Nível 2","-","AGETOP",null,"FORROS","-",null,null,null,0,""]
["S",2,"S",0,3,14,0,0,0,0,0,"","Serviço","Serviço","-","SINAPI",87414,"APLICAÇÃO MANUAL DE GESSO DESEMPENADO (SEM TALISCAS) EM TETO DE AMBIENTES DE ÁREA MAIOR QUE 10M², ESPESSURA DE 1,0CM. AF_06/2014","M2",55.42,null,null,0,"Referência: AGETOP - 210515"]
["S",2,"S",0,3,14,0,0,0,0,0,"","Serviço","Serviço","-","SINAPI",87884,"CHAPISCO APLICADO NO TETO, COM ROLO PARA TEXTURA ACRÍLICA. ARGAMASSA INDUSTRIALIZADA COM PREPARO MANUAL. AF_06/2014","M2",55.42,null,null,0,"Referência: AGETOP - 210101"]
[2,2,2,4,3,15,0,0,0,15,4,"","Nível 2","Nível 2","-","SINAPI",null,"REVESTIMENTO DE PISO","-",null,null,null,0,""]
["S",2,"S",0,3,15,0,0,0,0,0,"","Serviço","Serviço","-","SINAPI",95241,"LASTRO DE CONCRETO MAGRO, APLICADO EM PISOS OU RADIERS, ESPESSURA DE 5 CM. AF_07/2016","M2",50.8,null,null,0,"Referência: AGETOP - 220050"]
["S",2,"S",0,3,15,0,0,0,0,0,"","Serviço","Serviço","-","SINAPI",87250,"REVESTIMENTO CERÂMICO PARA PISO COM PLACAS TIPO ESMALTADA EXTRA DE DIMENSÕES 45X45 CM APLICADA EM AMBIENTES DE ÁREA ENTRE 5 M2 E 10 M2. AF_06/2014","M2",50.8,null,null,0,""]
["S",2,"S",0,3,15,0,0,0,0,0,"","Serviço","Serviço","-","SINAPI",94992,"EXECUÇÃO DE PASSEIO (CALÇADA) OU PISO DE CONCRETO COM CONCRETO MOLDADO IN LOCO, FEITO EM OBRA, ACABAMENTO CONVENCIONAL, ESPESSURA 6 CM, ARMADO. AF_07/2016","M2",17.7,null,null,0,"Referência: AGETOP - 220060"]
[2,2,2,3,3,16,0,0,0,11,3,"","Nível 2","Nível 2","-","AGETOP",null,"FERRAGENS","-",null,null,null,0,""]
["S",2,"S",0,3,16,0,0,0,0,0,"","Serviço","Serviço","-","AGETOP",230176,"BARRA DE APOIO EM AÇO INOX - 80 CM ","un    ",6,null,null,0,""]
["S",2,"S",0,3,16,0,0,0,0,0,"","Serviço","Serviço","-","AGETOP",230174,"BARRA DE APOIO EM AÇO INOX - 40 CM","un    ",6,null,null,0,""]
[2,2,2,5,3,17,0,0,0,8,5,"","Nível 2","Nível 2","-","AGETOP",null,"PINTURA","-",null,null,null,0,""]
["S",2,"S",0,3,17,0,0,0,0,0,"","Serviço","Serviço","-","AGETOP",260801,"PINTURA A BASE DE SILICONE 1 DEMAO","m2    ",74.616,null,null,0,""]
["S",2,"S",0,3,17,0,0,0,0,0,"","Serviço","Serviço","-","SINAPI",88497,"APLICAÇÃO E LIXAMENTO DE MASSA LÁTEX EM PAREDES, DUAS DEMÃOS. AF_06/2014","M2",54.575999999999965,null,null,0,"Referência: AGETOP - 261300"]
["S",2,"S",0,3,17,0,0,0,0,0,"","Serviço","Serviço","-","SINAPI",88489,"APLICAÇÃO MANUAL DE PINTURA COM TINTA LÁTEX ACRÍLICA EM PAREDES, DUAS DEMÃOS. AF_06/2014","M2",54.575999999999965,null,null,0,"Referência: AGETOP - 261000"]
["S",2,"S",0,3,17,0,0,0,0,0,"","Serviço","Serviço","-","SINAPI","74145/1","PINTURA ESMALTE FOSCO, DUAS DEMAOS, SOBRE SUPERFICIE METALICA, INCLUSO UMA DEMAO DE FUNDO ANTICORROSIVO. UTILIZACAO DE REVOLVER ( AR-COMPRIMIDO).","M2",40.6,null,null,0,"Referência: AGETOP - 261602"]
[2,2,2,3,3,18,0,0,0,3,{"$error":"#N/A"},"","Nível 2","Nível 2","-","AGETOP",null,"DIVERSOS","-",null,null,null,0,""]
["S",2,"S",0,3,18,0,0,0,0,0,"","Serviço","Serviço","-","AGETOP",271303,"BANCO DE CONCRETO POLIDO BASE EM ALVENARIA REBOCADA E PINTADA - PADRÃO AGETOP 2015","m     ",7.8,null,null,0,""]
["S",2,"S",0,3,18,0,0,0,0,0,"","Serviço","Serviço","-","COMPOSIÇÃO","COMP 541_SEE","BANCADA DE GRANITO CINZA POLIDO - FORNECIMENTO E INSTALAÇÃO. ","M2    ",0.41,null,null,0,""]
[1,1,1,66,4,0,0,0,0,66,{"$error":"#N/A"},"F","Nível 1","Nível 1","4.","SINAPI",null,"COBERTURA DE QUADRA MOD 1","-",null,null,null,0,""]
[2,2,2,2,4,1,0,0,0,65,2,"","Nível 2","Nível 2","-","SINAPI",null,"SERVIÇOS PRELIMINARES","-",null,null,null,0,""]
["S",2,"S",0,4,1,0,0,0,0,0,"","Serviço","Serviço","-","AGETOP",20702,"LOCAÇÃO DE OBRAS DE PEQUENO PORTE COM CAVALETE, INCLUSO PINTURA ( FACE INTERNA DO SARRAFO 10CM) E PIQUETE COM TESTEMUNHA","m2    ",100,null,null,0,"Referência: AGETOP - 20148"]
[2,2,2,2,4,2,0,0,0,63,2,"","Nível 2","Nível 2","-","AGETOP",null,"TRANSPORTES","-",null,null,null,0,""]
["S",2,"S",0,4,2,0,0,0,0,0,"","Serviço","Serviço","-","SINAPI",72900,"TRANSPORTE DE ENTULHO COM CAMINHAO BASCULANTE 6 M3, RODOVIA PAVIMENTADA, DMT 0,5 A 1,0 KM","M3",7,null,null,0,""]
[2,2,2,14,4,3,0,0,0,61,14,"","Nível 2","Nível 2","-","AGETOP",null,"FUNDAÇÕES E SONDAGENS","-",null,null,null,0,""]
[3,3,3,5,4,3,1,0,0,13,5,"","Nível 3","Nível 3","-","SINAPI",null,"ESTACAS E BLOCOS","-",null,null,null,0,""]
["S",3,"S",0,4,3,1,0,0,0,0,"","Serviço","Serviço","-","SINAPI",98230,"ESTACA BROCA DE CONCRETO, DIÂMETRO DE 30 CM, PROFUNDIDADE DE ATÉ 3 M, ESCAVAÇÃO MANUAL COM TRADO CONCHA, NÃO ARMADA. AF_03/2018","M",96,null,null,0,"Referência: AGETOP - 50302"]
["S",3,"S",0,4,3,1,0,0,0,0,"","Serviço","Serviço","-","SINAPI",96522,"ESCAVAÇÃO MANUAL PARA BLOCO DE COROAMENTO OU SAPATA, SEM PREVISÃO DE FÔRMA. AF_06/2017","M3",8.2200000000000006,null,null,0,"Referência: AGETOP - 50901"]
["S",3,"S",0,4,3,1,0,0,0,0,"","Serviço","Serviço","-","AGETOP",50902,"APILOAMENTO (BLOCOS/SAPATAS)","m2    ",10.8,null,null,0,""]
["S",3,"S",0,4,3,1,0,0,0,0,"","Serviço","Serviço","-","SINAPI",96543,"ARMAÇÃO DE BLOCO, VIGA BALDRAME E SAPATA UTILIZANDO AÇO CA-60 DE 5 MM - MONTAGEM. AF_06/2017","KG",66.7,null,null,0,"Referência: AGETOP - 52014"]
[3,3,3,8,4,3,2,0,0,8,{"$error":"#N/A"},"","Nível 3","Nível 3","-","SINAPI",null,"VIGAS BALDRAMES","-",null,null,null,0,""]
["S",3,"S",0,4,3,2,0,0,0,0,"","Serviço","Serviço","-","AGETOP",60191,"FORMA DE TABUA CINTA BALDRAME U=8 VEZES","m2    ",24.84,null,null,0,""]
["S",3,"S",0,4,3,2,0,0,0,0,"","Serviço","Serviço","-","AGETOP",60207,"FORMA CH.COMPENSADA 12MM-VIGA/PILAR U=2V - (OBRAS CIVIS","m2    ",132.61000000000001,null,null,0,""]
["S",3,"S",0,4,3,2,0,0,0,0,"","Serviço","Serviço","-","SINAPI",96544,"ARMAÇÃO DE BLOCO, VIGA BALDRAME OU SAPATA UTILIZANDO AÇO CA-50 DE 6,3 MM - MONTAGEM. AF_06/2017","KG",107.5,null,null,0,"Referência: AGETOP - 52003"]
["S",3,"S",0,4,3,2,0,0,0,0,"","Serviço","Serviço","-","SINAPI",96545,"ARMAÇÃO DE BLOCO, VIGA BALDRAME OU SAPATA UTILIZANDO AÇO CA-50 DE 8 MM - MONTAGEM. AF_06/2017","KG",169.7,null,null,0,"Referência: AGETOP - 52004"]
["S",3,"S",0,4,3,2,0,0,0,0,"","Serviço","Serviço","-","SINAPI",96546,"ARMAÇÃO DE BLOCO, VIGA BALDRAME OU SAPATA UTILIZANDO AÇO CA-50 DE 10 MM - MONTAGEM. AF_06/2017","KG",111.3,null,null,0,"Referência: AGETOP - 52005"]
["S",3,"S",0,4,3,2,0,0,0,0,"","Serviço","Serviço","-","SINAPI",94964,"CONCRETO FCK = 20MPA, TRAÇO 1:2,7:3 (CIMENTO/ AREIA MÉDIA/ BRITA 1)  - PREPARO MECÂNICO COM BETONEIRA 400 L. AF_07/2016","M3",13.26,null,null,0,""]
["S",3,"S",0,4,3,2,0,0,0,0,"","Serviço","Serviço","-","SINAPI",92873,"LANÇAMENTO COM USO DE BALDES, ADENSAMENTO E ACABAMENTO DE CONCRETO EM ESTRUTURAS. AF_12/2015","M3",13.26,null,null,0,"Referência: AGETOP - 51055"]
[2,2,2,7,4,4,0,0,0,47,7,"","Nível 2","Nível 2","-","AGETOP",null,"ESTRUTURA","-",null,null,null,0,""]
["S",2,"S",0,4,4,0,0,0,0,0,"","Serviço","Serviço","-","SINAPI",92775,"ARMAÇÃO DE PILAR OU VIGA DE UMA ESTRUTURA CONVENCIONAL DE CONCRETO ARMADO EM UMA EDIFICAÇÃO TÉRREA OU SOBRADO UTILIZANDO AÇO CA-60 DE 5,0 MM - MONTAGEM. AF_12/2015","KG",199.1,null,null,0,"Referência: AGETOP - 60314"]
["S",2,"S",0,4,4,0,0,0,0,0,"","Serviço","Serviço","-","SINAPI",92776,"ARMAÇÃO DE PILAR OU VIGA DE UMA ESTRUTURA CONVENCIONAL DE CONCRETO ARMADO EM UMA EDIFICAÇÃO TÉRREA OU SOBRADO UTILIZANDO AÇO CA-50 DE 6,3 MM - MONTAGEM. AF_12/2015","KG",106,null,null,0,"Referência: AGETOP - 60303"]
["S",2,"S",0,4,4,0,0,0,0,0,"","Serviço","Serviço","-","SINAPI",92778,"ARMAÇÃO DE PILAR OU VIGA DE UMA ESTRUTURA CONVENCIONAL DE CONCRETO ARMADO EM UMA EDIFICAÇÃO TÉRREA OU SOBRADO UTILIZANDO AÇO CA-50 DE 10,0 MM - MONTAGEM. AF_12/2015","KG",434.4,null,null,0,"Referência: AGETOP - 60305"]
["S",2,"S",0,4,4,0,0,0,0,0,"","Serviço","Serviço","-","SINAPI",92779,"ARMAÇÃO DE PILAR OU VIGA DE UMA ESTRUTURA CONVENCIONAL DE CONCRETO ARMADO EM UMA EDIFICAÇÃO TÉRREA OU SOBRADO UTILIZANDO AÇO CA-50 DE 12,5 MM - MONTAGEM. AF_12/2015","KG",718.5,null,null,0,"Referência: AGETOP - 60306"]
["S",2,"S",0,4,4,0,0,0,0,0,"","Serviço","Serviço","-","SINAPI",94964,"CONCRETO FCK = 20MPA, TRAÇO 1:2,7:3 (CIMENTO/ AREIA MÉDIA/ BRITA 1)  - PREPARO MECÂNICO COM BETONEIRA 400 L. AF_07/2016","M3",10.49,null,null,0,""]
["S",2,"S",0,4,4,0,0,0,0,0,"","Serviço","Serviço","-","SINAPI",92874,"LANÇAMENTO COM USO DE BOMBA, ADENSAMENTO E ACABAMENTO DE CONCRETO EM ESTRUTURAS. AF_12/2015","M3",10.49,null,null,0,""]
[2,2,2,27,4,5,0,0,0,{"$f":"IF(OR($C786=\"S\",$C786=0),0,MATCH(0,OFFSET($D786,1,$C786,ROW($C$826)-ROW($C786)),0))","v":40},{"$f":"IF(OR($C786=\"S\",$C786=0),0,MATCH(OFFSET($D786,0,$C786)+1,OFFSET($D786,1,$C786,ROW($C$826)-ROW($C786)),0))","v":27},"","Nível 2","Nível 2","-",null,null,"INSTALAÇÕES ELÉTRICAS","-",null,null,null,0,""]
["S",2,"S",0,4,5,0,0,0,0,0,"","Serviço","Serviço","-","AGETOP",70351,"BRACADEIRA METALICA TIPO \"U\" DIAM. 3/4\"","Un    ",70,null,null,0,""]
["S",2,"S",0,4,5,0,0,0,0,0,"","Serviço","Serviço","-","AGETOP",70352,"BRACADEIRA METALICA TIPO \"U\" DIAM. 1\"","Un    ",45,null,null,0,""]
["S",2,"S",0,4,5,0,0,0,0,0,"","Serviço","Serviço","-","AGETOP",72171,"QUADRO DE DISTRIBUIÇÃO DE EMBUTIR EM PVC CB 24E - 80A","un    ",1,null,null,0,""]
["S",2,"S",0,4,5,0,0,0,0,0,"","Serviço","Serviço","-","AGETOP",71291,"FIO ISOLADO PVC 750 V, No. 2,5 MM2","M     ",1000,null,null,0,""]
["S",2,"S",0,4,5,0,0,0,0,0,"","Serviço","Serviço","-","AGETOP",70391,"BUCHA DE NYLON S-6","Un    ",230,null,null,0,""]
["S",2,"S",0,4,5,0,0,0,0,0,"","Serviço","Serviço","-","AGETOP",70543,"CABO DE COBRE NÚ No. 35 MM2","M     ",9,null,null,0,""]
["S",2,"S",0,4,5,0,0,0,0,0,"","Serviço","Serviço","-","AGETOP",70714,"CAIXA DE PASSAGEM 50X50X80CM FUNDO DE BRITA SEM TAMPA","Un    ",1,null,null,0,""]
["S",2,"S",0,4,5,0,0,0,0,0,"","Serviço","Serviço","-","AGETOP",71380,"HASTE REV.COBRE(COPPERWELD)  3/4\" X 2,40 M C/CONECTOR","Un    ",3,null,null,0,""]
["S",2,"S",0,4,5,0,0,0,0,0,"","Serviço","Serviço","-","AGETOP",71768,"MASSA EPOXI CAIXA DE 250 G","Un    ",2,null,null,0,""]
["S",2,"S",0,4,5,0,0,0,0,0,"","Serviço","Serviço","-","AGETOP",71861,"PARAFUSO P/BUCHA S-6","Un    ",230,null,null,0,""]
["S",2,"S",0,4,5,0,0,0,0,0,"","Serviço","Serviço","-","AGETOP",70927,"CONDULETE DE PVC - TAMPÃO DE 3/4\"  ","un    ",32,null,null,0,""]
["S",2,"S",0,4,5,0,0,0,0,0,"","Serviço","Serviço","-","AGETOP",72501,"TERMINAL DE PRESSAO 2,5 MM2","Un    ",15,null,null,0,""]
["S",2,"S",0,4,5,0,0,0,0,0,"","Serviço","Serviço","-","SINAPI",92868,"CAIXA RETANGULAR 4\" X 2\" MÉDIA (1,30 M DO PISO), METÁLICA, INSTALADA EM PAREDE - FORNECIMENTO E INSTALAÇÃO. AF_12/2015","UN",4,null,null,0,"Referência: AGETOP - 70691"]
["S",2,"S",0,4,5,0,0,0,0,0,"","Serviço","Serviço","-","SINAPI",93653,"DISJUNTOR MONOPOLAR TIPO DIN, CORRENTE NOMINAL DE 10A - FORNECIMENTO E INSTALAÇÃO. AF_04/2016","UN",5,null,null,0,""]
["S",2,"S",0,4,5,0,0,0,0,0,"","Serviço","Serviço","-","SINAPI",93671,"DISJUNTOR TRIPOLAR TIPO DIN, CORRENTE NOMINAL DE 32A - FORNECIMENTO E INSTALAÇÃO. AF_04/2016","UN",1,null,null,0,"Referência: AGETOP - 71173"]
["S",2,"S",0,4,5,0,0,0,0,0,"","Serviço","Serviço","-","AGETOP",71184,"DISPOSITIVO DE PROTEÇÃO CONTRA SURTOS (D.P.S.) 275V DE 8 A 40KA","Un    ",3,null,null,0,"Referência: AGETOP - 71184"]
["S",2,"S",0,4,5,0,0,0,0,0,"","Serviço","Serviço","-","SINAPI",91871,"ELETRODUTO RÍGIDO ROSCÁVEL, PVC, DN 25 MM (3/4\"), PARA CIRCUITOS TERMINAIS, INSTALADO EM PAREDE - FORNECIMENTO E INSTALAÇÃO. AF_12/2015","M",72,null,null,0,"Referência: AGETOP - 71201"]
["S",2,"S",0,4,5,0,0,0,0,0,"","Serviço","Serviço","-","SINAPI",91872,"ELETRODUTO RÍGIDO ROSCÁVEL, PVC, DN 32 MM (1\"), PARA CIRCUITOS TERMINAIS, INSTALADO EM PAREDE - FORNECIMENTO E INSTALAÇÃO. AF_12/2015","M",66,null,null,0,"Referência: AGETOP - 71202"]
["S",2,"S",0,4,5,0,0,0,0,0,"","Serviço","Serviço","-","AGETOP",71321,"FITA DE AUTO FUSAO, ROLO E 10,00 MM","Un    ",1,null,null,0,"Referência: AGETOP - 71321"]
["S",2,"S",0,4,5,0,0,0,0,0,"","Serviço","Serviço","-","AGETOP",71331,"FITA ISOLANTE, ROLO DE 20,00 M","Un    ",4,null,null,0,"Referência: AGETOP - 71331"]
["S",2,"S",0,4,5,0,0,0,0,0,"","Serviço","Serviço","-","SINAPI",72278,"LAMPADA VAPOR METALICO 400W - FORNECIMENTO E INSTALACAO","UN",12,null,null,0,"Referência: AGETOP - 71527"]
["S",2,"S",0,4,5,0,0,0,0,0,"","Serviço","Serviço","-","SINAPI",91884,"LUVA PARA ELETRODUTO, PVC, ROSCÁVEL, DN 25 MM (3/4\"), PARA CIRCUITOS TERMINAIS, INSTALADA EM PAREDE - FORNECIMENTO E INSTALAÇÃO. AF_12/2015","UN",27,null,null,0,"Referência: AGETOP - 71741"]
["S",2,"S",0,4,5,0,0,0,0,0,"","Serviço","Serviço","-","SINAPI",91885,"LUVA PARA ELETRODUTO, PVC, ROSCÁVEL, DN 32 MM (1\"), PARA CIRCUITOS TERMINAIS, INSTALADA EM PAREDE - FORNECIMENTO E INSTALAÇÃO. AF_12/2015","UN",22,null,null,0,"Referência: AGETOP - 71742"]
["S",2,"S",0,4,5,0,0,0,0,0,"","Serviço","Serviço","-","AGETOP",72238,"REATOR AFP USO EXTERNO V.METALICO 400 W","Un    ",12,null,null,0,"Referência: AGETOP - 72238"]
["S",2,"S",0,4,5,0,0,0,0,0,"","Serviço","Serviço","-","SINAPI","74246/1","REFLETOR RETANGULAR FECHADO COM LAMPADA VAPOR METALICO 400 W","UN",12,null,null,0,"Referência: AGETOP - 72395"]
["S",2,"S",0,4,5,0,0,0,0,0,"","Serviço","Serviço","-","SINAPI",91996,"TOMADA MÉDIA DE EMBUTIR (1 MÓDULO), 2P+T 10 A, INCLUINDO SUPORTE E PLACA - FORNECIMENTO E INSTALAÇÃO. AF_12/2015","UN",5,null,null,0,"Referência: AGETOP - 72578"]
[2,2,2,2,4,6,0,0,0,13,2,"","Nível 2","Nível 2","-",null,null,"IMPERMEABILIZAÇÃO","-",null,null,null,0,""]
["S",2,"S",0,4,6,0,0,0,0,0,"","Serviço","Serviço","-","SINAPI",98562,"IMPERMEABILIZAÇÃO DE FLOREIRA OU VIGA BALDRAME COM ARGAMASSA DE CIMENTO E AREIA, COM ADITIVO IMPERMEABILIZANTE, E = 2 CM. AF_06/2018","M2",24.84,null,null,0,"Referência: AGETOP - 120902"]
[2,2,2,2,4,7,0,0,0,11,2,"","Nível 2","Nível 2","-",null,null,"ESTRUTURAS METÁLICAS","-",null,null,null,0,""]
["S",2,"S",0,4,7,0,0,0,0,0,"","Serviço","Serviço","-","AGETOP",150103,"ESTRUTURA METÁLICA CONVENCIONAL EM AÇO DO TIPO USI SAC-300 COM FUNDO ANTICORROSIVO","Kg    ",7131.73,null,null,0,""]
[2,2,2,4,4,8,0,0,0,9,4,"","Nível 2","Nível 2","-",null,null,"COBERTURAS","-",null,null,null,0,""]
[3,3,3,3,4,8,1,0,0,3,{"$error":"#N/A"},"","Nível 3","Nível 3","-",null,null,"METÁLICA","-",null,null,null,0,""]
["S",3,"S",0,4,8,1,0,0,0,0,"","Serviço","Serviço","-","AGETOP",160969,"COBERTURA COM TELHA CHAPA GALVANIZADA TRAPEZOIDAL 0,43 MM COM ACESSÓRIOS","m2    ",719.4,null,null,0,""]
["S",3,"S",0,4,8,1,0,0,0,0,"","Serviço","Serviço","-","AGETOP",160963,"CUMEEIRA PARA TELHA GALVANIZADA TRAPEZOIDAL 0,43MM","M     ",33,null,null,0,""]
[2,2,2,3,4,9,0,0,0,5,3,"","Nível 2","Nível 2","-",null,null,"PINTURA","-",null,null,null,0,""]
[3,3,3,2,4,9,1,0,0,2,{"$error":"#N/A"},"","Nível 3","Nível 3","-","AGETOP",null,"ESTRUTURA METÁLICA","-",null,null,null,0,""]
["S",3,"S",0,4,9,1,0,0,0,0,"","Serviço","Serviço","-","SINAPI","74145/1","PINTURA ESMALTE FOSCO, DUAS DEMAOS, SOBRE SUPERFICIE METALICA, INCLUSO UMA DEMAO DE FUNDO ANTICORROSIVO. UTILIZACAO DE REVOLVER ( AR-COMPRIMIDO).","M2",719.4,null,null,0,"Referência: AGETOP - 261609"]
[2,2,2,2,4,10,0,0,0,2,{"$error":"#N/A"},"","Nível 2","Nível 2","-",null,null,"DIVERSOS","-",null,null,null,0,""]
["S",2,"S",0,4,10,0,0,0,0,0,"","Serviço","Serviço","-","AGETOP",270501,"LIMPEZA FINAL DE OBRA - (OBRAS CIVIS)","m2    ",582.4,null,null,0,""]
[-1,null,-1,null,0,0,0,0,0,null,null,"F"]
[null,null,null,null,null,null,null,null,null,null,null,"F",null,null,null,null,null,"OBS: OS QUANTITATIVOS DE MATERIAIS  DAS INSTALAÇÕES HIDROSSANITÁRIAS, ELÉTRICAS E ESPECIAIS SÃO FORNECIDOS PELOS PROFISSIONAIS RESPONSÁVEIS PELOS RESPECTIVOS PROJETOS.",null,null,"VALOR TOTAL",null,0]
[null,null,null,null,null,null,null,null,null,null,null,"F",null,null,null,null,null,null,null,null,"VALOR BDI (21,36%)",null,0]
[null,null,null,null,null,null,null,null,null,null,null,"F",null,null,null,null,null,null,null,null,"TOTAL ORÇAMENTO",null,0]
[null,null,null,null,null,null,null,null,null,null,null,"F"]
[null,null,null,null,null,null,null,null,null,null,null,"F",null,null,null,null,null,null,null,null,"CUSTO POR M2 ³",null,0]
[null,null,null,null,null,null,null,null,null,null,null,"F",null,null,null,null,null,null,null,null,"MATERIAL S/ BDI",null,0]
[null,null,null,null,null,null,null,null,null,null,null,"F",null,null,null,null,null,null,null,null,"MÃO DE OBRA S/ BDI",null,0]
[null,null,null,null,null,null,null,null,null,null,null,"F"]
[null,null,null,null,null,null,null,null,null,null,null,"F",null,null,null,null,"(1) Conforme previsto pelo DECRETO Nº 7.983, DE 8 DE ABRIL DE 2013, os preços adotados são aqueles constantes dos sistemas de referência indicados. Justifica-se o uso dos preços destas composições de custos unitários devido ao seu valor ser menor à mediana de seus correspondentes na tabela SINAPI;"]
[null,null,null,null,null,null,null,null,null,null,null,"F",null,null,null,null,"(2) Optou-se pelo uso das composições de custos da AGETOP para itens não presentes na SINAPI;"]
[null,null,null,null,null,null,null,null,null,null,null,"F",null,null,null,null,"(3) Para itens da AGETOP, os vidros não estão inclusos nas esquadrias e já foram considerados os custos de contramarco para as esquadrias de alumínio;"]
[null,null,null,null,null,null,null,null,null,null,null,"F",null,null,null,null,"(4) Nos casos em que houver execução de granitina e omissão do item AGETOP 221102, considerou-se que o quantitativo para o rodapé, de altura igual a 7cm, foi incorporado na área de piso;"]
[null,null,null,null,null,null,null,null,null,null,null,"F",null,null,null,null,"(5) O custo unitário aproximado por metro quadrado é calculado dividindo-se o valor total do orçamento pela área total de construção."]
[null,null,null,null,null,null,null,null,null,null,null,"F"]
[null,null,null,null,null,null,null,null,null,null,null,"F"]
[]
[null,null,null,null,null,null,null,null,null,null,null,null,null,null,"SOMATÓRIO DE SERVIÇOS"]
[null,null,null,null,null,null,null,null,null,null,null,null,null,null,"ITEM","DESCRIÇÃO DOS SERVIÇOS",null,null,"PREÇO SEM BDI",null,null,"PREÇO COM BDI",null,"PARTICIPAÇÃO ( % )"]
[null,null,null,null,null,null,null,null,null,null,null,null,null,null,"a.","SERVIÇOS PRELIMINARES",null,null,{"$f":"SUMIF($R$19:$R$826,$P845,$W$19:$W$826)","v":0},null,null,{"$f":"ROUND(S845*(1+BDI.Taxa),2)","v":0},null,{"$f":"IFERROR(ROUND($V845*100/$W$829,2),0)","v":0}]
[null,null,null,null,null,null,null,null,null,null,null,null,null,null,"b.","TRANSPORTES",null,null,0,null,null,0,null,{"$f":"IFERROR(ROUND($V846*100/$W$829,2),0)","v":0}]
[null,null,null,null,null,null,null,null,null,null,null,null,null,null,"c.","SERVIÇO EM TERRA",null,null,0,null,null,0,null,0]
[null,null,null,null,null,null,null,null,null,null,null,null,null,null,"d.","FUNDAÇÕES E SONDAGENS",null,null,0,null,null,0,null,0]
[null,null,null,null,null,null,null,null,null,null,null,null,null,null,"e.","ESTRUTURA",null,null,0,null,null,0,null,0]
[null,null,null,null,null,null,null,null,null,null,null,null,null,null,"f.","INSTALAÇÕES ELÉTRICAS",null,null,0,null,null,0,null,0]
[null,null,null,null,null,null,null,null,null,null,null,null,null,null,"g.","INSTALAÇÕES HIDROSSANITÁRIAS",null,null,0,null,null,0,null,0]
[null,null,null,null,null,null,null,null,null,null,null,null,null,null,"h","INSTALAÇÕES ESPECIAIS",null,null,0,null,null,0,null,0]
[null,null,null,null,null,null,null,null,null,null,null,null,null,null,"i.","ALVENARIAS E DIVISÓRIAS",null,null,0,null,null,0,null,0]
[null,null,null,null,null,null,null,null,null,null,null,null,null,null,"j.","ALVENARIA AUTO-PORTANTE",null,null,0,null,null,0,null,0]
[null,null,null,null,null,null,null,null,null,null,null,null,null,null,"k.","IMPERMEABILIZAÇÃO",null,null,0,null,null,0,null,0]
[null,null,null,null,null,null,null,null,null,null,null,null,null,null,"l.","ISOLAMENTO TÉRMICO E ACÚSTICO",null,null,0,null,null,0,null,0]
[null,null,null,null,null,null,null,null,null,null,null,null,null,null,"m.","ESTRUTURA DE MADEIRA",null,null,0,null,null,0,null,0]
[null,null,null,null,null,null,null,null,null,null,null,null,null,null,"n.","ESTRUTURAS METÁLICAS",null,null,0,null,null,0,null,0]
[null,null,null,null,null,null,null,null,null,null,null,null,null,null,"o.","COBERTURAS",null,null,0,null,null,0,null,0]
[null,null,null,null,null,null,null,null,null,null,null,null,null,null,"p.","ESQUADRIAS DE MADEIRA",null,null,0,null,null,0,null,0]
[null,null,null,null,null,null,null,null,null,null,null,null,null,null,"q.","ESQUADRIAS METÁLICAS",null,null,0,null,null,{"$f":"ROUND(S861*(1+BDI.Taxa),2)","v":0},null,0]
[null,null,null,null,null,null,null,null,null,null,null,null,null,null,"r.","VIDROS",null,null,0,null,null,0,null,0]
[null,null,null,null,null,null,null,null,null,null,null,null,null,null,"s.","REVESTIMENTO DE PAREDE",null,null,0,null,null,0,null,0]
[null,null,null,null,null,null,null,null,null,null,null,null,null,null,"t.","FORROS",null,null,0,null,null,0,null,0]
[null,null,null,null,null,null,null,null,null,null,null,null,null,null,"u.","REVESTIMENTO DE PISO",null,null,0,null,null,0,null,0]
[null,null,null,null,null,null,null,null,null,null,null,null,null,null,"v.","FERRAGENS",null,null,0,null,null,0,null,0]
[null,null,null,null,null,null,null,null,null,null,null,null,null,null,"w.","MARCENARIA",null,null,0,null,null,0,null,0]
[null,null,null,null,null,null,null,null,null,null,null,null,null,null,"x.","ADMINISTRAÇÃO",null,null,0,null,null,0,null,0]
[null,null,null,null,null,null,null,null,null,null,null,null,null,null,"y.","PINTURA",null,null,0,null,null,{"$f":"ROUND(S869*(1+BDI.Taxa),2)","v":0},null,0]
[null,null,null,null,null,null,null,null,null,null,null,null,null,null,"z.","DIVERSOS",null,null,0,null,null,{"$f":"IF(S870>0,IF((SUM(V845:W869)+ROUND(S870*(1+BDI.Taxa),2))<>V872,V872-SUM(V845:W869),ROUND(S870*(1+BDI.Taxa),2)),0)","v":0},null,{"$f":"IF(S870>0,IF((SUM(X845:X869)+IFERROR(ROUND($V870*100/$W$829,2),0))<>X872,X872-SUM(X845:X869),IFERROR(ROUND($V870*100/$W$829,2),0)),0)","v":0}]
[null,null,null,null,null,null,null,null,null,null,null,null,null,null,"TOTAL GERAL DO ORÇAMENTO (R$)",null,null,null,{"$f":"SUM(S845:U870)","v":0},null,null,{"$f":"SUM(V845:W870)","v":0},null,{"$f":"SUM(X845:X870)","v":0}]
[null,null,null,null,null,null,null,null,null,null,null,null,null,null,null,null,null,null,{"$f":"$W$827","v":0},null,null,{"$f":"$W$829","v":0},null,100]
[null,null,null,null,null,null,null,null,null,null,null,null,null,null,null,null,null,null,"(TOTAL SEM BDI)",null,null,"(TOTAL COM BDI)",null,"(ARRED porcentagem)"]
[null,null,null,null,null,null,null,null,null,null,null,null,null,null,null,null,null,null,{"$f":"IF(AND(S871=S872,S871>0),\"OK\",\"ERRO\")","v":"ERRO"},null,null,{"$f":"IF(AND(V871=V872,V871>0),\"OK\",\"ERRO\")","v":"ERRO"},null,{"$f":"IF(X871=100,\"OK\",\"ERRO\")","v":"ERRO"}]
[]
[]
[null,null,null,null,null,null,null,null,null,null,null,null,null,null,"RESUMO GERAL DO ORÇAMENTO"]
[null,null,null,null,null,null,null,null,null,null,null,null,null,null,"ITEM","DESCRIÇÃO DOS SERVIÇOS",null,null,"PREÇO SEM BDI",null,null,"PREÇO COM BDI",null,"PARTICIPAÇÃO ( % )"]
[null,null,null,null,null,null,null,null,null,null,null,null,null,null,"1.",{"$f":"IFERROR(VLOOKUP(O879,$O$19:$W$826,4,FALSE),\"\")","v":"REFORMA"},null,null,{"$f":"IF(P880=\"\",$S$900-SUM(OFFSET($S$878:S878,0,0,COUNTA($S$878:S878),1)),SUMIF($R$19:$R$826,$P879,$W$19:$W$826))","v":0},null,null,{"$f":"IF(P880=\"\",$V$900-SUM(OFFSET($V$878:V878,0,0,COUNTA($V$878:V878),1)),ROUND(S879*(1+BDI.Taxa),2))","v":0},null,{"$f":"IF(P880=\"\",$X$900-SUM(OFFSET($X$878:X878,0,0,COUNTA($X$878:X878),1)),ROUND(V879*100/ORÇAMENTO.TotalOrçamento,2))","v":{"$error":"#DIV/0!"}}]
[null,null,null,null,null,null,null,null,null,null,null,null,null,null,"2.","COZINHA PADRÃO SEDUCE",null,null,{"$f":"IF(P881=\"\",$S$900-SUM(OFFSET($S$878:S879,0,0,COUNTA($S$878:S879),1)),SUMIF($R$19:$R$826,$P880,$W$19:$W$826))","v":0},null,null,{"$f":"IF(P881=\"\",$V$900-SUM(OFFSET($V$878:V879,0,0,COUNTA($V$878:V879),1)),ROUND(S880*(1+BDI.Taxa),2))","v":0},null,{"$f":"IF(P881=\"\",$X$900-SUM(OFFSET($X$878:X879,0,0,COUNTA($X$878:X879),1)),ROUND(V880*100/ORÇAMENTO.TotalOrçamento,2))","v":{"$error":"#DIV/0!"}}]
[null,null,null,null,null,null,null,null,null,null,null,null,null,null,"3.","VESTIÁRIO PADRÃO SEDUCE",null,null,{"$f":"IF(P882=\"\",$S$900-SUM(OFFSET($S$878:S880,0,0,COUNTA($S$878:S880),1)),SUMIF($R$19:$R$826,$P881,$W$19:$W$826))","v":0},null,null,{"$f":"IF(P882=\"\",$V$900-SUM(OFFSET($V$878:V880,0,0,COUNTA($V$878:V880),1)),ROUND(S881*(1+BDI.Taxa),2))","v":0},null,{"$f":"IF(P882=\"\",$X$900-SUM(OFFSET($X$878:X880,0,0,COUNTA($X$878:X880),1)),ROUND(V881*100/ORÇAMENTO.TotalOrçamento,2))","v":{"$error":"#DIV/0!"}}]
[null,null,null,null,null,null,null,null,null,null,null,null,null,null,"4.","COBERTURA DE QUADRA MOD 1",null,null,{"$f":"IF(P883=\"\",$S$900-SUM(OFFSET($S$878:S881,0,0,COUNTA($S$878:S881),1)),SUMIF($R$19:$R$826,$P882,$W$19:$W$826))","v":0},null,null,{"$f":"IF(P883=\"\",$V$900-SUM(OFFSET($V$878:V881,0,0,COUNTA($V$878:V881),1)),ROUND(S882*(1+BDI.Taxa),2))","v":0},null,{"$f":"IF(P883=\"\",$X$900-SUM(OFFSET($X$878:X881,0,0,COUNTA($X$878:X881),1)),ROUND(V882*100/ORÇAMENTO.TotalOrçamento,2))","v":{"$error":"#DIV/0!"}}]
[null,null,null,null,null,null,null,null,null,null,null,null,null,null,"5.","",null,null,{"$f":"IF(P884=\"\",$S$900-SUM(OFFSET($S$878:S882,0,0,COUNTA($S$878:S882),1)),SUMIF($R$19:$R$826,$P883,$W$19:$W$826))","v":0},null,null,{"$f":"IF(P884=\"\",$V$900-SUM(OFFSET($V$878:V882,0,0,COUNTA($V$878:V882),1)),ROUND(S883*(1+BDI.Taxa),2))","v":0},null,{"$f":"IF(P884=\"\",$X$900-SUM(OFFSET($X$878:X882,0,0,COUNTA($X$878:X882),1)),ROUND(V883*100/ORÇAMENTO.TotalOrçamento,2))","v":{"$error":"#DIV/0!"}}]
[null,null,null,null,null,null,null,null,null,null,null,null,null,null,"6.","",null,null,{"$f":"IF(P885=\"\",$S$900-SUM(OFFSET($S$878:S883,0,0,COUNTA($S$878:S883),1)),SUMIF($R$19:$R$826,$P884,$W$19:$W$826))","v":0},null,null,{"$f":"IF(P885=\"\",$V$900-SUM(OFFSET($V$878:V883,0,0,COUNTA($V$878:V883),1)),ROUND(S884*(1+BDI.Taxa),2))","v":0},null,{"$f":"IF(P885=\"\",$X$900-SUM(OFFSET($X$878:X883,0,0,COUNTA($X$878:X883),1)),ROUND(V884*100/ORÇAMENTO.TotalOrçamento,2))","v":{"$error":"#DIV/0!"}}]
[null,null,null,null,null,null,null,null,null,null,null,null,null,null,"7.","",null,null,{"$f":"IF(P886=\"\",$S$900-SUM(OFFSET($S$878:S884,0,0,COUNTA($S$878:S884),1)),SUMIF($R$19:$R$826,$P885,$W$19:$W$826))","v":0},null,null,{"$f":"IF(P886=\"\",$V$900-SUM(OFFSET($V$878:V884,0,0,COUNTA($V$878:V884),1)),ROUND(S885*(1+BDI.Taxa),2))","v":0},null,{"$f":"IF(P886=\"\",$X$900-SUM(OFFSET($X$878:X884,0,0,COUNTA($X$878:X884),1)),ROUND(V885*100/ORÇAMENTO.TotalOrçamento,2))","v":{"$error":"#DIV/0!"}}]
[null,null,null,null,null,null,null,null,null,null,null,null,null,null,"8.","",null,null,{"$f":"IF(P887=\"\",$S$900-SUM(OFFSET($S$878:S885,0,0,COUNTA($S$878:S885),1)),SUMIF($R$19:$R$826,$P886,$W$19:$W$826))","v":0},null,null,{"$f":"IF(P887=\"\",$V$900-SUM(OFFSET($V$878:V885,0,0,COUNTA($V$878:V885),1)),ROUND(S886*(1+BDI.Taxa),2))","v":0},null,{"$f":"IF(P887=\"\",$X$900-SUM(OFFSET($X$878:X885,0,0,COUNTA($X$878:X885),1)),ROUND(V886*100/ORÇAMENTO.TotalOrçamento,2))","v":{"$error":"#DIV/0!"}}]
[null,null,null,null,null,null,null,null,null,null,null,null,null,null,"9.","",null,null,{"$f":"IF(P888=\"\",$S$900-SUM(OFFSET($S$878:S886,0,0,COUNTA($S$878:S886),1)),SUMIF($R$19:$R$826,$P887,$W$19:$W$826))","v":0},null,null,{"$f":"IF(P888=\"\",$V$900-SUM(OFFSET($V$878:V886,0,0,COUNTA($V$878:V886),1)),ROUND(S887*(1+BDI.Taxa),2))","v":0},null,{"$f":"IF(P888=\"\",$X$900-SUM(OFFSET($X$878:X886,0,0,COUNTA($X$878:X886),1)),ROUND(V887*100/ORÇAMENTO.TotalOrçamento,2))","v":{"$error":"#DIV/0!"}}]
[null,null,null,null,null,null,null,null,null,null,null,null,null,null,"10.","",null,null,{"$f":"IF(P889=\"\",$S$900-SUM(OFFSET($S$878:S887,0,0,COUNTA($S$878:S887),1)),SUMIF($R$19:$R$826,$P888,$W$19:$W$826))","v":0},null,null,{"$f":"IF(P889=\"\",$V$900-SUM(OFFSET($V$878:V887,0,0,COUNTA($V$878:V887),1)),ROUND(S888*(1+BDI.Taxa),2))","v":0},null,{"$f":"IF(P889=\"\",$X$900-SUM(OFFSET($X$878:X887,0,0,COUNTA($X$878:X887),1)),ROUND(V888*100/ORÇAMENTO.TotalOrçamento,2))","v":{"$error":"#DIV/0!"}}]
[null,null,null,null,null,null,null,null,null,null,null,null,null,null,"11.","",null,null,{"$f":"IF(P890=\"\",$S$900-SUM(OFFSET($S$878:S888,0,0,COUNTA($S$878:S888),1)),SUMIF($R$19:$R$826,$P889,$W$19:$W$826))","v":0},null,null,{"$f":"IF(P890=\"\",$V$900-SUM(OFFSET($V$878:V888,0,0,COUNTA($V$878:V888),1)),ROUND(S889*(1+BDI.Taxa),2))","v":0},null,{"$f":"IF(P890=\"\",$X$900-SUM(OFFSET($X$878:X888,0,0,COUNTA($X$878:X888),1)),ROUND(V889*100/ORÇAMENTO.TotalOrçamento,2))","v":{"$error":"#DIV/0!"}}]
[null,null,null,null,null,null,null,null,null,null,null,null,null,null,"12.","",null,null,{"$f":"IF(P891=\"\",$S$900-SUM(OFFSET($S$878:S889,0,0,COUNTA($S$878:S889),1)),SUMIF($R$19:$R$826,$P890,$W$19:$W$826))","v":0},null,null,{"$f":"IF(P891=\"\",$V$900-SUM(OFFSET($V$878:V889,0,0,COUNTA($V$878:V889),1)),ROUND(S890*(1+BDI.Taxa),2))","v":0},null,{"$f":"IF(P891=\"\",$X$900-SUM(OFFSET($X$878:X889,0,0,COUNTA($X$878:X889),1)),ROUND(V890*100/ORÇAMENTO.TotalOrçamento,2))","v":{"$error":"#DIV/0!"}}]
[null,null,null,null,null,null,null,null,null,null,null,null,null,null,"13.","",null,null,{"$f":"IF(P892=\"\",$S$900-SUM(OFFSET($S$878:S890,0,0,COUNTA($S$878:S890),1)),SUMIF($R$19:$R$826,$P891,$W$19:$W$826))","v":0},null,null,{"$f":"IF(P892=\"\",$V$900-SUM(OFFSET($V$878:V890,0,0,COUNTA($V$878:V890),1)),ROUND(S891*(1+BDI.Taxa),2))","v":0},null,{"$f":"IF(P892=\"\",$X$900-SUM(OFFSET($X$878:X890,0,0,COUNTA($X$878:X890),1)),ROUND(V891*100/ORÇAMENTO.TotalOrçamento,2))","v":{"$error":"#DIV/0!"}}]
[null,null,null,null,null,null,null,null,null,null,null,null,null,null,"14.","",null,null,{"$f":"IF(P893=\"\",$S$900-SUM(OFFSET($S$878:S891,0,0,COUNTA($S$878:S891),1)),SUMIF($R$19:$R$826,$P892,$W$19:$W$826))","v":0},null,null,{"$f":"IF(P893=\"\",$V$900-SUM(OFFSET($V$878:V891,0,0,COUNTA($V$878:V891),1)),ROUND(S892*(1+BDI.Taxa),2))","v":0},null,{"$f":"IF(P893=\"\",$X$900-SUM(OFFSET($X$878:X891,0,0,COUNTA($X$878:X891),1)),ROUND(V892*100/ORÇAMENTO.TotalOrçamento,2))","v":{"$error":"#DIV/0!"}}]
[null,null,null,null,null,null,null,null,null,null,null,null,null,null,"15.","",null,null,{"$f":"IF(P894=\"\",$S$900-SUM(OFFSET($S$878:S892,0,0,COUNTA($S$878:S892),1)),SUMIF($R$19:$R$826,$P893,$W$19:$W$826))","v":0},null,null,{"$f":"IF(P894=\"\",$V$900-SUM(OFFSET($V$878:V892,0,0,COUNTA($V$878:V892),1)),ROUND(S893*(1+BDI.Taxa),2))","v":0},null,{"$f":"IF(P894=\"\",$X$900-SUM(OFFSET($X$878:X892,0,0,COUNTA($X$878:X892),1)),ROUND(V893*100/ORÇAMENTO.TotalOrçamento,2))","v":{"$error":"#DIV/0!"}}]
[null,null,null,null,null,null,null,null,null,null,null,null,null,null,"16.","",null,null,{"$f":"IF(P895=\"\",$S$900-SUM(OFFSET($S$878:S893,0,0,COUNTA($S$878:S893),1)),SUMIF($R$19:$R$826,$P894,$W$19:$W$826))","v":0},null,null,{"$f":"IF(P895=\"\",$V$900-SUM(OFFSET($V$878:V893,0,0,COUNTA($V$878:V893),1)),ROUND(S894*(1+BDI.Taxa),2))","v":0},null,{"$f":"IF(P895=\"\",$X$900-SUM(OFFSET($X$878:X893,0,0,COUNTA($X$878:X893),1)),ROUND(V894*100/ORÇAMENTO.TotalOrçamento,2))","v":{"$error":"#DIV/0!"}}]
[null,null,null,null,null,null,null,null,null,null,null,null,null,null,"17.","",null,null,{"$f":"IF(P896=\"\",$S$900-SUM(OFFSET($S$878:S894,0,0,COUNTA($S$878:S894),1)),SUMIF($R$19:$R$826,$P895,$W$19:$W$826))","v":0},null,null,{"$f":"IF(P896=\"\",$V$900-SUM(OFFSET($V$878:V894,0,0,COUNTA($V$878:V894),1)),ROUND(S895*(1+BDI.Taxa),2))","v":0},null,{"$f":"IF(P896=\"\",$X$900-SUM(OFFSET($X$878:X894,0,0,COUNTA($X$878:X894),1)),ROUND(V895*100/ORÇAMENTO.TotalOrçamento,2))","v":{"$error":"#DIV/0!"}}]
[null,null,null,null,null,null,null,null,null,null,null,null,null,null,"18.","",null,null,{"$f":"IF(P897=\"\",$S$900-SUM(OFFSET($S$878:S895,0,0,COUNTA($S$878:S895),1)),SUMIF($R$19:$R$826,$P896,$W$19:$W$826))","v":0},null,null,{"$f":"IF(P897=\"\",$V$900-SUM(OFFSET($V$878:V895,0,0,COUNTA($V$878:V895),1)),ROUND(S896*(1+BDI.Taxa),2))","v":0},null,{"$f":"IF(P897=\"\",$X$900-SUM(OFFSET($X$878:X895,0,0,COUNTA($X$878:X895),1)),ROUND(V896*100/ORÇAMENTO.TotalOrçamento,2))","v":{"$error":"#DIV/0!"}}]
[null,null,null,null,null,null,null,null,null,null,null,null,null,null,"19.","",null,null,{"$f":"IF(P898=\"\",$S$900-SUM(OFFSET($S$878:S896,0,0,COUNTA($S$878:S896),1)),SUMIF($R$19:$R$826,$P897,$W$19:$W$826))","v":0},null,null,{"$f":"IF(P898=\"\",$V$900-SUM(OFFSET($V$878:V896,0,0,COUNTA($V$878:V896),1)),ROUND(S897*(1+BDI.Taxa),2))","v":0},null,{"$f":"IF(P898=\"\",$X$900-SUM(OFFSET($X$878:X896,0,0,COUNTA($X$878:X896),1)),ROUND(V897*100/ORÇAMENTO.TotalOrçamento,2))","v":{"$error":"#DIV/0!"}}]
[null,null,null,null,null,null,null,null,null,null,null,null,null,null,"20.","",null,null,{"$f":"IF(P899=\"\",$S$900-SUM(OFFSET($S$878:S897,0,0,COUNTA($S$878:S897),1)),SUMIF($R$19:$R$826,$P898,$W$19:$W$826))","v":0},null,null,{"$f":"IF(P899=\"\",$V$900-SUM(OFFSET($V$878:V897,0,0,COUNTA($V$878:V897),1)),ROUND(S898*(1+BDI.Taxa),2))","v":0},null,{"$f":"IF(P899=\"\",$X$900-SUM(OFFSET($X$878:X897,0,0,COUNTA($X$878:X897),1)),ROUND(V898*100/ORÇAMENTO.TotalOrçamento,2))","v":{"$error":"#DIV/0!"}}]
[null,null,null,null,null,null,null,null,null,null,null,null,null,null,"TOTAL GERAL DO ORÇAMENTO (R$)",null,null,null,{"$f":"SUM(S879:U898)","v":0},null,null,{"$f":"SUM(V879:W898)","v":0},null,{"$f":"SUM(X879:X898)","v":{"$error":"#DIV/0!"}}]
[null,null,null,null,null,null,null,null,null,null,null,null,null,null,null,null,null,null,{"$f":"$W$827","v":0},null,null,{"$f":"$W$829","v":0},null,100]
[null,null,null,null,null,null,null,null,null,null,null,null,null,null,null,null,null,null,"(TOTAL SEM BDI)",null,null,"(TOTAL COM BDI)",null,"(ARRED porcentagem)"]
[null,null,null,null,null,null,null,null,null,null,null,null,null,null,null,null,null,null,{"$f":"IF(AND(S899=S900,S899>0),\"OK\",\"ERRO\")","v":"ERRO"},null,null,{"$f":"IF(AND(V899=V900,V899>0),\"OK\",\"ERRO\")","v":"ERRO"},null,{"$f":"IF(AND(X899=100,S879<>0),\"OK\",\"ERRO\")","v":{"$error":"#DIV/0!"}}]

{"sheet":"Resumo ","index":1,"n_rows":39,"n_cols":9,"rows_kept":39,"cut":false,"hidden":false,"merged":[[13,0,14,0],[34,2,34,3],[35,2,35,3],[31,2,31,3],[32,2,32,3],[33,2,33,3],[28,2,28,3],[29,2,29,3],[30,2,30,3],[0,1,0,8],[36,1,36,5],[2,1,2,5],[3,1,3,5],[5,1,5,5],[6,1,6,5],[8,1,8,5],[9,1,9,5],[11,3,11,5],[12,3,12,5],[10,1,10,8],[11,6,11,8],[12,6,12,8],[25,2,25,3],[21,2,21,3],[22,2,22,3],[6,6,6,8],[7,1,7,8],[8,6,8,8],[9,6,9,8],[13,1,13,8],[1,1,1,8],[2,6,2,8],[3,6,3,8],[4,1,4,8],[5,6,5,8],[42,3,42,7],[11,1,11,2],[12,1,12,2],[15,2,15,3],[16,2,16,3],[14,1,14,8],[17,2,17,3],[23,2,23,3],[18,2,18,3],[19,2,19,3],[20,2,20,3],[41,3,41,7],[24,2,24,3],[26,2,26,3],[27,2,27,3],[38,1,38,8]]}
[]
[]
[null,"UNIDADE ESCOLAR",null,null,null,null,"CÓDIGO INEP"]
[null,{"$f":"Orçamento!$O$4","v":"CENTRO DE ENSINO EM PERÍODO INTEGRAL PADRE TRINDADE"},null,null,null,null,{"$f":"Orçamento!V4","v":52020452}]
[]
[null,"OBRA",null,null,null,null,"CIDADE"]
[null,{"$f":"Orçamento!$O$7","v":"REFORMA E AMPLIAÇÃO"},null,null,null,null,{"$f":"Orçamento!$V$7","v":"ANÁPOLIS"}]
[]
[null,"ENDEREÇO",null,null,null,null,"CRE"]
[null,{"$f":"Orçamento!$R$10","v":"RUA SILVA PINTO S/N, JUNDIAI, CEP:75110-640"},null,null,null,null,{"$f":"Orçamento!$O$10","v":"ANÁPOLIS"}]
[]
[null,"REFERÊNCIA",null,"DATA",null,null,"ÁREA TOTAL CONSTRUÍDA (M²)"]
[null,{"$f":"CONCATENATE(\"AGETOP E SINAPI - \",Orçamento!$W$10)","v":"AGETOP E SINAPI - ONERADA"},null,{"$f":"Orçamento!$S$7","v":"2020-04-08"},null,null,{"$f":"Orçamento!$S$13","v":1889.2599999999998}]
["FILTRO"]
[null,"RESUMO GERAL DO ORÇAMENTO"]
["↓","ITEM","DESCRIÇÃO DOS SERVIÇOS",null,"UNID","QUANT","PREÇO SEM BDI","PREÇO COM BDI","PARTICIP. (%)"]
[{"$f":"IF(E17>0,\"F\",\"\")","v":"F"},"1.",{"$f":"Orçamento!$P879","v":"REFORMA"},null,"UN ",1,{"$f":"IFERROR(Orçamento!S879,\"-\")","v":0},{"$f":"IFERROR(Orçamento!V879,\"\")","v":0},{"$f":"Orçamento!X879","v":{"$error":"#DIV/0!"}}]
[{"$f":"IF(E18>0,\"F\",\"\")","v":"F"},"2.",{"$f":"Orçamento!$P880","v":"COZINHA PADRÃO SEDUCE"},null,"UN ",1,{"$f":"IFERROR(Orçamento!S880,\"-\")","v":0},{"$f":"IFERROR(Orçamento!V880,\"\")","v":0},{"$f":"Orçamento!X880","v":{"$error":"#DIV/0!"}}]
["F","3.",{"$f":"Orçamento!$P881","v":"VESTIÁRIO PADRÃO SEDUCE"},null,"UN ",1,{"$f":"IFERROR(Orçamento!S881,\"-\")","v":0},{"$f":"IFERROR(Orçamento!V881,\"\")","v":0},{"$f":"Orçamento!X881","v":{"$error":"#DIV/0!"}}]
["F","4.",{"$f":"Orçamento!$P882","v":"COBERTURA DE QUADRA MOD 1"},null,"UN ",1,{"$f":"IFERROR(Orçamento!S882,\"-\")","v":0},{"$f":"IFERROR(Orçamento!V882,\"\")","v":0},{"$f":"Orçamento!X882","v":{"$error":"#DIV/0!"}}]
["","5.",{"$f":"Orçamento!$P883","v":""},null,null,null,{"$f":"IFERROR(Orçamento!S883,\"-\")","v":0},{"$f":"IFERROR(Orçamento!V883,\"\")","v":0},{"$f":"Orçamento!X883","v":{"$error":"#DIV/0!"}}]
["","6.",{"$f":"Orçamento!$P884","v":""},null,null,null,{"$f":"IFERROR(Orçamento!S884,\"-\")","v":0},{"$f":"IFERROR(Orçamento!V884,\"\")","v":0},{"$f":"Orçamento!X884","v":{"$error":"#DIV/0!"}}]
["","7.",{"$f":"Orçamento!$P885","v":""},null,null,null,{"$f":"IFERROR(Orçamento!S885,\"-\")","v":0},{"$f":"IFERROR(Orçamento!V885,\"\")","v":0},{"$f":"Orçamento!X885","v":{"$error":"#DIV/0!"}}]
["","8.",{"$f":"Orçamento!$P886","v":""},null,null,null,{"$f":"IFERROR(Orçamento!S886,\"-\")","v":0},{"$f":"IFERROR(Orçamento!V886,\"\")","v":0},{"$f":"Orçamento!X886","v":{"$error":"#DIV/0!"}}]
["","9.",{"$f":"Orçamento!$P887","v":""},null,null,null,{"$f":"IFERROR(Orçamento!S887,\"-\")","v":0},{"$f":"IFERROR(Orçamento!V887,\"\")","v":0},{"$f":"Orçamento!X887","v":{"$error":"#DIV/0!"}}]
["","10.",{"$f":"Orçamento!$P888","v":""},null,null,null,{"$f":"IFERROR(Orçamento!S888,\"-\")","v":0},{"$f":"IFERROR(Orçamento!V888,\"\")","v":0},{"$f":"Orçamento!X888","v":{"$error":"#DIV/0!"}}]
["","11.",{"$f":"Orçamento!$P889","v":""},null,null,null,{"$f":"IFERROR(Orçamento!S889,\"-\")","v":0},{"$f":"IFERROR(Orçamento!V889,\"\")","v":0},{"$f":"Orçamento!X889","v":{"$error":"#DIV/0!"}}]
["","12.",{"$f":"Orçamento!$P890","v":""},null,null,null,{"$f":"IFERROR(Orçamento!S890,\"-\")","v":0},{"$f":"IFERROR(Orçamento!V890,\"\")","v":0},{"$f":"Orçamento!X890","v":{"$error":"#DIV/0!"}}]
["","13.",{"$f":"Orçamento!$P891","v":""},null,null,null,{"$f":"IFERROR(Orçamento!S891,\"-\")","v":0},{"$f":"IFERROR(Orçamento!V891,\"\")","v":0},{"$f":"Orçamento!X891","v":{"$error":"#DIV/0!"}}]
["","14.",{"$f":"Orçamento!$P892","v":""},null,null,null,{"$f":"IFERROR(Orçamento!S892,\"-\")","v":0},{"$f":"IFERROR(Orçamento!V892,\"\")","v":0},{"$f":"Orçamento!X892","v":{"$error":"#DIV/0!"}}]
["","15.",{"$f":"Orçamento!$P893","v":""},null,null,null,{"$f":"IFERROR(Orçamento!S893,\"-\")","v":0},{"$f":"IFERROR(Orçamento!V893,\"\")","v":0},{"$f":"Orçamento!X893","v":{"$error":"#DIV/0!"}}]
["","16.",{"$f":"Orçamento!$P894","v":""},null,null,null,{"$f":"IFERROR(Orçamento!S894,\"-\")","v":0},{"$f":"IFERROR(Orçamento!V894,\"\")","v":0},{"$f":"Orçamento!X894","v":{"$error":"#DIV/0!"}}]
["","17.",{"$f":"Orçamento!$P895","v":""},null,null,null,{"$f":"IFERROR(Orçamento!S895,\"-\")","v":0},{"$f":"IFERROR(Orçamento!V895,\"\")","v":0},{"$f":"Orçamento!X895","v":{"$error":"#DIV/0!"}}]
["","18.",{"$f":"Orçamento!$P896","v":""},null,null,null,{"$f":"IFERROR(Orçamento!S896,\"-\")","v":0},{"$f":"IFERROR(Orçamento!V896,\"\")","v":0},{"$f":"Orçamento!X896","v":{"$error":"#DIV/0!"}}]
["","19.",{"$f":"Orçamento!$P897","v":""},null,null,null,{"$f":"IFERROR(Orçamento!S897,\"-\")","v":0},{"$f":"IFERROR(Orçamento!V897,\"\")","v":0},{"$f":"Orçamento!X897","v":{"$error":"#DIV/0!"}}]
["","20.",{"$f":"Orçamento!$P898","v":""},null,null,null,{"$f":"IFERROR(Orçamento!S898,\"-\")","v":0},{"$f":"IFERROR(Orçamento!V898,\"\")","v":0},{"$f":"Orçamento!X898","v":{"$error":"#DIV/0!"}}]
["F","TOTAL GERAL DO ORÇAMENTO (R$)",null,null,null,null,{"$f":"SUM(G17:G36)","v":0},0,{"$f":"SUM(I17:I36)","v":{"$error":"#DIV/0!"}}]
["F"]
["F"]

{"sheet":"Somatório","index":2,"n_rows":45,"n_cols":6,"rows_kept":45,"cut":false,"hidden":false,"merged":[[13,0,14,0],[42,1,42,2],[44,1,44,5],[47,3,47,5],[48,3,48,5],[13,1,13,5],[9,1,9,3],[9,4,9,5],[11,1,11,2],[11,4,11,5],[12,1,12,2],[12,4,12,5],[0,1,0,5],[14,1,14,5],[2,1,2,3],[2,4,2,5],[3,1,3,3],[3,4,3,5],[5,1,5,3],[5,4,5,5],[6,1,6,3],[6,4,6,5],[8,1,8,3],[8,4,8,5],[1,1,1,5],[4,1,4,5],[7,1,7,5],[10,1,10,5]]}
[]
[]
[null,"UNIDADE ESCOLAR",null,null,"CÓDIGO INEP"]
[null,{"$f":"Orçamento!$O$4","v":"CENTRO DE ENSINO EM PERÍODO INTEGRAL PADRE TRINDADE"},null,null,{"$f":"Orçamento!V4","v":52020452}]
[]
[null,"OBRA",null,null,"CIDADE"]
[null,{"$f":"Orçamento!$O$7","v":"REFORMA E AMPLIAÇÃO"},null,null,{"$f":"Orçamento!$V$7","v":"ANÁPOLIS"}]
[]
[null,"ENDEREÇO",null,null,"CRE"]
[null,{"$f":"Orçamento!$R$10","v":"RUA SILVA PINTO S/N, JUNDIAI, CEP:75110-640"},null,null,{"$f":"Orçamento!$O$10","v":"ANÁPOLIS"}]
[]
[null,"REFERÊNCIA",null,"DATA","ÁREA TOTAL CONSTRUÍDA (M²)"]
[null,{"$f":"CONCATENATE(\"AGETOP E SINAPI - \",Orçamento!$W$10)","v":"AGETOP E SINAPI - ONERADA"},null,{"$f":"Orçamento!$S$7","v":"2020-04-08"},{"$f":"Orçamento!$S$13","v":1889.2599999999998}]
["FILTRO"]
[null,"SOMATÓRIO DE SERVIÇOS"]
["↓","ITEM","DESCRIÇÃO DOS SERVIÇOS","PREÇO SEM BDI (R$)","PREÇO COM BDI (R$)","PARTIC.  ( % )"]
[{"$f":"IF(D17>0,\"F\",\"\")","v":""},"a.",{"$f":"Orçamento!P845","v":"SERVIÇOS PRELIMINARES"},{"$f":"Orçamento!S845","v":0},{"$f":"Orçamento!V845","v":0},{"$f":"Orçamento!X845","v":0}]
[{"$f":"IF(D18>0,\"F\",\"\")","v":""},"b.",{"$f":"Orçamento!P846","v":"TRANSPORTES"},{"$f":"Orçamento!S846","v":0},{"$f":"Orçamento!V846","v":0},{"$f":"Orçamento!X846","v":0}]
["","c.",{"$f":"Orçamento!P847","v":"SERVIÇO EM TERRA"},{"$f":"Orçamento!S847","v":0},{"$f":"Orçamento!V847","v":0},{"$f":"Orçamento!X847","v":0}]
["","d.",{"$f":"Orçamento!P848","v":"FUNDAÇÕES E SONDAGENS"},{"$f":"Orçamento!S848","v":0},{"$f":"Orçamento!V848","v":0},{"$f":"Orçamento!X848","v":0}]
["","e.",{"$f":"Orçamento!P849","v":"ESTRUTURA"},{"$f":"Orçamento!S849","v":0},{"$f":"Orçamento!V849","v":0},{"$f":"Orçamento!X849","v":0}]
["","f.",{"$f":"Orçamento!P850","v":"INSTALAÇÕES ELÉTRICAS"},{"$f":"Orçamento!S850","v":0},{"$f":"Orçamento!V850","v":0},{"$f":"Orçamento!X850","v":0}]
["","g.",{"$f":"Orçamento!P851","v":"INSTALAÇÕES HIDROSSANITÁRIAS"},{"$f":"Orçamento!S851","v":0},{"$f":"Orçamento!V851","v":0},{"$f":"Orçamento!X851","v":0}]
["","h",{"$f":"Orçamento!P852","v":"INSTALAÇÕES ESPECIAIS"},{"$f":"Orçamento!S852","v":0},{"$f":"Orçamento!V852","v":0},{"$f":"Orçamento!X852","v":0}]
["","i.",{"$f":"Orçamento!P853","v":"ALVENARIAS E DIVISÓRIAS"},{"$f":"Orçamento!S853","v":0},{"$f":"Orçamento!V853","v":0},{"$f":"Orçamento!X853","v":0}]
["","j.",{"$f":"Orçamento!P854","v":"ALVENARIA AUTO-PORTANTE"},{"$f":"Orçamento!S854","v":0},{"$f":"Orçamento!V854","v":0},{"$f":"Orçamento!X854","v":0}]
["","k.",{"$f":"Orçamento!P855","v":"IMPERMEABILIZAÇÃO"},{"$f":"Orçamento!S855","v":0},{"$f":"Orçamento!V855","v":0},{"$f":"Orçamento!X855","v":0}]
["","l.",{"$f":"Orçamento!P856","v":"ISOLAMENTO TÉRMICO E ACÚSTICO"},{"$f":"Orçamento!S856","v":0},{"$f":"Orçamento!V856","v":0},{"$f":"Orçamento!X856","v":0}]
["","m.",{"$f":"Orçamento!P857","v":"ESTRUTURA DE MADEIRA"},{"$f":"Orçamento!S857","v":0},{"$f":"Orçamento!V857","v":0},{"$f":"Orçamento!X857","v":0}]
["","n.",{"$f":"Orçamento!P858","v":"ESTRUTURAS METÁLICAS"},{"$f":"Orçamento!S858","v":0},{"$f":"Orçamento!V858","v":0},{"$f":"Orçamento!X858","v":0}]
["","o.",{"$f":"Orçamento!P859","v":"COBERTURAS"},{"$f":"Orçamento!S859","v":0},{"$f":"Orçamento!V859","v":0},{"$f":"Orçamento!X859","v":0}]
["","p.",{"$f":"Orçamento!P860","v":"ESQUADRIAS DE MADEIRA"},{"$f":"Orçamento!S860","v":0},{"$f":"Orçamento!V860","v":0},{"$f":"Orçamento!X860","v":0}]
["","q.",{"$f":"Orçamento!P861","v":"ESQUADRIAS METÁLICAS"},{"$f":"Orçamento!S861","v":0},{"$f":"Orçamento!V861","v":0},{"$f":"Orçamento!X861","v":0}]
["","r.",{"$f":"Orçamento!P862","v":"VIDROS"},{"$f":"Orçamento!S862","v":0},{"$f":"Orçamento!V862","v":0},{"$f":"Orçamento!X862","v":0}]
["","s.",{"$f":"Orçamento!P863","v":"REVESTIMENTO DE PAREDE"},{"$f":"Orçamento!S863","v":0},{"$f":"Orçamento!V863","v":0},{"$f":"Orçamento!X863","v":0}]
["","t.",{"$f":"Orçamento!P864","v":"FORROS"},{"$f":"Orçamento!S864","v":0},{"$f":"Orçamento!V864","v":0},{"$f":"Orçamento!X864","v":0}]
["","u.",{"$f":"Orçamento!P865","v":"REVESTIMENTO DE PISO"},{"$f":"Orçamento!S865","v":0},{"$f":"Orçamento!V865","v":0},{"$f":"Orçamento!X865","v":0}]
["","v.",{"$f":"Orçamento!P866","v":"FERRAGENS"},{"$f":"Orçamento!S866","v":0},{"$f":"Orçamento!V866","v":0},{"$f":"Orçamento!X866","v":0}]
["","w.",{"$f":"Orçamento!P867","v":"MARCENARIA"},{"$f":"Orçamento!S867","v":0},{"$f":"Orçamento!V867","v":0},{"$f":"Orçamento!X867","v":0}]
["","x.",{"$f":"Orçamento!P868","v":"ADMINISTRAÇÃO"},{"$f":"Orçamento!S868","v":0},{"$f":"Orçamento!V868","v":0},{"$f":"Orçamento!X868","v":0}]
["","y.",{"$f":"Orçamento!P869","v":"PINTURA"},{"$f":"Orçamento!S869","v":0},{"$f":"Orçamento!V869","v":0},{"$f":"Orçamento!X869","v":0}]
["","z.",{"$f":"Orçamento!P870","v":"DIVERSOS"},{"$f":"Orçamento!S870","v":0},{"$f":"Orçamento!V870","v":0},{"$f":"Orçamento!X870","v":0}]
["F","TOTAL GERAL DO ORÇAMENTO",null,{"$f":"SUM(D17:D42)","v":0},{"$f":"SUM(E17:E42)","v":0},{"$f":"SUM(F17:F42)","v":0}]
[]
[null,"(*) Para itens da AGETOP, os vidros não estão inclusos nas esquadrias e já foram considerados os custos de contramarco para as esquadrias de alumínio;"]

{"sheet":"Cronog_120_Dias","index":3,"n_rows":99,"n_cols":22,"rows_kept":99,"cut":false,"hidden":false,"merged":[[2,1,2,7],[5,1,5,7],[6,1,6,7],[8,1,8,7],[9,1,9,7],[4,1,4,21],[7,1,7,21],[0,1,0,21],[1,1,1,21],[2,8,2,21],[12,0,13,0],[9,0,11,0],[11,1,11,21],[92,1,92,2],[92,5,92,8],[92,9,92,12],[93,1,93,2],[93,5,93,8],[93,9,93,12],[74,9,74,12],[74,5,74,8],[68,9,68,12],[70,5,70,8],[70,9,70,12],[59,5,59,8],[71,1,73,2],[71,4,73,4],[71,5,71,8],[71,9,71,12],[73,5,73,8],[73,9,73,12],[59,9,59,12],[61,5,61,8],[61,9,61,12],[94,1,94,2],[94,5,94,8],[94,9,94,12],[76,5,76,8],[76,9,76,12],[77,5,77,8],[77,9,77,12],[79,5,79,8],[79,9,79,12],[80,5,80,8],[80,9,80,12],[82,5,82,8],[82,9,82,12],[77,3,79,3],[80,3,82,3],[86,1,88,2],[80,4,82,4],[95,1,95,2],[95,5,95,8],[95,9,95,12],[97,1,97,4],[98,1,98,21],[86,9,86,12],[88,5,88,8],[88,9,88,12],[85,5,85,8],[85,9,85,12],[89,1,91,2],[89,4,91,4],[89,5,89,8],[89,9,89,12],[91,5,91,8],[91,9,91,12],[89,3,91,3],[86,4,88,4],[86,5,86,8],[86,3,88,3],[83,1,85,2],[83,4,85,4],[83,5,83,8],[83,9,83,12],[68,5,68,8],[65,5,65,8],[65,9,65,12],[67,5,67,8],[67,9,67,12],[65,3,67,3],[62,9,62,12],[64,5,64,8],[64,9,64,12],[62,5,62,8],[53,9,53,12],[55,5,55,8],[55,9,55,12],[50,5,50,8],[50,9,50,12],[52,5,52,8],[52,9,52,12],[56,9,56,12],[58,5,58,8],[58,9,58,12],[53,5,53,8],[56,5,56,8],[44,9,44,12],[46,5,46,8],[46,9,46,12],[47,1,49,2],[47,4,49,4],[47,5,47,8],[47,9,47,12],[49,5,49,8],[49,9,49,12],[44,5,44,8],[47,3,49,3],[35,9,35,12],[37,5,37,8],[37,9,37,12],[35,3,37,3],[40,9,40,12],[38,3,40,3],[38,9,38,12],[41,1,43,2],[41,4,43,4],[41,5,41,8],[41,9,41,12],[43,5,43,8],[43,9,43,12],[41,3,43,3],[35,5,35,8],[38,5,38,8],[40,5,40,8],[29,9,29,12],[31,5,31,8],[31,9,31,12],[32,1,34,2],[32,4,34,4],[32,5,32,8],[32,9,32,12],[34,5,34,8],[34,9,34,12],[32,3,34,3],[29,5,29,8],[29,1,31,2],[29,4,31,4],[26,1,28,2],[26,4,28,4],[26,5,26,8],[26,9,26,12],[28,5,28,8],[28,9,28,12],[23,3,25,3],[23,1,25,2],[23,4,25,4],[23,5,23,8],[26,3,28,3],[14,3,16,3],[17,3,19,3],[14,4,16,4],[14,5,14,8],[14,9,14,12],[16,5,16,8],[16,9,16,12],[23,9,23,12],[25,5,25,8],[25,9,25,12],[17,9,17,12],[19,5,19,8],[19,9,19,12],[20,1,22,2],[20,4,22,4],[20,5,20,8],[20,9,20,12],[22,5,22,8],[22,9,22,12],[20,3,22,3],[83,3,85,3],[53,4,55,4],[59,1,61,2],[59,4,61,4],[74,1,76,2],[77,1,79,2],[77,4,79,4],[80,1,82,2],[65,1,67,2],[68,3,70,3],[62,3,64,3],[68,1,70,2],[56,3,58,3],[65,4,67,4],[71,3,73,3],[74,3,76,3],[74,4,76,4],[56,1,58,2],[68,4,70,4],[44,3,46,3],[62,1,64,2],[62,4,64,4],[38,1,40,2],[38,4,40,4],[59,3,61,3],[44,1,46,2],[44,4,46,4],[53,1,55,2],[50,1,52,2],[50,4,52,4],[10,1,10,21],[9,8,9,21],[8,8,8,21],[3,8,3,21],[6,8,6,21],[5,8,5,21],[3,1,3,7],[56,4,58,4],[29,3,31,3],[35,1,37,2],[35,4,37,4],[50,3,52,3],[53,3,55,3],[12,21,13,21],[13,1,13,2],[13,5,13,8],[13,9,13,12],[12,3,13,3],[12,9,12,12],[14,1,16,2],[12,5,12,8],[17,1,19,2],[17,4,19,4],[17,5,17,8],[12,13,12,16],[12,17,12,20],[13,13,13,16],[13,17,13,20],[14,13,14,16],[14,17,14,20],[16,13,16,16],[16,17,16,20],[19,13,19,16],[19,17,19,20],[71,13,71,16],[71,17,71,20],[74,13,74,16],[74,17,74,20],[47,13,47,16],[47,17,47,20],[22,13,22,16],[22,17,22,20],[25,13,25,16],[25,17,25,20],[28,13,28,16],[28,17,28,20],[31,13,31,16],[31,17,31,20],[34,13,34,16],[34,17,34,20],[32,13,32,16],[32,17,32,20],[35,13,35,16],[35,17,35,20],[38,13,38,16],[38,17,38,20],[37,13,37,16],[37,17,37,20],[64,13,64,16],[64,17,64,20],[67,13,67,16],[67,17,67,20],[70,13,70,16],[70,17,70,20],[65,13,65,16],[65,17,65,20],[68,13,68,16],[68,17,68,20],[46,13,46,16],[46,17,46,20],[49,13,49,16],[49,17,49,20],[41,13,41,16],[41,17,41,20],[44,13,44,16],[44,17,44,20],[17,13,17,16],[17,17,17,20],[20,13,20,16],[20,17,20,20],[23,13,23,16],[23,17,23,20],[26,13,26,16],[26,17,26,20],[29,13,29,16],[29,17,29,20],[40,13,40,16],[40,17,40,20],[43,13,43,16],[43,17,43,20],[50,13,50,16],[50,17,50,20],[53,13,53,16],[53,17,53,20],[56,13,56,16],[56,17,56,20],[59,13,59,16],[59,17,59,20],[62,13,62,16],[62,17,62,20],[52,13,52,16],[52,17,52,20],[55,13,55,16],[55,17,55,20],[58,13,58,16],[58,17,58,20],[61,13,61,16],[61,17,61,20],[77,13,77,16],[77,17,77,20],[73,13,73,16],[73,17,73,20],[76,13,76,16],[76,17,76,20],[93,13,93,16],[93,17,93,20],[94,13,94,16],[94,17,94,20],[79,13,79,16],[79,17,79,20],[95,13,95,16],[95,17,95,20],[80,13,80,16],[80,17,80,20],[83,13,83,16],[83,17,83,20],[86,13,86,16],[86,17,86,20],[89,13,89,16],[89,17,89,20],[92,13,92,16],[92,17,92,20],[82,13,82,16],[82,17,82,20],[85,13,85,16],[85,17,85,20],[88,13,88,16],[88,17,88,20],[91,13,91,16],[91,17,91,20]]}
[]
[]
[null,"UNIDADE ESCOLAR",null,null,null,null,null,null,"PRAZO"]
[null,{"$f":"Orçamento!$O$4","v":"CENTRO DE ENSINO EM PERÍODO INTEGRAL PADRE TRINDADE"},null,null,null,null,null,null,"120 DIAS CORRIDOS"]
[]
[null,"OBRA",null,null,null,null,null,null,"DATA"]
[null,{"$f":"Orçamento!$O$7","v":"REFORMA E AMPLIAÇÃO"},null,null,null,null,null,null,{"$f":"Orçamento!$S$7","v":"2020-04-08"}]
[]
[null,"LOCAL",null,null,null,null,null,null,"ÁREA TOTAL CONSTRUÍDA (M²)"]
["FILTRO",{"$f":"Orçamento!$V$7","v":"ANÁPOLIS"},null,null,null,null,null,null,{"$f":"Orçamento!$S$13","v":1889.2599999999998}]
[]
[null,"CRONOGRAMA - FÍSICO FINANCEIRO"]
["↓","CUSTO TOTAL:",{"$f":"D93","v":0},"VALOR","Dias:",30,null,null,null,60,null,null,null,90,null,null,null,120,null,null,null,"TOTAL"]
[null,"DESCRIÇÃO DOS SERVIÇOS",null,null,"%","1ª PARCELA",null,null,null,"2ª PARCELA",null,null,null,"3ª PARCELA",null,null,null,"4ª PARCELA"]
[{"$f":"IF(D15>0,\"F\",\"\")","v":""},"SERVIÇOS PRELIMINARES",null,{"$f":"Orçamento!V845","v":0},{"$f":"Orçamento!X845","v":0},{"$f":"ROUND(F17*$D$15,2)","v":0},null,null,null,{"$f":"ROUND(J17*$D$15,2)","v":0},null,null,null,{"$f":"ROUND(N17*$D$15,2)","v":0},null,null,null,{"$f":"ROUND(R17*$D$15,2)","v":0},null,null,null,{"$f":"SUM(F15:U15)","v":0}]
[{"$f":"IF(A15=\"F\",A15,\"\")","v":""}]
[{"$f":"IF(A16=\"F\",A16,\"\")","v":""},null,null,null,null,0.8,null,null,null,0.2,null,null,null,{"$f":"ROUND(N19*$D$15,2)","v":0},null,null,null,null,null,null,null,{"$f":"IFERROR(E15/100,\"\")","v":0}]
[{"$f":"IF(D18>0,\"F\",\"\")","v":""},"TRANSPORTES",null,{"$f":"Orçamento!V846","v":0},{"$f":"Orçamento!X846","v":0},{"$f":"ROUND(F20*$D$18,2)","v":0},null,null,null,{"$f":"ROUND(J20*$D$18,2)","v":0},null,null,null,{"$f":"ROUND(N20*$D18,2)","v":0},null,null,null,{"$f":"D18-F18-J18-N18","v":0},null,null,null,{"$f":"SUM(F18:U18)","v":0}]
[{"$f":"IF(A18=\"F\",A18,\"\")","v":""}]
[{"$f":"IF(A19=\"F\",A19,\"\")","v":""},null,null,null,null,0.23,null,null,null,0.24,null,null,null,0.26,null,null,null,0.27,null,null,null,{"$f":"IFERROR(E18/100,\"\")","v":0}]
[{"$f":"IF(D21>0,\"F\",\"\")","v":""},"SERVIÇO EM TERRA",null,{"$f":"Orçamento!V847","v":0},{"$f":"Orçamento!X847","v":0},{"$f":"ROUND(F23*$D$21,2)","v":0},null,null,null,{"$f":"ROUND(J23*$D$21,2)","v":0},null,null,null,{"$f":"ROUND(N23*$D21,2)","v":0},null,null,null,{"$f":"ROUND(R23*$D21,2)","v":0},null,null,null,{"$f":"SUM(F21:U21)","v":0}]
[{"$f":"IF(A21=\"F\",A21,\"\")","v":""}]
[{"$f":"IF(A22=\"F\",A22,\"\")","v":""},null,null,null,null,0.8,null,null,null,0.2,null,null,null,0,null,null,null,0,null,null,null,{"$f":"IFERROR(E21/100,\"\")","v":0}]
[{"$f":"IF(D24>0,\"F\",\"\")","v":""},"FUNDAÇÕES E SONDAGENS",null,{"$f":"Orçamento!V848","v":0},{"$f":"Orçamento!X848","v":0},{"$f":"ROUND(F26*$D$24,2)","v":0},null,null,null,{"$f":"ROUND(J26*$D$24,2)","v":0},null,null,null,{"$f":"ROUND(N26*$D24,2)","v":0},null,null,null,{"$f":"ROUND(R26*$D24,2)","v":0},null,null,null,{"$f":"SUM(F24:U24)","v":0}]
[{"$f":"IF(A24=\"F\",A24,\"\")","v":""}]
[{"$f":"IF(A25=\"F\",A25,\"\")","v":""},null,null,null,null,0.8,null,null,null,{"$f":"1-F26","v":0.19999999999999996},null,null,null,0,null,null,null,0,null,null,null,{"$f":"IFERROR(E24/100,\"\")","v":0}]
[{"$f":"IF(D27>0,\"F\",\"\")","v":""},"ESTRUTURA",null,{"$f":"Orçamento!V849","v":0},{"$f":"Orçamento!X849","v":0},{"$f":"ROUND(F29*$D$27,2)","v":0},null,null,null,{"$f":"D27-F27-N27","v":0},null,null,null,{"$f":"ROUND(N29*$D27,2)","v":0},null,null,null,{"$f":"ROUND(R29*$D27,2)","v":0},null,null,null,{"$f":"SUM(F27:U27)","v":0}]
[{"$f":"IF(A27=\"F\",A27,\"\")","v":""}]
[{"$f":"IF(A28=\"F\",A28,\"\")","v":""},null,null,null,null,0.2,null,null,null,0.6,null,null,null,0.2,null,null,null,0,null,null,null,{"$f":"IFERROR(E27/100,\"\")","v":0}]
[{"$f":"IF(D30>0,\"F\",\"\")","v":""},"INST.ELET/TELEFÔNICA/CABEAMENTO ESTRUTURADO",null,{"$f":"Orçamento!V850","v":0},{"$f":"Orçamento!X850","v":0},{"$f":"ROUND(F32*$D$30,2)","v":0},null,null,null,{"$f":"ROUND(J32*$D$30,2)","v":0},null,null,null,{"$f":"ROUND(N32*$D30,2)","v":0},null,null,null,{"$f":"D30-F30-J30-N30","v":0},null,null,null,{"$f":"SUM(F30:U30)","v":0}]
[{"$f":"IF(A30=\"F\",A30,\"\")","v":""}]
[{"$f":"IF(A31=\"F\",A31,\"\")","v":""},null,null,null,null,0.25,null,null,null,0.25,null,null,null,0.24,null,null,null,0.26,null,null,null,{"$f":"IFERROR(E30/100,\"\")","v":0}]
[{"$f":"IF(D33>0,\"F\",\"\")","v":""},"INSTALAÇÕES HIDROSSANITÁRIAS",null,{"$f":"Orçamento!V851","v":0},{"$f":"Orçamento!X851","v":0},{"$f":"ROUND(F35*$D$33,2)","v":0},null,null,null,{"$f":"ROUND(J35*$D$33,2)","v":0},null,null,null,{"$f":"D33-F33-J33","v":0},null,null,null,{"$f":"ROUND(R35*$D33,2)","v":0},null,null,null,{"$f":"SUM(F33:U33)","v":0}]
[{"$f":"IF(A33=\"F\",A33,\"\")","v":""}]
[{"$f":"IF(A34=\"F\",A34,\"\")","v":""},null,null,null,null,0.33,null,null,null,0.33,null,null,null,0.34,null,null,null,0,null,null,null,{"$f":"IFERROR(E33/100,\"\")","v":0}]
[{"$f":"IF(D36>0,\"F\",\"\")","v":""},"INSTALAÇÕES ESPECIAIS",null,{"$f":"Orçamento!V852","v":0},{"$f":"Orçamento!X852","v":0},{"$f":"ROUND(F38*$D$36,2)","v":0},null,null,null,{"$f":"ROUND(J38*$D$36,2)","v":0},null,null,null,{"$f":"ROUND(N38*$D36,2)","v":0},null,null,null,{"$f":"ROUND(R38*$D36,2)","v":0},null,null,null,{"$f":"SUM(F36:U36)","v":0}]
[{"$f":"IF(A36=\"F\",A36,\"\")","v":""}]
[{"$f":"IF(A37=\"F\",A37,\"\")","v":""},null,null,null,null,null,null,null,null,null,null,null,null,0,null,null,null,1,null,null,null,{"$f":"IFERROR(E36/100,\"\")","v":0}]
[{"$f":"IF(D39>0,\"F\",\"\")","v":""},"ALVENARIA E DIVISÓRIAS",null,{"$f":"Orçamento!V853","v":0},{"$f":"Orçamento!X853","v":0},{"$f":"ROUND(F41*$D$39,2)","v":0},null,null,null,{"$f":"ROUND(J41*$D$39,2)","v":0},null,null,null,{"$f":"ROUND(N41*$D39,2)","v":0},null,null,null,{"$f":"ROUND(R41*$D39,2)","v":0},null,null,null,{"$f":"SUM(F39:U39)","v":0}]
[{"$f":"IF(A39=\"F\",A39,\"\")","v":""}]
[{"$f":"IF(A40=\"F\",A40,\"\")","v":""},null,null,null,null,1,null,null,null,{"$f":"1-F41","v":0},null,null,null,0,null,null,null,0,null,null,null,{"$f":"IFERROR(E39/100,\"\")","v":0}]
[{"$f":"IF(D42>0,\"F\",\"\")","v":""},"ALVENARIA AUTO-PORTANTE",null,{"$f":"Orçamento!V854","v":0},{"$f":"Orçamento!X854","v":0},{"$f":"ROUND(F44*$D$42,2)","v":0},null,null,null,{"$f":"ROUND(J44*$D$42,2)","v":0},null,null,null,{"$f":"ROUND(N44*$D42,2)","v":0},null,null,null,{"$f":"ROUND(R44*$D42,2)","v":0},null,null,null,{"$f":"SUM(F42:U42)","v":0}]
[{"$f":"IF(A42=\"F\",A42,\"\")","v":""}]
[{"$f":"IF(A43=\"F\",A43,\"\")","v":""},null,null,null,null,1,null,null,null,{"$f":"1-F44","v":0},null,null,null,0,null,null,null,0,null,null,null,{"$f":"IFERROR(E42/100,\"\")","v":0}]
[{"$f":"IF(D45>0,\"F\",\"\")","v":""},"IMPERMEABILIZAÇÃO",null,{"$f":"Orçamento!V855","v":0},{"$f":"Orçamento!X855","v":0},{"$f":"ROUND(F47*$D$45,2)","v":0},null,null,null,{"$f":"ROUND(J47*$D$45,2)","v":0},null,null,null,{"$f":"ROUND(N47*$D45,2)","v":0},null,null,null,{"$f":"ROUND(R47*$D45,2)","v":0},null,null,null,{"$f":"SUM(F45:U45)","v":0}]
[{"$f":"IF(A45=\"F\",A45,\"\")","v":""}]
[{"$f":"IF(A46=\"F\",A46,\"\")","v":""},null,null,null,null,0.8,null,null,null,0.2,null,null,null,0,null,null,null,0,null,null,null,{"$f":"IFERROR(E45/100,\"\")","v":0}]
[{"$f":"IF(D48>0,\"F\",\"\")","v":""},"ISOLAMENTO TÉRMICO E ACÚSTICO",null,{"$f":"Orçamento!V856","v":0},{"$f":"Orçamento!X856","v":0},{"$f":"ROUND(F50*$D$48,2)","v":0},null,null,null,{"$f":"ROUND(J50*$D$48,2)","v":0},null,null,null,{"$f":"ROUND(N50*$D48,2)","v":0},null,null,null,{"$f":"ROUND(R50*$D48,2)","v":0},null,null,null,{"$f":"SUM(F48:U48)","v":0}]
[{"$f":"IF(A48=\"F\",A48,\"\")","v":""}]
[{"$f":"IF(A49=\"F\",A49,\"\")","v":""},null,null,null,null,0.5,null,null,null,{"$f":"1-F50","v":0.5},null,null,null,0,null,null,null,0,null,null,null,{"$f":"IFERROR(E48/100,\"\")","v":0}]
[{"$f":"IF(D51>0,\"F\",\"\")","v":""},"ESTRUTURA DE MADEIRA",null,{"$f":"Orçamento!V857","v":0},{"$f":"Orçamento!X857","v":0},{"$f":"ROUND(F53*$D$51,2)","v":0},null,null,null,{"$f":"ROUND(J53*$D$51,2)","v":0},null,null,null,{"$f":"ROUND(N53*$D51,2)","v":0},null,null,null,{"$f":"ROUND(R53*$D51,2)","v":0},null,null,null,{"$f":"SUM(F51:U51)","v":0}]
[{"$f":"IF(A51=\"F\",A51,\"\")","v":""}]
[{"$f":"IF(A52=\"F\",A52,\"\")","v":""},null,null,null,null,null,null,null,null,0.4,null,null,null,0.6,null,null,null,0,null,null,null,{"$f":"IFERROR(E51/100,\"\")","v":0}]
[{"$f":"IF(D54>0,\"F\",\"\")","v":""},"ESTRUTURA METÁLICA",null,{"$f":"Orçamento!V858","v":0},{"$f":"Orçamento!X858","v":0},{"$f":"ROUND(F56*$D$54,2)","v":0},null,null,null,{"$f":"ROUND(J56*$D$54,2)","v":0},null,null,null,{"$f":"ROUND(N56*$D54,2)","v":0},null,null,null,{"$f":"ROUND(R56*$D54,2)","v":0},null,null,null,{"$f":"SUM(F54:U54)","v":0}]
[{"$f":"IF(A54=\"F\",A54,\"\")","v":""}]
[{"$f":"IF(A55=\"F\",A55,\"\")","v":""},null,null,null,null,0.2,null,null,null,0.8,null,null,null,0,null,null,null,0,null,null,null,{"$f":"IFERROR(E54/100,\"\")","v":0}]
[{"$f":"IF(D57>0,\"F\",\"\")","v":""},"COBERTURAS",null,{"$f":"Orçamento!V859","v":0},{"$f":"Orçamento!X859","v":0},{"$f":"ROUND(F59*$D$57,2)","v":0},null,null,null,{"$f":"ROUND(J59*$D$57,2)","v":0},null,null,null,{"$f":"ROUND(N59*$D57,2)","v":0},null,null,null,{"$f":"ROUND(R59*$D57,2)","v":0},null,null,null,{"$f":"SUM(F57:U57)","v":0}]
[{"$f":"IF(A57=\"F\",A57,\"\")","v":""}]
[{"$f":"IF(A58=\"F\",A58,\"\")","v":""},null,null,null,null,0,null,null,null,null,null,null,null,1,null,null,null,0,null,null,null,{"$f":"IFERROR(E57/100,\"\")","v":0}]
[{"$f":"IF(D60>0,\"F\",\"\")","v":""},"ESQUADRIAS DE MADEIRA",null,{"$f":"Orçamento!V860","v":0},{"$f":"Orçamento!X860","v":0},{"$f":"ROUND(F62*$D$60,2)","v":0},null,null,null,{"$f":"ROUND(J62*$D$60,2)","v":0},null,null,null,{"$f":"ROUND(N62*$D60,2)","v":0},null,null,null,{"$f":"ROUND(R62*$D60,2)","v":0},null,null,null,{"$f":"SUM(F60:U60)","v":0}]
[{"$f":"IF(A60=\"F\",A60,\"\")","v":""}]
[{"$f":"IF(A61=\"F\",A61,\"\")","v":""},null,null,null,null,0.54,null,null,null,{"$f":"1-F62","v":0.45999999999999996},null,null,null,0,null,null,null,0,null,null,null,{"$f":"IFERROR(E60/100,\"\")","v":0}]
[{"$f":"IF(D63>0,\"F\",\"\")","v":""},"ESQUADRIAS METÁLICAS",null,{"$f":"Orçamento!V861","v":0},{"$f":"Orçamento!X861","v":0},{"$f":"ROUND(F65*$D$63,2)","v":0},null,null,null,{"$f":"ROUND(J65*$D$63,2)","v":0},null,null,null,{"$f":"ROUND(N65*$D63,2)","v":0},null,null,null,{"$f":"ROUND(R65*$D63,2)","v":0},null,null,null,{"$f":"SUM(F63:U63)","v":0}]
[{"$f":"IF(A63=\"F\",A63,\"\")","v":""}]
[{"$f":"IF(A64=\"F\",A64,\"\")","v":""},null,null,null,null,null,null,null,null,0.49,null,null,null,0.51,null,null,null,0,null,null,null,{"$f":"IFERROR(E63/100,\"\")","v":0}]
[{"$f":"IF(D66>0,\"F\",\"\")","v":""},"VIDROS",null,{"$f":"Orçamento!V862","v":0},{"$f":"Orçamento!X862","v":0},{"$f":"ROUND(F68*$D$66,2)","v":0},null,null,null,{"$f":"ROUND(J68*$D$66,2)","v":0},null,null,null,{"$f":"ROUND(N68*$D66,2)","v":0},null,null,null,{"$f":"ROUND(R68*$D66,2)","v":0},null,null,null,{"$f":"SUM(F66:U66)","v":0}]
[{"$f":"IF(A66=\"F\",A66,\"\")","v":""}]
[{"$f":"IF(A67=\"F\",A67,\"\")","v":""},null,null,null,null,0,null,null,null,null,null,null,null,0,null,null,null,1,null,null,null,{"$f":"IFERROR(E66/100,\"\")","v":0}]
[{"$f":"IF(D69>0,\"F\",\"\")","v":""},"REVESTIMENTO DE PAREDE",null,{"$f":"Orçamento!V863","v":0},{"$f":"Orçamento!X863","v":0},{"$f":"ROUND(F71*$D$69,2)","v":0},null,null,null,{"$f":"ROUND(J71*$D$69,2)","v":0},null,null,null,{"$f":"ROUND(N71*$D69,2)","v":0},null,null,null,{"$f":"ROUND(R71*$D69,2)","v":0},null,null,null,{"$f":"SUM(F69:U69)","v":0}]
[{"$f":"IF(A69=\"F\",A69,\"\")","v":""}]
[{"$f":"IF(A70=\"F\",A70,\"\")","v":""},null,null,null,null,null,null,null,null,0.32,null,null,null,0.68,null,null,null,0,null,null,null,{"$f":"IFERROR(E69/100,\"\")","v":0}]
[{"$f":"IF(D72>0,\"F\",\"\")","v":""},"FORROS",null,{"$f":"Orçamento!V864","v":0},{"$f":"Orçamento!X864","v":0},{"$f":"ROUND(F74*$D$72,2)","v":0},null,null,null,{"$f":"ROUND(J74*$D$72,2)","v":0},null,null,null,{"$f":"ROUND(N74*$D72,2)","v":0},null,null,null,{"$f":"ROUND(R74*$D72,2)","v":0},null,null,null,{"$f":"SUM(F72:U72)","v":0}]
[{"$f":"IF(A72=\"F\",A72,\"\")","v":""}]
[{"$f":"IF(A73=\"F\",A73,\"\")","v":""},null,null,null,null,null,null,null,null,0.25,null,null,null,0.75,null,null,null,0,null,null,null,{"$f":"IFERROR(E72/100,\"\")","v":0}]
[{"$f":"IF(D75>0,\"F\",\"\")","v":""},"REVESTIMENTO DE PISO",null,{"$f":"Orçamento!V865","v":0},{"$f":"Orçamento!X865","v":0},{"$f":"ROUND(F77*$D$75,2)","v":0},null,null,null,{"$f":"ROUND(J77*$D$75,2)","v":0},null,null,null,{"$f":"ROUND(N77*$D75,2)","v":0},null,null,null,{"$f":"ROUND(R77*$D75,2)","v":0},null,null,null,{"$f":"SUM(F75:U75)","v":0}]
[{"$f":"IF(A75=\"F\",A75,\"\")","v":""}]
[{"$f":"IF(A76=\"F\",A76,\"\")","v":""},null,null,null,null,0.33,null,null,null,0.33,null,null,null,0.34,null,null,null,0,null,null,null,{"$f":"IFERROR(E75/100,\"\")","v":0}]
[{"$f":"IF(D78>0,\"F\",\"\")","v":""},"FERRAGENS",null,{"$f":"Orçamento!V866","v":0},{"$f":"Orçamento!X866","v":0},{"$f":"ROUND(F80*$D$78,2)","v":0},null,null,null,{"$f":"ROUND(J80*$D$78,2)","v":0},null,null,null,{"$f":"ROUND(N80*$D78,2)","v":0},null,null,null,{"$f":"ROUND(R80*$D78,2)","v":0},null,null,null,{"$f":"SUM(F78:U78)","v":0}]
[{"$f":"IF(A78=\"F\",A78,\"\")","v":""}]
[{"$f":"IF(A79=\"F\",A79,\"\")","v":""},null,null,null,null,0,null,null,null,null,null,null,null,0,null,null,null,1,null,null,null,{"$f":"IFERROR(E78/100,\"\")","v":0}]
[{"$f":"IF(D81>0,\"F\",\"\")","v":""},"MARCENARIA",null,{"$f":"Orçamento!V867","v":0},{"$f":"Orçamento!X867","v":0},{"$f":"ROUND(F83*$D$81,2)","v":0},null,null,null,{"$f":"ROUND(J83*$D$81,2)","v":0},null,null,null,{"$f":"ROUND(N83*$D81,2)","v":0},null,null,null,{"$f":"ROUND(R83*$D81,2)","v":0},null,null,null,{"$f":"SUM(F81:U81)","v":0}]
[{"$f":"IF(A81=\"F\",A81,\"\")","v":""}]
[{"$f":"IF(A82=\"F\",A82,\"\")","v":""},null,null,null,null,null,null,null,null,null,null,null,null,0.4,null,null,null,0.6,null,null,null,{"$f":"IFERROR(E81/100,\"\")","v":0}]
[{"$f":"IF(D84>0,\"F\",\"\")","v":""},"ADMINISTRAÇÃO - MENSALISTAS",null,{"$f":"Orçamento!V868","v":0},{"$f":"Orçamento!X868","v":0},{"$f":"ROUND(F86*$D$84,2)","v":0},null,null,null,{"$f":"ROUND(J86*$D$84,2)","v":0},null,null,null,{"$f":"ROUND(N86*$D84,2)","v":0},null,null,null,{"$f":"ROUND(R86*$D84,2)","v":0},null,null,null,{"$f":"SUM(F84:U84)","v":0}]
[{"$f":"IF(A84=\"F\",A84,\"\")","v":""}]
[{"$f":"IF(A85=\"F\",A85,\"\")","v":""},null,null,null,null,0.26,null,null,null,0.26,null,null,null,0.24,null,null,null,0.24,null,null,null,{"$f":"IFERROR(E84/100,\"\")","v":0}]
[{"$f":"IF(D87>0,\"F\",\"\")","v":""},"PINTURA",null,{"$f":"Orçamento!V869","v":0},{"$f":"Orçamento!X869","v":0},{"$f":"ROUND(F89*$D$87,2)","v":0},null,null,null,{"$f":"ROUND(J89*$D$87,2)","v":0},null,null,null,{"$f":"ROUND(N89*$D87,2)","v":0},null,null,null,{"$f":"ROUND(R89*$D87,2)","v":0},null,null,null,{"$f":"SUM(F87:U87)","v":0}]
[{"$f":"IF(A87=\"F\",A87,\"\")","v":""}]
[{"$f":"IF(A88=\"F\",A88,\"\")","v":""},null,null,null,null,0,null,null,null,0.3,null,null,null,0.5,null,null,null,0.2,null,null,null,{"$f":"IFERROR(E87/100,\"\")","v":0}]
[{"$f":"IF(D90>0,\"F\",\"\")","v":""},"DIVERSOS",null,{"$f":"Orçamento!V870","v":0},{"$f":"Orçamento!X870","v":0},{"$f":"ROUND(F92*$D$90,2)","v":0},null,null,null,{"$f":"ROUND(J92*$D$90,2)","v":0},null,null,null,{"$f":"ROUND(N92*$D90,2)","v":0},null,null,null,{"$f":"ROUND(R92*$D90,2)","v":0},null,null,null,{"$f":"SUM(F90:U90)","v":0}]
[{"$f":"IF(A90=\"F\",A90,\"\")","v":""}]
[{"$f":"IF(A91=\"F\",A91,\"\")","v":""},null,null,null,null,0.25,null,null,null,0.25,null,null,null,0.24,null,null,null,0.26,null,null,null,{"$f":"IFERROR(E90/100,\"\")","v":0}]
["F","CUSTO DO ORÇAMENTO",null,{"$f":"SUM(D15:D92)","v":0},{"$f":"SUM(E15:E92)","v":0},{"$f":"F15+F18+F21+F24+F27+F30+F33+F36+F39+F42+F45+F48+F51+F54+F57+F60+F63+F66+F69+F72+F75+F78+F81+F84+F87+F90","v":0},null,null,null,{"$f":"J15+J18+J21+J24+J27+J30+J33+J36+J39+J42+J45+J48+J51+J54+J57+J60+J63+J66+J69+J72+J75+J78+J81+J84+J87+J90","v":0},null,null,null,{"$f":"N15+N18+N21+N24+N27+N30+N33+N36+N39+N42+N45+N48+N51+N54+N57+N60+N63+N66+N69+N72+N75+N78+N81+N84+N87+N90","v":0},null,null,null,{"$f":"R15+R18+R21+R24+R27+R30+R33+R36+R39+R42+R45+R48+R51+R54+R57+R60+R63+R66+R69+R72+R75+R78+R81+R84+R87+R90","v":0},null,null,null,{"$f":"V15+V18+V21+V24+V27+V30+V33+V36+V39+V42+V45+V48+V51+V54+V57+V60+V63+V66+V69+V72+V75+V78+V81+V84+V87+V90","v":0}]
["F","PERCENTUAIS:",null,null,null,{"$f":"IFERROR(F93/D93,\"\")","v":""},null,null,null,{"$f":"IFERROR(J93/D93,\"\")","v":""},null,null,null,{"$f":"IFERROR(N93/D93,\"\")","v":""},null,null,null,{"$f":"IFERROR(R93/D93,\"\")","v":""},null,null,null,{"$f":"SUM(F94:U94)","v":0}]
["F","TOTAIS ACUMULADOS:",null,null,null,{"$f":"F93","v":0},null,null,null,{"$f":"F95+J93","v":0},null,null,null,{"$f":"J95+N93","v":0},null,null,null,{"$f":"N95+R93","v":0}]
["F","PERCENTUAIS  ACUMULADOS:",null,null,null,{"$f":"F94","v":""},null,null,null,{"$f":"IFERROR(F96+J94,\"\")","v":""},null,null,null,{"$f":"IFERROR(J96+N94,\"\")","v":""},null,null,null,{"$f":"IFERROR(N96+R94,\"\")","v":""}]
["F"]
["F","OBSERVAÇÕES:"]
["F","Os pagamentos somente poderão ser efetuados mediante medição e atesto pelos técnicos da Secretaria da Educação. "]

{"sheet":"Composição BDI","index":4,"n_rows":45,"n_cols":9,"rows_kept":45,"cut":false,"hidden":false,"merged":[[11,0,11,3],[12,0,12,3],[14,0,14,3],[15,0,15,3],[13,0,13,3],[0,0,0,3],[1,0,1,3],[4,0,4,3],[7,0,7,3],[10,0,10,3],[2,0,2,3],[3,0,3,3],[5,0,5,3],[6,0,6,3],[8,0,8,3],[9,0,9,3],[18,5,18,8],[17,0,17,3],[16,0,16,3],[44,0,44,3],[42,0,42,3],[43,0,43,3],[18,0,18,3],[36,0,36,3],[39,0,39,3],[38,0,38,3],[40,0,40,3],[29,0,29,2],[32,0,32,3],[33,0,33,3],[34,0,34,3],[35,0,35,3]]}
[]
[]
["UNIDADE ESCOLAR"]
[{"$f":"Orçamento!$O$4","v":"CENTRO DE ENSINO EM PERÍODO INTEGRAL PADRE TRINDADE"}]
[]
["OBRA"]
[{"$f":"Orçamento!$O$7","v":"REFORMA E AMPLIAÇÃO"}]
[]
["ENDEREÇO"]
[{"$f":"Orçamento!$R$10","v":"RUA SILVA PINTO S/N, JUNDIAI, CEP:75110-640"}]
[]
["CIDADE"]
[{"$f":"Orçamento!$V$7","v":"ANÁPOLIS"}]
[]
["CRE"]
[{"$f":"Orçamento!$O$10","v":"ANÁPOLIS"}]
[]
["DETALHAMENTO DA COMPOSIÇÃO DE BDI"]
["COMPOSIÇÃO BDI PARA OBRAS CIVIS",null,null,null,null,"BDI CONSTRUÇÃO E REFORMA"]
["DESCRIÇÃO","COEF.","TAXA % (a.m)","% no preço de venda",null,"Situação","1º Quartil","Médio","3º Quartil"]
["1) COFINS",1,0.03,{"$f":"C21","v":0.03},null,{"$f":"IF(OR(C21<G21,C21>I21),\"FORA DO INTERVALO\",\"OK\")","v":"OK"},0.03,0.03,0.03]
["2) PIS",1,6.4999999999999997E-3,{"$f":"C22","v":6.4999999999999997E-3},null,{"$f":"IF(OR(C22<G22,C22>I22),\"FORA DO INTERVALO\",\"OK\")","v":"OK"},6.4999999999999997E-3,6.4999999999999997E-3,6.4999999999999997E-3]
["3) ISSQN",1,0.03,{"$f":"C23*B23","v":0.03},null,"OK",0.02,3.5000000000000003E-2,0.05]
["4) CPRB",1,0,{"$f":"C24","v":0},null,"FORA DO INTERVALO",4.4999999999999998E-2,4.4999999999999998E-2,4.4999999999999998E-2]
["5) Administração Central",1,0.04,0.04,null,"OK",0.03,0.04,5.5E-2]
["6) Despesas Financeiras",1,5.5999999999999999E-3,5.5999999999999999E-3,null,"FORA DO INTERVALO",5.8999999999999999E-3,1.23E-2,1.3899999999999999E-2]
["7) Seguros + Garantias",1,1.1999999999999999E-3,1.1999999999999999E-3,null,"FORA DO INTERVALO",8.0000000000000002E-3,8.0000000000000002E-3,0.01]
["8) Risco",1,9.7000000000000003E-3,9.7000000000000003E-3,null,"OK",9.7000000000000003E-3,1.2699999999999999E-2,1.2699999999999999E-2]
["9) Lucro",1,7.1999999999999995E-2,7.1999999999999995E-2,null,"OK",6.1600000000000002E-2,7.3999999999999996E-2,8.9599999999999999E-2]
["BDI - FINAL",null,null,{"$f":"(((1+D25+D27+D28)*(1+D26)*(1+D29))/(1-(D21+D22+D23+D24))-1)","v":0.21357639301553344},null,"FORA DO INTERVALO",0.2034,0.22120000000000001,0.25]
[]
["Notas:"]
["(1) e (2) Alíquota definida por lei."]
["(3) Alíquota e base de cálculo definidas pela legislação municipal."]
["(4) Alíquota definida pelas leis 12.546/11, 12844/13 e 13.161/15 (CPRB – contribuição previdenciária sobre a receita bruta)."]
["(5) Valores definidos a partir dos limites no Acórdão nº 2.622/2013 - TCU – Plenário. Valores entre o 1º e 3º quartis."]
["(6) Valor calculado pela expressão matemática do acórdão 2.369/2011 – TCU – Plenário e disponibilizado pela AGETOP em dezembro de 2018. (Foi utilizado para o cálculo a média da Taxa SELIC no período de 11/2017 a 10/2018)"]
[]
["(7) Valores definidos pela AGETOP a partir dos limites no Acórdão nº 2.622/2013 - TCU – Plenário. Valores médios. \n\nObservação da AGETOP: (Seguros contra erros de execução, incêndio e explosão, danos da natureza (vendaval, destelhamento, alagamento, inundação, desmoronamento, geadas etc.), emprego de material defeituoso ou inadequado, roubo e/ou furto qualificado, quebra de equipamentos, desmoronamento de estrutura, nas modalidades de Obras Civis em Construção (OCC); Instalação e Montagem (IM); e Obras Civis em Construção e Instalação e Montagem (OCC/IM). Bem como coberturas adicionais para ampliação dessas coberturas básicas, como: cobertura de responsabilidade civil geral, cobertura de responsabilidade civil cruzada, cobertura de despesas extraordinárias, cobertura de tumultos, cobertura de desentulho do local, cobertura de riscos do fabricante, dentre outras, incluindo o seguro de vida em grupo regido pela convenção coletiva dos trabalhadores na indústria da construção civil). A partir de 24/02/2015 por intermédio da Portaria 449/2015 a Presidência da AGETOP, na pessoa do Senhor Jayme Eduardo Rincon, determinou a exclusão dos valores referentes aos Seguros de Risco de Engenharia e Responsabilidade Civil do Profissional na composição do cálculo do B.D.I.."]
["(8) Valores definidos a partir dos limites no Acórdão nº 2.622/2013 - TCU – Plenário. Valores entre 1º e 3° quartis."]
["(9) Valores definidos a partir dos limites definidos no Acórdão nº 2.622/2013 - TCU – Plenário. Valores adotados e praticados no mercado ( “ ex ante ” ) ou aqueles entre os 1º e 3º quartis."]
[]
["(*) A fórmula para estipulação da taxa de BDI estimado adotado é a mesma que foi aplicada para a obtenção das tabelas contidas no Acórdão n. 2.622/2013 – TCUPlenário"]
[]
["Obs.: Para obras com valores superiores a R$ 20.000.000,00 sugere-se recalcular o BDI, dimensionando as taxas de administração central e lucro para patamares inferiores ao estipulado acima."]

{"sheet":"Relatório CENTRAL","index":5,"n_rows":40,"n_cols":5,"rows_kept":40,"cut":false,"hidden":false,"merged":[[8,1,8,2],[8,3,8,4],[9,1,9,2],[10,1,10,4],[11,1,11,4],[39,1,39,2],[9,0,11,0],[0,1,0,4],[6,3,6,4],[9,3,9,4],[1,1,1,4],[2,1,2,2],[2,3,2,4],[3,1,3,2],[3,3,3,4],[4,1,4,4],[5,1,5,2],[5,3,5,4],[6,1,6,2],[7,1,7,4]]}
[]
[]
[null,"UNIDADE ESCOLAR",null,"CIDADE"]
[null,{"$f":"Orçamento!$O$4","v":"CENTRO DE ENSINO EM PERÍODO INTEGRAL PADRE TRINDADE"},null,{"$f":"Orçamento!$V$7","v":"ANÁPOLIS"}]
[]
[null,"OBRA",null,"CRE"]
[null,{"$f":"Orçamento!$O$7","v":"REFORMA E AMPLIAÇÃO"},null,{"$f":"Orçamento!$O$10","v":"ANÁPOLIS"}]
[]
[null,"ENDEREÇO",null,"DATA"]
["FILTRO",{"$f":"Orçamento!$R$10","v":"RUA SILVA PINTO S/N, JUNDIAI, CEP:75110-640"},null,{"$f":"Orçamento!$S$7","v":"2020-04-08"}]
[]
[null,"RELATÓRIO CENTRAL"]
["↓","CÓDIGO","ETAPA","PREÇO  (R$) C/ BDI","PARTIC  ( % )"]
[{"$f":"IF(D14>0,\"F\",\"\")","v":""},{"$f":"Orçamento!O845","v":"a."},{"$f":"Orçamento!P845","v":"SERVIÇOS PRELIMINARES"},{"$f":"Orçamento!V845","v":0},{"$f":"Orçamento!X845","v":0}]
[{"$f":"IF(D15>0,\"F\",\"\")","v":""},{"$f":"Orçamento!O846","v":"b."},{"$f":"Orçamento!P846","v":"TRANSPORTES"},{"$f":"Orçamento!V846","v":0},{"$f":"Orçamento!X846","v":0}]
["",{"$f":"Orçamento!O847","v":"c."},{"$f":"Orçamento!P847","v":"SERVIÇO EM TERRA"},{"$f":"Orçamento!V847","v":0},{"$f":"Orçamento!X847","v":0}]
["",{"$f":"Orçamento!O848","v":"d."},{"$f":"Orçamento!P848","v":"FUNDAÇÕES E SONDAGENS"},{"$f":"Orçamento!V848","v":0},{"$f":"Orçamento!X848","v":0}]
["",{"$f":"Orçamento!O849","v":"e."},{"$f":"Orçamento!P849","v":"ESTRUTURA"},{"$f":"Orçamento!V849","v":0},{"$f":"Orçamento!X849","v":0}]
["",{"$f":"Orçamento!O850","v":"f."},{"$f":"Orçamento!P850","v":"INSTALAÇÕES ELÉTRICAS"},{"$f":"Orçamento!V850","v":0},{"$f":"Orçamento!X850","v":0}]
["",{"$f":"Orçamento!O851","v":"g."},{"$f":"Orçamento!P851","v":"INSTALAÇÕES HIDROSSANITÁRIAS"},{"$f":"Orçamento!V851","v":0},{"$f":"Orçamento!X851","v":0}]
["",{"$f":"Orçamento!O852","v":"h"},{"$f":"Orçamento!P852","v":"INSTALAÇÕES ESPECIAIS"},{"$f":"Orçamento!V852","v":0},{"$f":"Orçamento!X852","v":0}]
["",{"$f":"Orçamento!O853","v":"i."},{"$f":"Orçamento!P853","v":"ALVENARIAS E DIVISÓRIAS"},{"$f":"Orçamento!V853","v":0},{"$f":"Orçamento!X853","v":0}]
["",{"$f":"Orçamento!O854","v":"j."},{"$f":"Orçamento!P854","v":"ALVENARIA AUTO-PORTANTE"},{"$f":"Orçamento!V854","v":0},{"$f":"Orçamento!X854","v":0}]
["",{"$f":"Orçamento!O855","v":"k."},{"$f":"Orçamento!P855","v":"IMPERMEABILIZAÇÃO"},{"$f":"Orçamento!V855","v":0},{"$f":"Orçamento!X855","v":0}]
["",{"$f":"Orçamento!O856","v":"l."},{"$f":"Orçamento!P856","v":"ISOLAMENTO TÉRMICO E ACÚSTICO"},{"$f":"Orçamento!V856","v":0},{"$f":"Orçamento!X856","v":0}]
["",{"$f":"Orçamento!O857","v":"m."},{"$f":"Orçamento!P857","v":"ESTRUTURA DE MADEIRA"},{"$f":"Orçamento!V857","v":0},{"$f":"Orçamento!X857","v":0}]
["",{"$f":"Orçamento!O858","v":"n."},{"$f":"Orçamento!P858","v":"ESTRUTURAS METÁLICAS"},{"$f":"Orçamento!V858","v":0},{"$f":"Orçamento!X858","v":0}]
["",{"$f":"Orçamento!O859","v":"o."},{"$f":"Orçamento!P859","v":"COBERTURAS"},{"$f":"Orçamento!V859","v":0},{"$f":"Orçamento!X859","v":0}]
["",{"$f":"Orçamento!O860","v":"p."},{"$f":"Orçamento!P860","v":"ESQUADRIAS DE MADEIRA"},{"$f":"Orçamento!V860","v":0},{"$f":"Orçamento!X860","v":0}]
["",{"$f":"Orçamento!O861","v":"q."},{"$f":"Orçamento!P861","v":"ESQUADRIAS METÁLICAS"},{"$f":"Orçamento!V861","v":0},{"$f":"Orçamento!X861","v":0}]
["",{"$f":"Orçamento!O862","v":"r."},{"$f":"Orçamento!P862","v":"VIDROS"},{"$f":"Orçamento!V862","v":0},{"$f":"Orçamento!X862","v":0}]
["",{"$f":"Orçamento!O863","v":"s."},{"$f":"Orçamento!P863","v":"REVESTIMENTO DE PAREDE"},{"$f":"Orçamento!V863","v":0},{"$f":"Orçamento!X863","v":0}]
["",{"$f":"Orçamento!O864","v":"t."},{"$f":"Orçamento!P864","v":"FORROS"},{"$f":"Orçamento!V864","v":0},{"$f":"Orçamento!X864","v":0}]
["",{"$f":"Orçamento!O865","v":"u."},{"$f":"Orçamento!P865","v":"REVESTIMENTO DE PISO"},{"$f":"Orçamento!V865","v":0},{"$f":"Orçamento!X865","v":0}]
["",{"$f":"Orçamento!O866","v":"v."},{"$f":"Orçamento!P866","v":"FERRAGENS"},{"$f":"Orçamento!V866","v":0},{"$f":"Orçamento!X866","v":0}]
["",{"$f":"Orçamento!O867","v":"w."},{"$f":"Orçamento!P867","v":"MARCENARIA"},{"$f":"Orçamento!V867","v":0},{"$f":"Orçamento!X867","v":0}]
["",{"$f":"Orçamento!O868","v":"x."},{"$f":"Orçamento!P868","v":"ADMINISTRAÇÃO"},{"$f":"Orçamento!V868","v":0},{"$f":"Orçamento!X868","v":0}]
["",{"$f":"Orçamento!O869","v":"y."},{"$f":"Orçamento!P869","v":"PINTURA"},{"$f":"Orçamento!V869","v":0},{"$f":"Orçamento!X869","v":0}]
["",{"$f":"Orçamento!O870","v":"z."},{"$f":"Orçamento!P870","v":"DIVERSOS"},{"$f":"Orçamento!V870","v":0},{"$f":"Orçamento!X870","v":0}]
["F","TOTAL GERAL DO ORÇAMENTO (R$) C/BDI",null,{"$f":"SUM(D14:D39)","v":0},{"$f":"SUM(E14:E39)","v":0}]

{"sheet":"Parc Maior Relev","index":6,"n_rows":21,"n_cols":7,"rows_kept":21,"cut":false,"hidden":false,"merged":[[0,1,0,6],[11,1,11,6],[1,1,1,6],[2,1,2,3],[2,4,2,6],[3,1,3,3],[3,4,3,6],[4,1,4,6],[5,1,5,3],[5,4,5,6],[9,1,9,3],[9,4,9,6],[10,1,10,6],[6,1,6,3],[6,4,6,6],[7,1,7,6],[10,0,12,0],[8,1,8,3],[8,4,8,6],[21,3,21,7],[19,1,19,6]]}
[]
[]
[null,"UNIDADE ESCOLAR",null,null,"CÓDIGO INEP"]
[null,{"$f":"Orçamento!$O$4","v":"CENTRO DE ENSINO EM PERÍODO INTEGRAL PADRE TRINDADE"},null,null,{"$f":"Orçamento!$V$4","v":52020452}]
[]
[null,"OBRA",null,null,"CIDADE"]
[null,{"$f":"Orçamento!$O$7","v":"REFORMA E AMPLIAÇÃO"},null,null,{"$f":"Orçamento!$V$7","v":"ANÁPOLIS"}]
[]
[null,"CRE",null,null,"ÁREA TOTAL CONSTRUÍDA (M²)"]
[null,{"$f":"Orçamento!$O$10","v":"ANÁPOLIS"},null,null,{"$f":"Orçamento!$S$13","v":1889.2599999999998}]
["FILTRO"]
[null,"PARCELA DE MAIOR RELEVÂNCIA"]
[null,"CÓDIGO","SERVIÇO","DESCRIÇÃO","UNID","QUANT","PARC. MAIOR RELEV (50%)"]
[{"$f":"IF(F14>0,\"F\",\"\")","v":"F"},"U.",{"$f":"IFERROR(VLOOKUP(B14,Orçamento!$O$845:$P$870,2,FALSE),\"(inserir código ao lado)\")","v":"REVESTIMENTO DE PISO"},"PISO DE CONCRETO DESEMPENADO","M²",575.70000000000005,{"$f":"F14*0.5","v":287.85000000000002}]
[{"$f":"IF(F15>0,\"F\",\"\")","v":"F"},"O.",{"$f":"IFERROR(VLOOKUP(B15,Orçamento!$O$845:$P$870,2,FALSE),\"(inserir código ao lado)\")","v":"COBERTURAS"},"TELHA CERÂMICA","M²",345.07,172.535]
[{"$f":"IF(F16>0,\"F\",\"\")","v":""},null,{"$f":"IFERROR(VLOOKUP(B16,Orçamento!$O$845:$P$870,2,FALSE),\"(inserir código ao lado)\")","v":"(inserir código ao lado)"},null,{"$f":"IFERROR(VLOOKUP($D16,Orçamento!$R$20:$W$826,2,FALSE),\"-\")","v":"-"},{"$f":"SUMIF(Orçamento!$R$20:$R$826,'Parc Maior Relev'!D16,Orçamento!$T$20:$T$826)","v":0},{"$f":"F16*0.5","v":0}]
["",null,{"$f":"IFERROR(VLOOKUP(B17,Orçamento!$O$845:$P$870,2,FALSE),\"(inserir código ao lado)\")","v":"(inserir código ao lado)"},null,{"$f":"IFERROR(VLOOKUP($D17,Orçamento!$R$20:$W$826,2,FALSE),\"-\")","v":"-"},{"$f":"SUMIF(Orçamento!$R$20:$R$826,'Parc Maior Relev'!D17,Orçamento!$T$20:$T$826)","v":0},0]
["",null,{"$f":"IFERROR(VLOOKUP(B18,Orçamento!$O$845:$P$870,2,FALSE),\"(inserir código ao lado)\")","v":"(inserir código ao lado)"},null,{"$f":"IFERROR(VLOOKUP($D18,Orçamento!$R$20:$W$826,2,FALSE),\"-\")","v":"-"},{"$f":"SUMIF(Orçamento!$R$20:$R$826,'Parc Maior Relev'!D18,Orçamento!$T$20:$T$826)","v":0},0]
["F"]
["F","(*) Para os fins do inciso I dp § 1º do Art. 30 da Lei Federal 8.666/93, são consideradas parcelas de maior relevância técnica as execuções apresentadas"]
["F"]

{"sheet":"Composições","index":7,"n_rows":335,"n_cols":10,"rows_kept":335,"cut":false,"hidden":false,"merged":[[15,0,15,9],[13,0,13,2],[13,3,13,6],[1,0,1,9],[3,7,3,9],[4,7,4,9],[6,7,6,9],[7,7,7,9],[6,0,6,6],[10,8,10,9],[13,8,13,9],[14,0,14,9],[8,0,8,9],[5,0,5,9],[2,0,2,9],[0,0,0,8],[10,0,10,2],[10,3,10,6],[11,0,11,9],[12,0,12,2],[12,3,12,6],[12,7,12,8],[7,0,7,6],[9,0,9,2],[9,3,9,6],[9,7,9,8],[3,0,3,6],[4,0,4,6],[16,5,17,5],[16,6,16,7],[16,8,16,9],[22,1,22,7],[26,1,26,7],[16,0,17,0],[16,1,17,1],[16,2,17,2],[16,3,17,3],[16,4,17,4],[28,5,29,5],[28,6,28,7],[28,8,28,9],[34,1,34,7],[38,1,38,7],[28,0,29,0],[28,1,29,1],[28,2,29,2],[28,3,29,3],[28,4,29,4],[40,5,41,5],[40,6,40,7],[40,8,40,9],[46,1,46,7],[50,1,50,7],[40,0,41,0],[40,1,41,1],[40,2,41,2],[40,3,41,3],[40,4,41,4],[52,5,53,5],[52,6,52,7],[52,8,52,9],[58,1,58,7],[62,1,62,7],[52,0,53,0],[52,1,53,1],[52,2,53,2],[52,3,53,3],[52,4,53,4],[64,5,65,5],[64,6,64,7],[64,8,64,9],[69,1,69,7],[71,1,71,7],[64,0,65,0],[64,1,65,1],[64,2,65,2],[64,3,65,3],[64,4,65,4],[73,5,74,5],[73,6,73,7],[73,8,73,9],[79,1,79,7],[86,1,86,7],[73,0,74,0],[73,1,74,1],[73,2,74,2],[73,3,74,3],[73,4,74,4],[88,5,89,5],[88,6,88,7],[88,8,88,9],[94,1,94,7],[98,1,98,7],[88,0,89,0],[88,1,89,1],[88,2,89,2],[88,3,89,3],[88,4,89,4],[100,5,101,5],[100,6,100,7],[100,8,100,9],[106,1,106,7],[110,1,110,7],[100,0,101,0],[100,1,101,1],[100,2,101,2],[100,3,101,3],[100,4,101,4],[112,5,113,5],[112,6,112,7],[112,8,112,9],[118,1,118,7],[122,1,122,7],[112,0,113,0],[112,1,113,1],[112,2,113,2],[112,3,113,3],[112,4,113,4],[124,5,125,5],[124,6,124,7],[124,8,124,9],[130,1,130,7],[134,1,134,7],[124,0,125,0],[124,1,125,1],[124,2,125,2],[124,3,125,3],[124,4,125,4],[136,5,137,5],[136,6,136,7],[136,8,136,9],[142,1,142,7],[146,1,146,7],[136,0,137,0],[136,1,137,1],[136,2,137,2],[136,3,137,3],[136,4,137,4],[148,5,149,5],[148,6,148,7],[148,8,148,9],[154,1,154,7],[158,1,158,7],[148,0,149,0],[148,1,149,1],[148,2,149,2],[148,3,149,3],[148,4,149,4],[160,5,161,5],[160,6,160,7],[160,8,160,9],[166,1,166,7],[170,1,170,7],[160,0,161,0],[160,1,161,1],[160,2,161,2],[160,3,161,3],[160,4,161,4],[172,5,173,5],[172,6,172,7],[172,8,172,9],[178,1,178,7],[182,1,182,7],[172,0,173,0],[172,1,173,1],[172,2,173,2],[172,3,173,3],[172,4,173,4],[184,5,185,5],[184,6,184,7],[184,8,184,9],[190,1,190,7],[194,1,194,7],[184,0,185,0],[184,1,185,1],[184,2,185,2],[184,3,185,3],[184,4,185,4],[196,5,197,5],[196,6,196,7],[196,8,196,9],[202,1,202,7],[206,1,206,7],[196,0,197,0],[196,1,197,1],[196,2,197,2],[196,3,197,3],[196,4,197,4],[208,5,209,5],[208,6,208,7],[208,8,208,9],[214,1,214,7],[218,1,218,7],[208,0,209,0],[208,1,209,1],[208,2,209,2],[208,3,209,3],[208,4,209,4],[220,5,221,5],[220,6,220,7],[220,8,220,9],[226,1,226,7],[230,1,230,7],[220,0,221,0],[220,1,221,1],[220,2,221,2],[220,3,221,3],[220,4,221,4],[232,5,233,5],[232,6,232,7],[232,8,232,9],[238,1,238,7],[242,1,242,7],[232,0,233,0],[232,1,233,1],[232,2,233,2],[232,3,233,3],[232,4,233,4],[244,5,245,5],[244,6,244,7],[244,8,244,9],[250,1,250,7],[254,1,254,7],[244,0,245,0],[244,1,245,1],[244,2,245,2],[244,3,245,3],[244,4,245,4],[256,5,257,5],[256,6,256,7],[256,8,256,9],[262,1,262,7],[266,1,266,7],[256,0,257,0],[256,1,257,1],[256,2,257,2],[256,3,257,3],[256,4,257,4],[268,5,269,5],[268,6,268,7],[268,8,268,9],[274,1,274,7],[278,1,278,7],[268,0,269,0],[268,1,269,1],[268,2,269,2],[268,3,269,3],[268,4,269,4],[280,5,281,5],[280,6,280,7],[280,8,280,9],[285,1,285,7],[298,1,298,7],[280,0,281,0],[280,1,281,1],[280,2,281,2],[280,3,281,3],[280,4,281,4],[300,5,301,5],[300,6,300,7],[300,8,300,9],[306,1,306,7],[310,1,310,7],[300,0,301,0],[300,1,301,1],[300,2,301,2],[300,3,301,3],[300,4,301,4],[312,5,313,5],[312,6,312,7],[312,8,312,9],[317,1,317,7],[320,1,320,7],[312,0,313,0],[312,1,313,1],[312,2,313,2],[312,3,313,3],[312,4,313,4],[322,5,323,5],[322,6,322,7],[322,8,322,9],[328,1,328,7],[334,1,334,7],[322,0,323,0],[322,1,323,1],[322,2,323,2],[322,3,323,3],[322,4,323,4]]}
[]
[]
[]
["UNIDADE ESCOLAR",null,null,null,null,null,null,"CÓDIGO INEP"]
[{"$f":"Orçamento!$O$4","v":"CENTRO DE ENSINO EM PERÍODO INTEGRAL PADRE TRINDADE"},null,null,null,null,null,null,{"$f":"Orçamento!$V$4","v":52020452}]
[]
["OBRA",null,null,null,null,null,null,"CIDADE"]
[{"$f":"Orçamento!$O$7","v":"REFORMA E AMPLIAÇÃO"},null,null,null,null,null,null,{"$f":"Orçamento!$V$7","v":"ANÁPOLIS"}]
[]
["CRE",null,null,"ENDEREÇO",null,null,null,"REFERÊNCIA AGETOP"]
[{"$f":"Orçamento!$O$10","v":"ANÁPOLIS"},null,null,{"$f":"Orçamento!$R$10","v":"RUA SILVA PINTO S/N, JUNDIAI, CEP:75110-640"},null,null,null,{"$f":"Orçamento!$V$10","v":"DEZ/18"},{"$f":"Orçamento!$W$10","v":"ONERADA"}]
[]
["DATA",null,null,"ÁREA TOTAL CONSTRUÍDA (M²)",null,null,null,"REFERÊNCIA SINAPI"]
[{"$f":"Orçamento!$S$7","v":"2020-04-08"},null,null,{"$f":"Orçamento!$S$13","v":1889.2599999999998},null,null,null,{"$f":"Orçamento!$V$13","v":"MAR/19"},{"$f":"Orçamento!$W$13","v":"ONERADA"}]
[]
["COMPOSIÇÕES DE CUSTOS UNITÁRIOS - SEE-GO"]
[46,"FONTE","CÓDIGO","DESCRIÇÃO","UNIDADE","COEFIC.","CUSTO UNITÁRIO",null,"CUSTO  TOTAL (A) + (B) + (C) + (D) + (E)"]
[null,null,null,null,null,null,"DESONERADO","NÃO DESONER.","DESONERADO","NÃO DESONER."]
[null,"COMPOSIÇÃO","COMP 046_SEE","CAPUZ PARA PROTEÇÃO DOS PARA RAIOS","UN ",null,null,null,16.53,16.650000000000002]
[null,"AGETOP_I",8,"AJUDANTE","h     ",3.3300000000000003E-2,8.1999999999999993,9.51,0.27,0.32]
[null,"AGETOP_I",12,"ELETRICISTA","h     ",3.3300000000000003E-2,13.4,15.53,0.45,0.52]
[null,null,null,"","",null,0,0,0,0]
[null,"MÃO DE OBRA (B) - TOTAL",null,null,null,null,null,null,0.72,0.84000000000000008]
[null,"COTAÇÃO","COT 010_SEE","CAPUZ PARA PROTEÇÃO DOS PARA RAIOS","UN ",1,15.81,15.81,15.81,15.81]
[null,null,null,"","",null,0,0,0,0]
[null,null,null,"","",null,0,0,0,0]
[null,"MATERIAL (C) - TOTAL",null,null,null,null,null,null,15.81,15.81]
[]
[47,"FONTE","CÓDIGO","DESCRIÇÃO","UNIDADE","COEFIC.","CUSTO UNITÁRIO",null,"CUSTO  TOTAL (A) + (B) + (C) + (D) + (E)"]
[null,null,null,null,null,null,"DESONERADO","NÃO DESONER.","DESONERADO","NÃO DESONER."]
[null,"COMPOSIÇÃO","COMP 047_SEE","CAPUZ DE PROTEÇÃO PARA BUCHA DE TRANSFORMADOR","UN ",null,null,null,16.53,16.650000000000002]
[null,"AGETOP_I",8,"AJUDANTE","h     ",3.3300000000000003E-2,8.1999999999999993,9.51,0.27,0.32]
[null,"AGETOP_I",12,"ELETRICISTA","h     ",3.3300000000000003E-2,13.4,15.53,0.45,0.52]
[null,null,null,"","",null,0,0,0,0]
[null,"MÃO DE OBRA (B) - TOTAL",null,null,null,null,null,null,0.72,0.84000000000000008]
[null,"COTAÇÃO","COT 011_SEE","CAPUZ DE PROTEÇÃO PARA BUCHA DE TRANSFORMADOR","UN ",1,15.81,15.81,15.81,15.81]
[null,null,null,"","",null,0,0,0,0]
[null,null,null,"","",null,0,0,0,0]
[null,"MATERIAL (C) - TOTAL",null,null,null,null,null,null,15.81,15.81]
[]
[48,"FONTE","CÓDIGO","DESCRIÇÃO","UNIDADE","COEFIC.","CUSTO UNITÁRIO",null,"CUSTO  TOTAL (A) + (B) + (C) + (D) + (E)"]
[null,null,null,null,null,null,"DESONERADO","NÃO DESONER.","DESONERADO","NÃO DESONER."]
[null,"COMPOSIÇÃO","COMP 048_SEE","HASTE ROSQUEADA \"TIRANTE\" 3/8\"","M",null,null,null,14.02,15.39]
[null,"AGETOP_I",8,"AJUDANTE","h     ",0.4,8.1999999999999993,9.51,3.28,3.8]
[null,"AGETOP_I",12,"ELETRICISTA","h     ",0.4,13.4,15.53,5.36,6.21]
[null,null,null,"","",null,0,0,0,0]
[null,"MÃO DE OBRA (B) - TOTAL",null,null,null,null,null,null,8.64,10.01]
[null,"COTAÇÃO","COT 012_SEE","HASTE ROSQUEADA \"TIRANTE\" 3/8\"","M",1,5.3833333333333329,5.3833333333333329,5.38,5.38]
[null,null,null,"","",null,0,0,0,0]
[null,null,null,"","",null,0,0,0,0]
[null,"MATERIAL (C) - TOTAL",null,null,null,null,null,null,5.38,5.38]
[]
[49,"FONTE","CÓDIGO","DESCRIÇÃO","UNIDADE","COEFIC.","CUSTO UNITÁRIO",null,"CUSTO  TOTAL (A) + (B) + (C) + (D) + (E)"]
[null,null,null,null,null,null,"DESONERADO","NÃO DESONER.","DESONERADO","NÃO DESONER."]
[null,"COMPOSIÇÃO","COMP 049_SEE","PORCA SEXTAVADA 3/8\"","UN ",null,null,null,0.2,0.22]
[null,"AGETOP_I",8,"AJUDANTE","h     ",8.9999999999999993E-3,8.1999999999999993,9.51,7.0000000000000007E-2,0.09]
[null,null,null,"","",null,0,0,0,0]
[null,null,null,"","",null,0,0,0,0]
[null,"MÃO DE OBRA (B) - TOTAL",null,null,null,null,null,null,7.0000000000000007E-2,0.09]
[null,"COTAÇÃO","COT 013_SEE","PORCA SEXTAVADA 3/8\"","UN ",1,0.13,0.13,0.13,0.13]
[null,null,null,"","",null,0,0,0,0]
[null,null,null,"","",null,0,0,0,0]
[null,"MATERIAL (C) - TOTAL",null,null,null,null,null,null,0.13,0.13]
[]
[57,"FONTE","CÓDIGO","DESCRIÇÃO","UNIDADE","COEFIC.","CUSTO UNITÁRIO",null,"CUSTO  TOTAL (A) + (B) + (C) + (D) + (E)"]
[null,null,null,null,null,null,"DESONERADO","NÃO DESONER.","DESONERADO","NÃO DESONER."]
[null,"COMPOSIÇÃO","COMP 057_SEE","BUCHA DE REDUCAO SOLDAVEL LONGA 85 X 60 mm","UN ",null,null,null,17.29,17.919999999999998]
[null,"AGETOP_I",8,"AJUDANTE","h     ",0.185,8.1999999999999993,9.51,1.52,1.76]
[null,"AGETOP_I",11,"ENCANADOR","h     ",0.185,13.4,15.53,2.48,2.87]
[null,"MÃO DE OBRA (B) - TOTAL",null,null,null,null,null,null,4,4.63]
[null,"SINAPI_I",817,"BUCHA DE REDUCAO DE PVC, SOLDAVEL, LONGA, COM 85 X 60 MM, PARA AGUA FRIA PREDIAL","UN    ",1,13.29,13.29,13.29,13.29]
[null,"MATERIAL (C) - TOTAL",null,null,null,null,null,null,13.29,13.29]
[]
[277,"FONTE","CÓDIGO","DESCRIÇÃO","UNIDADE","COEFIC.","CUSTO UNITÁRIO",null,"CUSTO  TOTAL (A) + (B) + (C) + (D) + (E)"]
[null,null,null,null,null,null,"DESONERADO","NÃO DESONER.","DESONERADO","NÃO DESONER."]
[null,"COMPOSIÇÃO","COMP 277_SEE","MARCAÇÃO NO PISO - 1X1 M PARA EXTINTOR","M2",null,null,null,27.719999999999995,27.799999999999997]
[null,"AGETOP_I",5,"SERVENTE","h     ",3.3300000000000003E-2,8.1999999999999993,9.51,0.27,0.32]
[null,null,null,"","",null,0,0,0,0]
[null,null,null,"","",null,0,0,0,0]
[null,"MÃO DE OBRA (B) - TOTAL",null,null,null,null,null,null,0.27,0.32]
[null,"SINAPI_I",5318,"SOLVENTE DILUENTE A BASE DE AGUARRAS","L     ",0.13,10.98,10.98,1.43,1.43]
[null,"SINAPI",5824,"CAMINHÃO TOCO, PBT 16.000 KG, CARGA ÚTIL MÁX. 10.685 KG, DIST. ENTRE EIXOS 4,8 M, POTÊNCIA 189 CV, INCLUSIVE CARROCERIA FIXA ABERTA DE MADEIRA P/ TRANSPORTE GERAL DE CARGA SECA, DIMEN. APROX. 2,5 X 7,00 X 0,50 M - CHP DIURNO. AF_06/2014","CHP",3.3E-3,135.91999999999999,139.13,0.45,0.46]
[null,"SINAPI_I",7343,"TINTA A BASE DE RESINA ACRILICA, PARA SINALIZACAO HORIZONTAL VIARIA (NBR 11862)","L     ",0.6,11.69,11.69,7.01,7.01]
[null,"SINAPI_I",7348,"TINTA ACRILICA PREMIUM PARA PISO","L     ",0.03,12.39,12.39,0.37,0.37]
[null,"SINAPI_I",25972,"MICROESFERAS DE VIDRO PARA SINALIZACAO HORIZONTAL VIARIA, TIPO I-B (PREMIX) - NBR 16184","KG    ",2.14,8.33,8.33,17.829999999999998,17.829999999999998]
[null,"SINAPI",95133,"MÁQUINA DEMARCADORA DE FAIXA DE TRÁFEGO À FRIO, AUTOPROPELIDA, POTÊNCIA 38 HP - CHP DIURNO. AF_07/2016","CHP",3.3E-3,110.07,113.65,0.36,0.38]
[null,"MATERIAL (C) - TOTAL",null,null,null,null,null,null,27.449999999999996,27.479999999999997]
[]
[24,"FONTE","CÓDIGO","DESCRIÇÃO","UNIDADE","COEFIC.","CUSTO UNITÁRIO",null,"CUSTO  TOTAL (A) + (B) + (C) + (D) + (E)"]
[null,null,null,null,null,null,"DESONERADO","NÃO DESONER.","DESONERADO","NÃO DESONER."]
[null,"COMPOSIÇÃO","COMP 024_SEE","SINALIZADOR FOTOLUMINESCENTE PARA EXTINTOR","UN ",null,"-","-",25.269999999999996,25.389999999999997]
[null,"AGETOP_I",5,"SERVENTE","h     ",0.09,8.1999999999999993,9.51,0.74,0.86]
[null,null,null,"","",null,0,0,0,0]
[null,null,null,"","",null,0,0,0,0]
[null,"MÃO DE OBRA (B) - TOTAL",null,null,null,null,null,null,0.74,0.86]
[null,"AGETOP_I",3070,"BUCHA DE NYLON S-6","un",2,0.04,0.04,0.08,0.08]
[null,"AGETOP_I",3393,"PARAFUSO P/BUCHA S-6","un",2,0.08,0.08,0.16,0.16]
[null,"SINAPI_I",37556,"PLACA DE SINALIZACAO DE SEGURANCA CONTRA INCENDIO, FOTOLUMINESCENTE, QUADRADA, *20 X 20* CM, EM PVC *2* MM ANTI-CHAMAS (SIMBOLOS, CORES E PICTOGRAMAS CONFORME NBR 13434)","UN    ",1,24.29,24.29,24.29,24.29]
[null,"MATERIAL (C) - TOTAL",null,null,null,null,null,null,24.529999999999998,24.529999999999998]
[]
[235,"FONTE","CÓDIGO","DESCRIÇÃO","UNIDADE","COEFIC.","CUSTO UNITÁRIO",null,"CUSTO  TOTAL (A) + (B) + (C) + (D) + (E)"]
[null,null,null,null,null,null,"DESONERADO","NÃO DESONER.","DESONERADO","NÃO DESONER."]
[null,"COMPOSIÇÃO","COMP 235_SEE","PLACA DE SINALIZAÇÃO EM PVC COD 01 - (300X300) PROIBIDO FUMAR","UN ",null,null,null,25.269999999999996,25.389999999999997]
[null,"AGETOP_I",5,"SERVENTE","h     ",0.09,8.1999999999999993,9.51,0.74,0.86]
[null,null,null,"","",null,0,0,0,0]
[null,null,null,"","",null,0,0,0,0]
[null,"MÃO DE OBRA (B) - TOTAL",null,null,null,null,null,null,0.74,0.86]
[null,"AGETOP_I",3070,"BUCHA DE NYLON S-6","un",2,0.04,0.04,0.08,0.08]
[null,"AGETOP_I",3393,"PARAFUSO P/BUCHA S-6","un",2,0.08,0.08,0.16,0.16]
[null,"SINAPI_I",37556,"PLACA DE SINALIZACAO DE SEGURANCA CONTRA INCENDIO, FOTOLUMINESCENTE, QUADRADA, *20 X 20* CM, EM PVC *2* MM ANTI-CHAMAS (SIMBOLOS, CORES E PICTOGRAMAS CONFORME NBR 13434)","UN    ",1,24.29,24.29,24.29,24.29]
[null,"MATERIAL (C) - TOTAL",null,null,null,null,null,null,24.529999999999998,24.529999999999998]
[]
[236,"FONTE","CÓDIGO","DESCRIÇÃO","UNIDADE","COEFIC.","CUSTO UNITÁRIO",null,"CUSTO  TOTAL (A) + (B) + (C) + (D) + (E)"]
[null,null,null,null,null,null,"DESONERADO","NÃO DESONER.","DESONERADO","NÃO DESONER."]
[null,"COMPOSIÇÃO","COMP 236_SEE","PLACA DE SINALIZAÇÃO EM PVC COD 06 - (300X300) PERIGO INFLAMÁVEL","UN ",null,null,null,25.269999999999996,25.389999999999997]
[null,"AGETOP_I",5,"SERVENTE","h     ",0.09,8.1999999999999993,9.51,0.74,0.86]
[null,null,null,"","",null,0,0,0,0]
[null,null,null,"","",null,0,0,0,0]
[null,"MÃO DE OBRA (B) - TOTAL",null,null,null,null,null,null,0.74,0.86]
[null,"AGETOP_I",3070,"BUCHA DE NYLON S-6","un",2,0.04,0.04,0.08,0.08]
[null,"AGETOP_I",3393,"PARAFUSO P/BUCHA S-6","un",2,0.08,0.08,0.16,0.16]
[null,"SINAPI_I",37556,"PLACA DE SINALIZACAO DE SEGURANCA CONTRA INCENDIO, FOTOLUMINESCENTE, QUADRADA, *20 X 20* CM, EM PVC *2* MM ANTI-CHAMAS (SIMBOLOS, CORES E PICTOGRAMAS CONFORME NBR 13434)","UN    ",1,24.29,24.29,24.29,24.29]
[null,"MATERIAL (C) - TOTAL",null,null,null,null,null,null,24.529999999999998,24.529999999999998]
[]
[411,"FONTE","CÓDIGO","DESCRIÇÃO","UNIDADE","COEFIC.","CUSTO UNITÁRIO",null,"CUSTO  TOTAL (A) + (B) + (C) + (D) + (E)"]
[null,null,null,null,null,null,"DESONERADO","NÃO DESONER.","DESONERADO","NÃO DESONER."]
[null,"COMPOSIÇÃO","COMP 411_SEE","PLACA DE SINALIZAÇÃO EM PVC COD 13 - (316X158) SAÍDA DE EMERGÊNCIA","UN ",null,null,null,30.769999999999996,30.889999999999997]
[null,"AGETOP_I",5,"SERVENTE","h     ",0.09,8.1999999999999993,9.51,0.74,0.86]
[null,null,null,"","",null,0,0,0,0]
[null,null,null,"","",null,0,0,0,0]
[null,"MÃO DE OBRA (B) - TOTAL",null,null,null,null,null,null,0.74,0.86]
[null,"AGETOP_I",3070,"BUCHA DE NYLON S-6","un",2,0.04,0.04,0.08,0.08]
[null,"AGETOP_I",3393,"PARAFUSO P/BUCHA S-6","un",2,0.08,0.08,0.16,0.16]
[null,"SINAPI_I",37559,"PLACA DE SINALIZACAO DE SEGURANCA CONTRA INCENDIO, FOTOLUMINESCENTE, RETANGULAR, *12 X 40* CM, EM PVC *2* MM ANTI-CHAMAS (SIMBOLOS, CORES E PICTOGRAMAS CONFORME NBR 13434)","UN    ",1,29.79,29.79,29.79,29.79]
[null,"MATERIAL (C) - TOTAL",null,null,null,null,null,null,30.029999999999998,30.029999999999998]
[]
[412,"FONTE","CÓDIGO","DESCRIÇÃO","UNIDADE","COEFIC.","CUSTO UNITÁRIO",null,"CUSTO  TOTAL (A) + (B) + (C) + (D) + (E)"]
[null,null,null,null,null,null,"DESONERADO","NÃO DESONER.","DESONERADO","NÃO DESONER."]
[null,"COMPOSIÇÃO","COMP 412_SEE","PLACA DE SINALIZAÇÃO EM PVC COD 17 - (316X158) MENSAGEM \"SAÍDA\"","UN ",null,null,null,30.769999999999996,30.889999999999997]
[null,"AGETOP_I",5,"SERVENTE","h     ",0.09,8.1999999999999993,9.51,0.74,0.86]
[null,null,null,"","",null,0,0,0,0]
[null,null,null,"","",null,0,0,0,0]
[null,"MÃO DE OBRA (B) - TOTAL",null,null,null,null,null,null,0.74,0.86]
[null,"AGETOP_I",3070,"BUCHA DE NYLON S-6","un",2,0.04,0.04,0.08,0.08]
[null,"AGETOP_I",3393,"PARAFUSO P/BUCHA S-6","un",2,0.08,0.08,0.16,0.16]
[null,"SINAPI_I",37559,"PLACA DE SINALIZACAO DE SEGURANCA CONTRA INCENDIO, FOTOLUMINESCENTE, RETANGULAR, *12 X 40* CM, EM PVC *2* MM ANTI-CHAMAS (SIMBOLOS, CORES E PICTOGRAMAS CONFORME NBR 13434)","UN    ",1,29.79,29.79,29.79,29.79]
[null,"MATERIAL (C) - TOTAL",null,null,null,null,null,null,30.029999999999998,30.029999999999998]
[]
[382,"FONTE","CÓDIGO","DESCRIÇÃO","UNIDADE","COEFIC.","CUSTO UNITÁRIO",null,"CUSTO  TOTAL (A) + (B) + (C) + (D) + (E)"]
[null,null,null,null,null,null,"DESONERADO","NÃO DESONER.","DESONERADO","NÃO DESONER."]
[null,"COMPOSIÇÃO","COMP 382_SEE","TE DE REDUCAO DE FERRO GALVANIZADO, COM ROSCA BSP, DE 3/4\" X 1/2\"","UN ",null,null,null,21.83,23.92]
[null,"AGETOP_I",8,"AJUDANTE","h     ",0.6,8.1999999999999993,9.51,4.92,5.71]
[null,"AGETOP_I",11,"ENCANADOR","h     ",0.61050000000000004,13.4,15.53,8.18,9.48]
[null,null,null,"","",null,0,0,0,0]
[null,"MÃO DE OBRA (B) - TOTAL",null,null,null,null,null,null,13.1,15.190000000000001]
[null,"SINAPI_I",3146,"FITA VEDA ROSCA EM ROLOS DE 18 MM X 10 M (L X C)","UN    ",0.12075471698113208,3.5,3.5,0.42,0.42]
[null,"SINAPI_I",6302,"TE DE REDUCAO DE FERRO GALVANIZADO, COM ROSCA BSP, DE 3/4\" X 1/2\"","UN    ",1,8.31,8.31,8.31,8.31]
[null,null,null,"","",null,0,0,0,0]
[null,"MATERIAL (C) - TOTAL",null,null,null,null,null,null,8.73,8.73]
[]
[383,"FONTE","CÓDIGO","DESCRIÇÃO","UNIDADE","COEFIC.","CUSTO UNITÁRIO",null,"CUSTO  TOTAL (A) + (B) + (C) + (D) + (E)"]
[null,null,null,null,null,null,"DESONERADO","NÃO DESONER.","DESONERADO","NÃO DESONER."]
[null,"COMPOSIÇÃO","COMP 383_SEE","BUCHA DE REDUCAO DE FERRO GALVANIZADO, COM ROSCA BSP, DE 1/2\" X 1/4\"","UN ",null,null,null,6.85,7.4]
[null,"AGETOP_I",8,"AJUDANTE","h     ",0.16,8.1999999999999993,9.51,1.31,1.52]
[null,"AGETOP_I",11,"ENCANADOR","h     ",0.16,13.4,15.53,2.14,2.48]
[null,null,null,"","",null,0,0,0,0]
[null,"MÃO DE OBRA (B) - TOTAL",null,null,null,null,null,null,3.45,4]
[null,"AGETOP_I","H689","FITA VEDAROSCA 12 MM","m",1.2,0.28000000000000003,0.28000000000000003,0.34,0.34]
[null,"SINAPI_I",770,"BUCHA DE REDUCAO DE FERRO GALVANIZADO, COM ROSCA BSP, DE 1/2\" X 1/4\"","UN    ",1,3.06,3.06,3.06,3.06]
[null,null,null,"","",null,0,0,0,0]
[null,"MATERIAL (C) - TOTAL",null,null,null,null,null,null,3.4,3.4]
[]
[212,"FONTE","CÓDIGO","DESCRIÇÃO","UNIDADE","COEFIC.","CUSTO UNITÁRIO",null,"CUSTO  TOTAL (A) + (B) + (C) + (D) + (E)"]
[null,null,null,null,null,null,"DESONERADO","NÃO DESONER.","DESONERADO","NÃO DESONER."]
[null,"COMPOSIÇÃO","COMP 212_SEE","NIPLE DE REDUÇÃO 1/2\" X 1/4\" BSP","UN ",null,null,null,9.5,10.050000000000001]
[null,"AGETOP_I",8,"AJUDANTE","h     ",0.16,8.1999999999999993,9.51,1.31,1.52]
[null,"AGETOP_I",11,"ENCANADOR","h     ",0.16,13.4,15.53,2.14,2.48]
[null,null,null,"","",null,0,0,0,0]
[null,"MÃO DE OBRA (B) - TOTAL",null,null,null,null,null,null,3.45,4]
[null,"COTAÇÃO","COT 103_SEE","NIPLE DE REDUÇÃO 1/2\" X 1/4\" BSP","UN",1,6.0533333333333337,6.0533333333333337,6.05,6.05]
[null,null,null,"","",null,0,0,0,0]
[null,null,null,"","",null,0,0,0,0]
[null,"MATERIAL (C) - TOTAL",null,null,null,null,null,null,6.05,6.05]
[]
[213,"FONTE","CÓDIGO","DESCRIÇÃO","UNIDADE","COEFIC.","CUSTO UNITÁRIO",null,"CUSTO  TOTAL (A) + (B) + (C) + (D) + (E)"]
[null,null,null,null,null,null,"DESONERADO","NÃO DESONER.","DESONERADO","NÃO DESONER."]
[null,"COMPOSIÇÃO","COMP 213_SEE","NIPLE DE REDUÇÃO 3/4\" X 1/2\" BSP","UN ",null,null,null,13.16,13.71]
[null,"AGETOP_I",8,"AJUDANTE","h     ",0.16,8.1999999999999993,9.51,1.31,1.52]
[null,"AGETOP_I",11,"ENCANADOR","h     ",0.16,13.4,15.53,2.14,2.48]
[null,null,null,"","",null,0,0,0,0]
[null,"MÃO DE OBRA (B) - TOTAL",null,null,null,null,null,null,3.45,4]
[null,"COTAÇÃO","COT 104_SEE","NIPLE DE REDUÇÃO 3/4\" X 1/2\" BSP","UN",1,9.7099999999999991,9.7099999999999991,9.7100000000000009,9.7100000000000009]
[null,null,null,"","",null,0,0,0,0]
[null,null,null,"","",null,0,0,0,0]
[null,"MATERIAL (C) - TOTAL",null,null,null,null,null,null,9.7100000000000009,9.7100000000000009]
[]
[237,"FONTE","CÓDIGO","DESCRIÇÃO","UNIDADE","COEFIC.","CUSTO UNITÁRIO",null,"CUSTO  TOTAL (A) + (B) + (C) + (D) + (E)"]
[null,null,null,null,null,null,"DESONERADO","NÃO DESONER.","DESONERADO","NÃO DESONER."]
[null,"COMPOSIÇÃO","COMP 237_SEE","FITA ANTICORROSIVA","M",null,null,null,11.14,11.83]
[null,"AGETOP_I",8,"AJUDANTE","h     ",0.2,8.1999999999999993,9.51,1.64,1.9]
[null,"AGETOP_I",12,"ELETRICISTA","h     ",0.2,13.4,15.53,2.68,3.11]
[null,null,null,"","",null,0,0,0,0]
[null,"MÃO DE OBRA (B) - TOTAL",null,null,null,null,null,null,4.32,5.01]
[null,"SINAPI_I",39634,"FITA ADESIVA ANTICORROSIVA DE PVC FLEXIVEL, COR PRETA, PARA PROTECAO TUBULACAO, 50 MM X 30 M (L X C), E= *0,25* MM","M     ",1,6.82,6.82,6.82,6.82]
[null,null,null,"","",null,0,0,0,0]
[null,null,null,"","",null,0,0,0,0]
[null,"MATERIAL (C) - TOTAL",null,null,null,null,null,null,6.82,6.82]
[]
[542,"FONTE","CÓDIGO","DESCRIÇÃO","UNIDADE","COEFIC.","CUSTO UNITÁRIO",null,"CUSTO  TOTAL (A) + (B) + (C) + (D) + (E)"]
[null,null,null,null,null,null,"DESONERADO","NÃO DESONER.","DESONERADO","NÃO DESONER."]
[null,"COMPOSIÇÃO","COMP 542_SEE","VÁLVULA UGV 3/4\" (S) LATÃO","UN ",null,null,null,25.17,26.66]
[null,"AGETOP_I",8,"AJUDANTE","h     ",0.432,8.1999999999999993,9.51,3.54,4.1100000000000003]
[null,"AGETOP_I",11,"ENCANADOR","h     ",0.432,13.4,15.53,5.79,6.71]
[null,null,null,"","",null,0,0,0,0]
[null,"MÃO DE OBRA (B) - TOTAL",null,null,null,null,null,null,9.33,10.82]
[null,"COTAÇÃO","COT 281_SEE","VÁLVULA UGV 3/4\" (S) LATÃO","UN ",1,15.836666666666666,15.836666666666666,15.84,15.84]
[null,null,null,"","",null,0,0,0,0]
[null,null,null,"","",null,0,0,0,0]
[null,"MATERIAL (C) - TOTAL",null,null,null,null,null,null,15.84,15.84]
[]
[543,"FONTE","CÓDIGO","DESCRIÇÃO","UNIDADE","COEFIC.","CUSTO UNITÁRIO",null,"CUSTO  TOTAL (A) + (B) + (C) + (D) + (E)"]
[null,null,null,null,null,null,"DESONERADO","NÃO DESONER.","DESONERADO","NÃO DESONER."]
[null,"COMPOSIÇÃO","COMP 543_SEE","VÁLVULA UGV 1/2\" (S) LATÃO","UN ",null,null,null,24.5,25.990000000000002]
[null,"AGETOP_I",8,"AJUDANTE","h     ",0.432,8.1999999999999993,9.51,3.54,4.1100000000000003]
[null,"AGETOP_I",11,"ENCANADOR","h     ",0.432,13.4,15.53,5.79,6.71]
[null,null,null,"","",null,0,0,0,0]
[null,"MÃO DE OBRA (B) - TOTAL",null,null,null,null,null,null,9.33,10.82]
[null,"COTAÇÃO","COT 282_SEE","VÁLVULA UGV 1/2\" (S) LATÃO","UN ",1,15.166666666666666,15.166666666666666,15.17,15.17]
[null,null,null,"","",null,0,0,0,0]
[null,null,null,"","",null,0,0,0,0]
[null,"MATERIAL (C) - TOTAL",null,null,null,null,null,null,15.17,15.17]
[]
[211,"FONTE","CÓDIGO","DESCRIÇÃO","UNIDADE","COEFIC.","CUSTO UNITÁRIO",null,"CUSTO  TOTAL (A) + (B) + (C) + (D) + (E)"]
[null,null,null,null,null,null,"DESONERADO","NÃO DESONER.","DESONERADO","NÃO DESONER."]
[null,"COMPOSIÇÃO","COMP 211_SEE","REGULADOR DE 2º ESTÁGIO 5KG/H","UN ",null,null,null,85.46,89.419999999999987]
[null,"AGETOP_I",8,"AJUDANTE","h     ",1.1499999999999999,8.1999999999999993,9.51,9.43,10.94]
[null,"AGETOP_I",11,"ENCANADOR","h     ",1.1499999999999999,13.4,15.53,15.41,17.86]
[null,null,null,"","",null,0,0,0,0]
[null,"MÃO DE OBRA (B) - TOTAL",null,null,null,null,null,null,24.84,28.799999999999997]
[null,"COTAÇÃO","COT 102_SEE","REGULADOR DE 2º ESTÁGIO 5KG/H","UN",1,59.833333333333336,59.833333333333336,59.83,59.83]
[null,"AGETOP_I","H689","FITA VEDAROSCA 12 MM","m",2.82,0.28000000000000003,0.28000000000000003,0.79,0.79]
[null,null,null,"","",null,0,0,0,0]
[null,"MATERIAL (C) - TOTAL",null,null,null,null,null,null,60.62,60.62]
[]
[210,"FONTE","CÓDIGO","DESCRIÇÃO","UNIDADE","COEFIC.","CUSTO UNITÁRIO",null,"CUSTO  TOTAL (A) + (B) + (C) + (D) + (E)"]
[null,null,null,null,null,null,"DESONERADO","NÃO DESONER.","DESONERADO","NÃO DESONER."]
[null,"COMPOSIÇÃO","COMP 210_SEE","REGULADOR DE 1º ESTÁGIO 60KG/H MODELO AP-40  COM MANÔMETRO","UN ",null,null,null,231.21,235.17000000000002]
[null,"AGETOP_I",8,"AJUDANTE","h     ",1.1499999999999999,8.1999999999999993,9.51,9.43,10.94]
[null,"AGETOP_I",11,"ENCANADOR","h     ",1.1499999999999999,13.4,15.53,15.41,17.86]
[null,null,null,"","",null,0,0,0,0]
[null,"MÃO DE OBRA (B) - TOTAL",null,null,null,null,null,null,24.84,28.799999999999997]
[null,"COTAÇÃO","COT 101_SEE","REGULADOR DE 1º ESTÁGIO 60KG/H MODELO AP-40  COM MANÔMETRO","UN",1,205.57666666666668,205.57666666666668,205.58,205.58]
[null,"AGETOP_I","H689","FITA VEDAROSCA 12 MM","m",2.82,0.28000000000000003,0.28000000000000003,0.79,0.79]
[null,null,null,"","",null,0,0,0,0]
[null,"MATERIAL (C) - TOTAL",null,null,null,null,null,null,206.37,206.37]
[]
[235,"FONTE","CÓDIGO","DESCRIÇÃO","UNIDADE","COEFIC.","CUSTO UNITÁRIO",null,"CUSTO  TOTAL (A) + (B) + (C) + (D) + (E)"]
[null,null,null,null,null,null,"DESONERADO","NÃO DESONER.","DESONERADO","NÃO DESONER."]
[null,"COMPOSIÇÃO","COMP 235_SEE","PLACA DE SINALIZAÇÃO EM PVC COD 01 - (300X300) PROIBIDO FUMAR","UN ",null,null,null,25.269999999999996,25.389999999999997]
[null,"AGETOP_I",5,"SERVENTE","h     ",0.09,8.1999999999999993,9.51,0.74,0.86]
[null,null,null,"","",null,0,0,0,0]
[null,null,null,"","",null,0,0,0,0]
[null,"MÃO DE OBRA (B) - TOTAL",null,null,null,null,null,null,0.74,0.86]
[null,"AGETOP_I",3070,"BUCHA DE NYLON S-6","un",2,0.04,0.04,0.08,0.08]
[null,"AGETOP_I",3393,"PARAFUSO P/BUCHA S-6","un",2,0.08,0.08,0.16,0.16]
[null,"SINAPI_I",37556,"PLACA DE SINALIZACAO DE SEGURANCA CONTRA INCENDIO, FOTOLUMINESCENTE, QUADRADA, *20 X 20* CM, EM PVC *2* MM ANTI-CHAMAS (SIMBOLOS, CORES E PICTOGRAMAS CONFORME NBR 13434)","UN    ",1,24.29,24.29,24.29,24.29]
[null,"MATERIAL (C) - TOTAL",null,null,null,null,null,null,24.529999999999998,24.529999999999998]
[]
[236,"FONTE","CÓDIGO","DESCRIÇÃO","UNIDADE","COEFIC.","CUSTO UNITÁRIO",null,"CUSTO  TOTAL (A) + (B) + (C) + (D) + (E)"]
[null,null,null,null,null,null,"DESONERADO","NÃO DESONER.","DESONERADO","NÃO DESONER."]
[null,"COMPOSIÇÃO","COMP 236_SEE","PLACA DE SINALIZAÇÃO EM PVC COD 06 - (300X300) PERIGO INFLAMÁVEL","UN ",null,null,null,25.269999999999996,25.389999999999997]
[null,"AGETOP_I",5,"SERVENTE","h     ",0.09,8.1999999999999993,9.51,0.74,0.86]
[null,null,null,"","",null,0,0,0,0]
[null,null,null,"","",null,0,0,0,0]
[null,"MÃO DE OBRA (B) - TOTAL",null,null,null,null,null,null,0.74,0.86]
[null,"AGETOP_I",3070,"BUCHA DE NYLON S-6","un",2,0.04,0.04,0.08,0.08]
[null,"AGETOP_I",3393,"PARAFUSO P/BUCHA S-6","un",2,0.08,0.08,0.16,0.16]
[null,"SINAPI_I",37556,"PLACA DE SINALIZACAO DE SEGURANCA CONTRA INCENDIO, FOTOLUMINESCENTE, QUADRADA, *20 X 20* CM, EM PVC *2* MM ANTI-CHAMAS (SIMBOLOS, CORES E PICTOGRAMAS CONFORME NBR 13434)","UN    ",1,24.29,24.29,24.29,24.29]
[null,"MATERIAL (C) - TOTAL",null,null,null,null,null,null,24.529999999999998,24.529999999999998]
[]
[83,"FONTE","CÓDIGO","DESCRIÇÃO","UNIDADE","COEFIC.","CUSTO UNITÁRIO",null,"CUSTO  TOTAL (A) + (B) + (C) + (D) + (E)"]
[null,null,null,null,null,null,"DESONERADO","NÃO DESONER.","DESONERADO","NÃO DESONER."]
[null,"COMPOSIÇÃO","COMP 083_SEE","CORRIMÃO PISO - SEDUC","M",null,null,null,141.9,145.95000000000002]
[null,"AGETOP_I",25,"OFICIAL \"B\"","h     ",1,13.4,15.53,13.4,15.53]
[null,"AGETOP_I",8,"AJUDANTE","h     ",1,8.1999999999999993,9.51,8.1999999999999993,9.51]
[null,"MÃO DE OBRA (B) - TOTAL",null,null,null,null,null,null,21.6,25.04]
[null,"AGETOP_I",2376,"TUBO INDUSTRIAL 2\" CHAPA 13 ","Kg",8.2197499999999994,5.23,5.23,42.99,42.99]
[null,"AGETOP_I",2504,"TUBO INDUSTRIAL D=25 MM CHAPA 13 ","Kg",1.1000000000000001,5.07,5.07,5.58,5.58]
[null,"AGETOP_I",2417,"MASSA PLASTICA","Kg",0.2041,10.58,10.58,2.16,2.16]
[null,"AGETOP_I",2246,"ELETRODO 2.5 OK","Kg",0.11459999999999999,8.6999999999999993,8.6999999999999993,1,1]
[null,"AGETOP_I",1672,"LIXA PARA FERRO ( NÚMERO 100 )","un",0.125,2.12,2.12,0.27,0.27]
[null,"AGETOP_I",1264,"DISCO DE DESBASTE 7/8\" P/ CONC./FERRO (1/4\" X 7\")","un",2.5000000000000001E-2,7,7,0.18,0.18]
[null,"AGETOP_I",1334,"DISCO DE CORTE DIAM. 5/8\"- 10\"","un",0.1865,5.5,5.5,1.03,1.03]
[null,"AGETOP_I",2902,"FABRICAÇÃO / MONTAGEM","un",1,50.44,50.44,50.44,50.44]
[null,"AGETOP_I",2150,"CHAPA DE FERRO DOBRADA No.13","Kg",0.43519999999999998,5.28,5.28,2.2999999999999998,2.2999999999999998]
[null,"AGETOP_I",2719,"CHAPA PERFILADA 3/16\"","Kg",1.1644000000000001,5.04,5.04,5.87,5.87]
[null,"AGETOP_I",2436,"ACO CA-25 - 6,3 MM (1/4\") - BARRA LISA A-36","Kg",0.48150000000000004,5.13,5.13,2.4700000000000002,2.4700000000000002]
[null,"AGETOP",261602,"PINT.ESMALTE/ESQUAD.FERRO C/FUNDO ANTICOR.","m2    ",0.44,13.65,15.04,6.01,6.62]
[null,"MATERIAL (C) - TOTAL",null,null,null,null,null,null,120.30000000000001,120.91000000000001]
[]
[387,"FONTE","CÓDIGO","DESCRIÇÃO","UNIDADE","COEFIC.","CUSTO UNITÁRIO",null,"CUSTO  TOTAL (A) + (B) + (C) + (D) + (E)"]
[null,null,null,null,null,null,"DESONERADO","NÃO DESONER.","DESONERADO","NÃO DESONER."]
[null,"COMPOSIÇÃO","COMP 387_SEE","LÂMPADA LED TUBULAR 18W ","UN ",null,null,null,22.28,22.330000000000002]
[null,"AGETOP_I",8,"AJUDANTE","h     ",1.4999999999999999E-2,8.1999999999999993,9.51,0.12,0.14000000000000001]
[null,"AGETOP_I",12,"ELETRICISTA","h     ",1.4999999999999999E-2,13.4,15.53,0.2,0.23]
[null,null,null,"","",null,0,0,0,0]
[null,"MÃO DE OBRA (B) - TOTAL",null,null,null,null,null,null,0.32,0.37]
[null,"COTAÇÃO","COT 195_SEE","LÂMPADA LED TUBULAR 18W ","UN",1,21.959999999999997,21.959999999999997,21.96,21.96]
[null,null,null,"","",null,0,0,0,0]
[null,null,null,"","",null,0,0,0,0]
[null,"MATERIAL (C) - TOTAL",null,null,null,null,null,null,21.96,21.96]
[]
[209,"FONTE","CÓDIGO","DESCRIÇÃO","UNIDADE","COEFIC.","CUSTO UNITÁRIO",null,"CUSTO  TOTAL (A) + (B) + (C) + (D) + (E)"]
[null,null,null,null,null,null,"DESONERADO","NÃO DESONER.","DESONERADO","NÃO DESONER."]
[null,"COMPOSIÇÃO","COMP 209_SEE","TOALHEIRO PLÁSTICO TIPO DISPENSER PARA PAPEL TOALHA INTERFOLHADO","UN ",null,null,null,47.76,48.62]
[null,"AGETOP_I",8,"AJUDANTE","h     ",0.25,8.1999999999999993,9.51,2.0499999999999998,2.38]
[null,"AGETOP_I",4,"PEDREIRO","h     ",0.25,13.4,15.53,3.35,3.88]
[null,"MÃO DE OBRA (B) - TOTAL",null,null,null,null,null,null,5.4,6.26]
[null,"SINAPI_I",37401,"TOALHEIRO PLASTICO TIPO DISPENSER PARA PAPEL TOALHA INTERFOLHADO","UN    ",1,41.56,41.56,41.56,41.56]
[null,"AGETOP_I",2221,"PARAFUSO COM BUCHA S-8","un",4,0.2,0.2,0.8,0.8]
[null,"MATERIAL (C) - TOTAL",null,null,null,null,null,null,42.36,42.36]
[]
[541,"FONTE","CÓDIGO","DESCRIÇÃO","UNIDADE","COEFIC.","CUSTO UNITÁRIO",null,"CUSTO  TOTAL (A) + (B) + (C) + (D) + (E)"]
[null,null,null,null,null,null,"DESONERADO","NÃO DESONER.","DESONERADO","NÃO DESONER."]
[null,"COMPOSIÇÃO","COMP 541_SEE","BANCADA DE GRANITO CINZA POLIDO - FORNECIMENTO E INSTALAÇÃO. ","M2    ",null,null,null,481.96,486.81999999999994]
[null,"SINAPI",88274,"MARMORISTA/GRANITEIRO COM ENCARGOS COMPLEMENTARES","H",1.6555555555555557,17.329999999999998,19.38,28.69,32.08]
[null,"SINAPI",88316,"SERVENTE COM ENCARGOS COMPLEMENTARES","H",1.088888888888889,12.83,14.18,13.97,15.44]
[null,null,null,"","",null,0,0,0,0]
[null,"MÃO DE OBRA (B) - TOTAL",null,null,null,null,null,null,42.660000000000004,47.519999999999996]
[null,"SINAPI_I",4823,"MASSA PLASTICA PARA MARMORE/GRANITO","KG    ",0.58088888888888901,28.73,28.73,16.690000000000001,16.690000000000001]
[null,"SINAPI_I",7568,"BUCHA DE NYLON SEM ABA S10, COM PARAFUSO DE 6,10 X 65 MM EM ACO ZINCADO COM ROSCA SOBERBA, CABECA CHATA E FENDA PHILLIPS","UN    ",6.666666666666667,0.49,0.49,3.27,3.27]
[null,"SINAPI_I",11795,"GRANITO PARA BANCADA, POLIDO, TIPO ANDORINHA/ QUARTZ/ CASTELO/ CORUMBA OU OUTROS EQUIVALENTES DA REGIAO, E=  *2,5* CM","M2    ",1.1166666666666667,305.66000000000003,305.66000000000003,341.32,341.32]
[null,"SINAPI_I",37329,"REJUNTE EPOXI BRANCO","KG    ",3.9E-2,39.869999999999997,39.869999999999997,1.55,1.55]
[null,"SINAPI_I",37591,"SUPORTE MAO-FRANCESA EM ACO, ABAS IGUAIS 40 CM, CAPACIDADE MINIMA 70 KG, BRANCO","UN    ",2.2222222222222223,34.409999999999997,34.409999999999997,76.47,76.47]
[null,"MATERIAL (C) - TOTAL",null,null,null,null,null,null,439.29999999999995,439.29999999999995]