{"text_format":"1","workbook":"xlsx","n_sheets":8,"sheets":["Orçamento","Resumo ","Somatório","Cronog_120_Dias","Composição BDI","Relatório CENTRAL","Parc Maior Relev","Composições"],"not_rendered":{"charts":0,"images":5,"macros":1,"external_links":1,"defined_names":152,"comments":2,"pivot_tables":0},"unopened":[],"bounds":{"document_bytes":16777216,"sheet_cells":100000,"rows_first":2000,"rows_last":500,"rows_between":2000,"halvings":0,"cell_chars":16384,"cell_head_chars":4096},"cells_cut":0,"cells_raw":0,"read":"whole","date_system":"1900"}

{"sheet":"Orçamento","index":0,"n_rows":906,"n_cols":27,"rows_kept":906,"cut":false,"hidden":false,"merged":[[898,18,898,22],[893,15,893,17],[893,18,893,22],[894,15,894,17],[894,18,894,22],[895,15,895,17],[895,18,895,22],[9,24,9,25],[8,23,8,25],[887,18,887,22],[888,15,888,17],[888,18,888,22],[889,15,889,17],[889,18,889,22],[884,15,884,17],[884,18,884,22],[885,15,885,17],[885,18,885,22],[886,15,886,17],[886,18,886,22],[880,14,880,26],[881,18,881,22],[882,15,882,17],[882,18,882,22],[899,23,899,25],[900,23,900,25],[901,23,901,25],[902,23,902,25],[903,23,903,25],[904,23,904,25],[905,23,905,25],[874,14,874,17],[881,15,881,17],[847,15,847,17],[902,18,902,22],[890,15,890,17],[890,18,890,22],[891,15,891,17],[891,18,891,22],[892,15,892,17],[892,18,892,22],[896,15,896,17],[896,18,896,22],[897,15,897,17],[897,18,897,22],[898,15,898,17],[887,15,887,17],[905,18,905,22],[902,14,902,17],[899,15,899,17],[899,18,899,22],[900,15,900,17],[900,18,900,22],[901,15,901,17],[901,18,901,22],[904,18,904,22],[903,18,903,22],[883,15,883,17],[883,18,883,22],[838,16,838,24],[839,16,839,24],[840,16,840,24],[10,14,10,26],[13,14,13,26],[2,14,2,22],[3,14,3,22],[5,18,5,22],[6,18,6,22],[11,18,11,22],[12,18,12,22],[6,14,6,17],[5,14,5,17],[3,23,3,25],[2,23,2,25],[5,23,5,25],[6,23,6,25],[842,16,842,24],[8,18,8,20],[860,15,860,17],[861,15,861,17],[862,15,862,17],[863,15,863,17],[864,15,864,17],[865,15,865,17],[866,15,866,17],[867,15,867,17],[841,16,841,24],[831,23,831,24],[832,23,832,24],[847,23,847,25],[872,15,872,17],[873,15,873,17],[846,14,846,26],[830,17,835,17],[847,18,847,22],[848,18,848,22],[856,18,856,22],[857,18,857,22],[858,18,858,22],[859,18,859,22],[871,18,871,22],[868,15,868,17],[848,15,848,17],[849,15,849,17],[850,15,850,17],[851,15,851,17],[852,15,852,17],[853,15,853,17],[854,15,854,17],[855,15,855,17],[856,15,856,17],[865,23,865,25],[866,23,866,25],[867,23,867,25],[877,18,877,22],[853,18,853,22],[854,18,854,22],[852,18,852,22],[861,18,861,22],[843,18,843,24],[849,18,849,22],[850,18,850,22],[851,18,851,22],[874,18,874,22],[872,18,872,22],[873,18,873,22],[863,18,863,22],[870,18,870,22],[866,18,866,22],[868,18,868,22],[864,18,864,22],[865,18,865,22],[874,23,874,25],[868,23,868,25],[869,23,869,25],[870,23,870,25],[871,23,871,25],[872,23,872,25],[8,12,9,12],[876,18,876,22],[0,14,0,24],[8,14,8,16],[9,14,9,16],[11,14,11,16],[12,14,12,16],[14,14,14,24],[1,14,1,24],[4,14,4,24],[7,14,7,24],[860,18,860,22],[857,15,857,17],[858,15,858,17],[859,15,859,17],[869,18,869,22],[867,18,867,22],[830,23,830,24],[875,18,875,22],[862,18,862,22],[855,18,855,22],[869,15,869,17],[870,15,870,17],[871,15,871,17],[896,23,896,25],[897,23,897,25],[898,23,898,25],[881,23,881,25],[882,23,882,25],[883,23,883,25],[884,23,884,25],[885,23,885,25],[886,23,886,25],[887,23,887,25],[888,23,888,25],[889,23,889,25],[890,23,890,25],[891,23,891,25],[892,23,892,25],[893,23,893,25],[894,23,894,25],[895,23,895,25],[12,23,12,25],[11,23,11,25],[9,19,9,22],[875,23,875,25],[876,23,876,25],[877,23,877,25],[873,23,873,25],[848,23,848,25],[849,23,849,25],[850,23,850,25],[851,23,851,25],[852,23,852,25],[853,23,853,25],[854,23,854,25],[855,23,855,25],[856,23,856,25],[857,23,857,25],[858,23,858,25],[859,23,859,25],[860,23,860,25],[861,23,861,25],[862,23,862,25],[863,23,863,25],[864,23,864,25]]}
[]
[]
[null,null,null,null,null,null,null,null,null,null,null,null,null,null,"UNIDADE ESCOLAR",null,null,null,null,null,null,null,null,"CÓDIGO INEP"]
[null,null,null,null,null,null,null,null,null,null,null,null,null,null,"CENTRO DE ENSINO EM PERÍODO INTEGRAL GARAVELO PARK",null,null,null,null,null,null,null,null,52030660]
[]
["Nmax",null,null,null,null,null,null,null,null,null,null,null,"Ajustar altura?",null,"OBRA",null,null,null,"DATA",null,null,null,null,"CIDADE"]
[{"$f":"MAX($C$18:$C$830)","v":4},null,null,null,null,null,null,null,null,null,null,null,"NÃO",null,"AMPLIAÇÃO E REFORMA",null,null,null,"2020-03-25",null,null,null,null,"APARECIDA DE GOIÂNIA"]
[]
[null,null,null,null,null,null,null,null,null,null,null,null,"",null,"CRE",null,null,"ENDEREÇO","REFERÊNCIA AGETOP",null,null,null,null,"REFERÊNCIA SINAPI"]
[null,null,null,null,null,null,null,null,null,null,null,null,null,null,"APARECIDA",null,null,"RUA 43-E QD.84 ESQ.C/ 44-E S/N QD.84, SETOR GARAVELO PARK, CEP:74932-640","ABR/19","DESONERADA",null,null,null,"OUT/19","DESONERADA"]
[]
[null,null,null,null,null,null,null,null,null,null,null,null,null,null,"ÁREA EXISTENTE (M²)",null,null,"ÁREA A CONSTRUIR (M²)","ÁREA A DEMOLIR (M²)",null,null,null,null,"ÁREA TOTAL CONSTRUÍDA (M²)"]
[null,null,null,null,null,null,null,null,null,null,null,null,null,null,1976.74,null,null,209.56,0,null,null,null,null,2186.3000000000002]
[]
[null,null,null,null,null,null,null,null,null,null,null,"FILTRO",null,null,"PLANILHA ORÇAMENTÁRIA"]
["Nível E","Save Nivel","Nível C","Altura","n1","n2","n3","n4","n5","Czero","Cnível","↓","Nível","Nível Corrigido","ITEM","TABELA","CODIGO","DESCRIÇÃO DOS SERVIÇOS","UNID","QUANT","REPET","QUANT TOTAL","MAT","MO","T.SERVIÇO UNIT","VALOR TOTAL","OBSERVAÇÕES¹"]
[{"$f":"CHOOSE(1+LOG(1+2*(ORÇAMENTO.Nivel=\"Nível 1\")+4*(ORÇAMENTO.Nivel=\"Nível 2\")+8*(ORÇAMENTO.Nivel=\"Nível 3\")+16*(ORÇAMENTO.Nivel=\"Nível 4\")+32*(ORÇAMENTO.Nivel=\"Serviço\"),2),0,1,2,3,4,\"S\")","v":"S"},{"$f":"IF(OR(C17=\"s\",C17=0),OFFSET(B17,-1,0),C17)","v":"Save Nivel"},{"$f":"IF(OFFSET(C17,-1,0)=\"L\",1,IF(OFFSET(C17,-1,0)=1,2,IF(OR(A17=\"s\",A17=0),\"S\",IF(AND(OFFSET(C17,-1,0)=2,A17=4),3,IF(AND(OR(OFFSET(C17,-1,0)=\"s\",OFFSET(C17,-1,0)=0),A17<>\"s\",A17>OFFSET(B17,-1,0)),OFFSET(B17,-1,0),A17)))))","v":"S"},{"$f":"IF(OR(C17=\"S\",C17=0),0,IF(ISERROR(K17),J17,SMALL(J17:K17,1)))","v":0},{"$f":"IF($C17=1,OFFSET(E17,-1,0)+1,OFFSET(E17,-1,0))","v":"n1"},{"$f":"IF($C17=1,0,IF($C17=2,OFFSET(F17,-1,0)+1,OFFSET(F17,-1,0)))","v":"n2"},{"$f":"IF(AND($C17<=2,$C17<>0),0,IF($C17=3,OFFSET(G17,-1,0)+1,OFFSET(G17,-1,0)))","v":"n3"},{"$f":"IF(AND($C17<=3,$C17<>0),0,IF($C17=4,OFFSET(H17,-1,0)+1,OFFSET(H17,-1,0)))","v":"n4"},{"$f":"IF(AND($C17<=4,$C17<>0),0,IF(AND($C17=\"S\",$Y17>0),OFFSET(I17,-1,0)+1,OFFSET(I17,-1,0)))","v":"n5"},{"$f":"IF(OR($C17=\"S\",$C17=0),0,MATCH(0,OFFSET($D17,1,$C17,ROW($C$830)-ROW($C17)),0))","v":0},{"$f":"IF(OR($C17=\"S\",$C17=0),0,MATCH(OFFSET($D17,0,$C17)+1,OFFSET($D17,1,$C17,ROW($C$830)-ROW($C17)),0))","v":0},"","Serviço","Serviço","-","SINAPI",null,"(sem código)","-",null,"REPET","-",0,0,0,"-",""]
[0,null,"L",{"$f":"COUNTA(OFFSET(D18,1,0):D$830)","v":811},{"$f":"LEFT(O19,1)-1","v":0},null,null,null,null,null,null,"F","LOTE","LOTE","AMPLIAÇÃO E REFORMA - CENTRO DE ENSINO EM PERÍODO INTEGRAL GARAVELO PARK",null,null,null,null,null,null,null,null,null,null,0]
[1,{"$f":"IF(OR(C19=\"s\",C19=0),OFFSET(B19,-1,0),C19)","v":1},{"$f":"IF(OFFSET(C19,-1,0)=\"L\",1,IF(OFFSET(C19,-1,0)=1,2,IF(OR(A19=\"s\",A19=0),\"S\",IF(AND(OFFSET(C19,-1,0)=2,A19=4),3,IF(AND(OR(OFFSET(C19,-1,0)=\"s\",OFFSET(C19,-1,0)=0),A19<>\"s\",A19>OFFSET(B19,-1,0)),OFFSET(B19,-1,0),A19)))))","v":1},{"$f":"IF(OR(C19=\"S\",C19=0),0,IF(ISERROR(K19),J19,SMALL(J19:K19,1)))","v":468},{"$f":"IF($C19=1,OFFSET(E19,-1,0)+1,OFFSET(E19,-1,0))","v":1},{"$f":"IF($C19=1,0,IF($C19=2,OFFSET(F19,-1,0)+1,OFFSET(F19,-1,0)))","v":0},{"$f":"IF(AND($C19<=2,$C19<>0),0,IF($C19=3,OFFSET(G19,-1,0)+1,OFFSET(G19,-1,0)))","v":0},{"$f":"IF(AND($C19<=3,$C19<>0),0,IF($C19=4,OFFSET(H19,-1,0)+1,OFFSET(H19,-1,0)))","v":0},0,{"$f":"IF(OR($C19=\"S\",$C19=0),0,MATCH(0,OFFSET($D19,1,$C19,ROW($C$830)-ROW($C19)),0))","v":811},{"$f":"IF(OR($C19=\"S\",$C19=0),0,MATCH(OFFSET($D19,0,$C19)+1,OFFSET($D19,1,$C19,ROW($C$830)-ROW($C19)),0))","v":468},"F","Nível 1","Nível 1","1.","AGETOP",null,"AMPLIAÇÃO E REFORMA","UN",1,1,1,null,null,0,0]
[2,{"$f":"IF(OR(C20=\"s\",C20=0),OFFSET(B20,-1,0),C20)","v":2},{"$f":"IF(OFFSET(C20,-1,0)=\"L\",1,IF(OFFSET(C20,-1,0)=1,2,IF(OR(A20=\"s\",A20=0),\"S\",IF(AND(OFFSET(C20,-1,0)=2,A20=4),3,IF(AND(OR(OFFSET(C20,-1,0)=\"s\",OFFSET(C20,-1,0)=0),A20<>\"s\",A20>OFFSET(B20,-1,0)),OFFSET(B20,-1,0),A20)))))","v":2},{"$f":"IF(OR(C20=\"S\",C20=0),0,IF(ISERROR(K20),J20,SMALL(J20:K20,1)))","v":35},{"$f":"IF($C20=1,OFFSET(E20,-1,0)+1,OFFSET(E20,-1,0))","v":1},{"$f":"IF($C20=1,0,IF($C20=2,OFFSET(F20,-1,0)+1,OFFSET(F20,-1,0)))","v":1},{"$f":"IF(AND($C20<=2,$C20<>0),0,IF($C20=3,OFFSET(G20,-1,0)+1,OFFSET(G20,-1,0)))","v":0},{"$f":"IF(AND($C20<=3,$C20<>0),0,IF($C20=4,OFFSET(H20,-1,0)+1,OFFSET(H20,-1,0)))","v":0},0,467,35,"","Nível 2","Nível 2","-","AGETOP",null,"SERVIÇOS PRELIMINARES","-",null,1,"-",null,null,0,0]
[3,3,3,3,1,1,1,0,0,34,3,"","Nível 3","Nível 3","-","SINAPI",null,"ALVENARIA ADMINISTRAÇÃO","-",null,1,"-",null,null,0,0,""]
["S",3,"S",0,1,1,1,0,0,0,0,"","Serviço","Serviço","-","SINAPI",97622,"DEMOLIÇÃO DE ALVENARIA DE BLOCO FURADO, DE FORMA MANUAL, SEM REAPROVEITAMENTO. AF_12/2017","M3",1.61,1,1.61,null,null,0,0,"Referência: AGETOP - 20118"]
["S",3,"S",0,1,1,1,0,0,0,0,"","Serviço","Serviço","-","SINAPI",97644,"REMOÇÃO DE PORTAS, DE FORMA MANUAL, SEM REAPROVEITAMENTO. AF_12/2017","M2",5.04,1,5.04,null,null,0,0,"Referência: AGETOP - 20106"]
[3,3,3,5,1,1,2,0,0,31,5,"","Nível 3","Nível 3","-","SINAPI",null,"DEPÓSITO","-",null,1,"-",null,null,0,0,""]
["S",3,"S",0,1,1,2,0,0,0,0,"","Serviço","Serviço","-","SINAPI",97622,"DEMOLIÇÃO DE ALVENARIA DE BLOCO FURADO, DE FORMA MANUAL, SEM REAPROVEITAMENTO. AF_12/2017","M3",3.53,1,3.53,null,null,0,0,"Referência: AGETOP - 20118"]
["S",3,"S",0,1,1,2,0,0,0,0,"","Serviço","Serviço","-","AGETOP",20103,"DEMOLIÇÃO ESTRUTURA EM MADEIRA TELHADO C/ TRANSP. ATÉ CB. E CARGA","m2    ",20.25,1,20.25,null,null,0,0,""]
["S",3,"S",0,1,1,2,0,0,0,0,"","Serviço","Serviço","-","AGETOP",20102,"DEMOLICAO-COBERTURA TELHA FIBROCIMENTO/FIBRA DE VIDRO/SIMILARES C/ TRANSP. ATÉ CB. E CARGA","m2    ",20.25,1,20.25,null,null,0,0,""]
["S",3,"S",0,1,1,2,0,0,0,0,"","Serviço","Serviço","-","SINAPI",97644,"REMOÇÃO DE PORTAS, DE FORMA MANUAL, SEM REAPROVEITAMENTO. AF_12/2017","M2",1.68,1,1.68,null,null,0,0,"Referência: AGETOP - 20106"]
[3,3,3,2,1,1,3,0,0,26,2,"","Nível 3","Nível 3","-","SINAPI",null,"PORTÃO DE ACESSO","-",null,1,"-",null,null,0,0,""]
["S",3,"S",0,1,1,3,0,0,0,0,"","Serviço","Serviço","-","SINAPI",97622,"DEMOLIÇÃO DE ALVENARIA DE BLOCO FURADO, DE FORMA MANUAL, SEM REAPROVEITAMENTO. AF_12/2017","M3",0.31,1,0.31,null,null,0,0,"Referência: AGETOP - 20118"]
[3,3,3,2,1,1,4,0,0,24,2,"","Nível 3","Nível 3","-","SINAPI",null,"VESTIÁRIO","-",null,1,"-",null,null,0,0,""]
["S",3,"S",0,1,1,4,0,0,0,0,"","Serviço","Serviço","-","AGETOP",20121,"DEM. MANUAL EM CONCR.SIMPLES C/TR.ATE CB.E CARGA (O.C.)","m3    ",2.76,1,2.76,null,null,0,0,""]
[3,3,3,2,1,1,5,0,0,22,2,"","Nível 3","Nível 3","-","SINAPI",null,"PÁTIO MULTIUSO","-",null,1,"-",null,null,0,0,""]
["S",3,"S",0,1,1,5,0,0,0,0,"","Serviço","Serviço","-","AGETOP",20121,"DEM. MANUAL EM CONCR.SIMPLES C/TR.ATE CB.E CARGA (O.C.)","m3    ",6.69,1,6.69,null,null,0,0,""]
[3,3,3,2,1,1,6,0,0,20,2,"","Nível 3","Nível 3","-","SINAPI",null,"PASSARELAS","-",null,1,"-",null,null,0,0,""]
["S",3,"S",0,1,1,6,0,0,0,0,"","Serviço","Serviço","-","AGETOP",20121,"DEM. MANUAL EM CONCR.SIMPLES C/TR.ATE CB.E CARGA (O.C.)","m3    ",1,1,1,null,null,0,0,""]
[3,3,3,5,1,1,7,0,0,18,5,"","Nível 3","Nível 3","-","SINAPI",null,"SANITÁRIOS 1º PAVIMENTO","-",null,1,"-",null,null,0,0,""]
["S",3,"S",0,1,1,7,0,0,0,0,"","Serviço","Serviço","-","AGETOP",20163,"DEMOLIÇÃO DAS INSTALAÇÕES HIDROSANITÁRIAS E AFINS C/ TRANSP. ATÉ CB. E CARGA","H     ",2,1,2,null,null,0,0,""]
["S",3,"S",0,1,1,7,0,0,0,0,"","Serviço","Serviço","-","SINAPI",97622,"DEMOLIÇÃO DE ALVENARIA DE BLOCO FURADO, DE FORMA MANUAL, SEM REAPROVEITAMENTO. AF_12/2017","M3",0.26,1,0.26,null,null,0,0,"Referência: AGETOP - 20118"]
["S",3,"S",0,1,1,7,0,0,0,0,"","Serviço","Serviço","-","AGETOP",20121,"DEM. MANUAL EM CONCR.SIMPLES C/TR.ATE CB.E CARGA (O.C.)","m3    ",0.12,1,0.12,null,null,0,0,""]
["S",3,"S",0,1,1,7,0,0,0,0,"","Serviço","Serviço","-","SINAPI",97633,"DEMOLIÇÃO DE REVESTIMENTO CERÂMICO, DE FORMA MANUAL, SEM REAPROVEITAMENTO. AF_12/2017","M2",133.13999999999999,1,133.13999999999999,null,null,0,0,"Referência: AGETOP - 20115"]
[3,3,3,2,1,1,8,0,0,13,2,"","Nível 3","Nível 3","-","SINAPI",null,"SANITÁRIOS TÉRREO","-",null,1,"-",null,null,0,0,""]
["S",3,"S",0,1,1,8,0,0,0,0,"","Serviço","Serviço","-","AGETOP",20134,"DEM.DE FORRO GESSO C/TRANSP.ATE CB.E CARGA","m2    ",29.28,1,29.28,null,null,0,0,""]
[3,3,3,2,1,1,9,0,0,11,2,"","Nível 3","Nível 3","-","SINAPI",null,"PISO TÁTIL","-",null,1,"-",null,null,0,0,""]
["S",3,"S",0,1,1,9,0,0,0,0,"","Serviço","Serviço","-","AGETOP",20121,"DEM. MANUAL EM CONCR.SIMPLES C/TR.ATE CB.E CARGA (O.C.)","m3    ",4.8600000000000003,1,4.8600000000000003,null,null,0,0,""]
[3,3,3,2,1,1,10,0,0,9,2,"","Nível 3","Nível 3","-","SINAPI",null,"CENTRAL DE GÁS","-",null,1,"-",null,null,0,0,""]
["S",3,"S",0,1,1,10,0,0,0,0,"","Serviço","Serviço","-","AGETOP",20121,"DEM. MANUAL EM CONCR.SIMPLES C/TR.ATE CB.E CARGA (O.C.)","m3    ",0.09,1,0.09,null,null,0,0,""]
[3,3,3,2,1,1,11,0,0,7,2,"","Nível 3","Nível 3","-","SINAPI",null,"COMBATE À INCÊNDIO","-",null,1,"-",null,null,0,0,""]
["S",3,"S",0,1,1,11,0,0,0,0,"","Serviço","Serviço","-","AGETOP",20121,"DEM. MANUAL EM CONCR.SIMPLES C/TR.ATE CB.E CARGA (O.C.)","m3    ",7.89,1,7.89,null,null,0,0,""]
[3,3,3,2,1,1,12,0,0,{"$f":"IF(OR($C50=\"S\",$C50=0),0,MATCH(0,OFFSET($D50,1,$C50,ROW($C$830)-ROW($C50)),0))","v":5},{"$f":"IF(OR($C50=\"S\",$C50=0),0,MATCH(OFFSET($D50,0,$C50)+1,OFFSET($D50,1,$C50,ROW($C$830)-ROW($C50)),0))","v":2},"","Nível 3","Nível 3","-","SINAPI",null,"INST. ELÉTRICAS","-",null,1,"-",null,null,0,0,""]
["S",3,"S",0,1,1,12,0,0,0,0,"","Serviço","Serviço","-","AGETOP",20162,"DEMOLIÇÃO DAS INSTALAÇÕES ELÉTRICAS E AFINS C/ TRANSP. ATÉ CB. E CARGA","H     ",40,1,40,null,null,0,0,""]
[3,{"$f":"IF(OR(C52=\"s\",C52=0),OFFSET(B52,-1,0),C52)","v":3},{"$f":"IF(OFFSET(C52,-1,0)=\"L\",1,IF(OFFSET(C52,-1,0)=1,2,IF(OR(A52=\"s\",A52=0),\"S\",IF(AND(OFFSET(C52,-1,0)=2,A52=4),3,IF(AND(OR(OFFSET(C52,-1,0)=\"s\",OFFSET(C52,-1,0)=0),A52<>\"s\",A52>OFFSET(B52,-1,0)),OFFSET(B52,-1,0),A52)))))","v":3},{"$f":"IF(OR(C52=\"S\",C52=0),0,IF(ISERROR(K52),J52,SMALL(J52:K52,1)))","v":3},1,1,13,0,0,{"$f":"IF(OR($C52=\"S\",$C52=0),0,MATCH(0,OFFSET($D52,1,$C52,ROW($C$830)-ROW($C52)),0))","v":3},{"$f":"IF(OR($C52=\"S\",$C52=0),0,MATCH(OFFSET($D52,0,$C52)+1,OFFSET($D52,1,$C52,ROW($C$830)-ROW($C52)),0))","v":{"$error":"#N/A"}},"","Nível 3","Nível 3","-","SINAPI",null,"OUTROS","-",null,1,"-",null,null,0,0,""]
["S",3,"S",0,1,1,13,0,0,0,0,"","Serviço","Serviço","-","AGETOP",20190,"LIMPEZA MECANICA DE TERRENO","m2    ",366.11,1,366.11,null,null,0,0,""]
["S",3,"S",0,1,1,13,0,0,0,0,"","Serviço","Serviço","-","SINAPI","74209/1","PLACA DE OBRA EM CHAPA DE ACO GALVANIZADO","M2",7.5,1,7.5,null,null,0,0,"Referência: AGETOP - 21301"]
[2,2,2,3,1,2,0,0,0,432,3,"","Nível 2","Nível 2","-","AGETOP",null,"TRANSPORTES","-",null,1,"-",null,null,0,0,""]
["S",2,"S",0,1,2,0,0,0,0,0,"","Serviço","Serviço","-","SINAPI",72900,"TRANSPORTE DE ENTULHO COM CAMINHAO BASCULANTE 6 M3, RODOVIA PAVIMENTADA, DMT 0,5 A 1,0 KM","M3",40.42,1,40.42,null,null,0,0,""]
["S",2,"S",0,1,2,0,0,0,0,0,"","Serviço","Serviço","-","SINAPI",72897,"CARGA MANUAL DE ENTULHO EM CAMINHAO BASCULANTE 6 M3","M3",40.42,1,40.42,null,null,0,0,""]
[2,2,2,32,1,3,0,0,0,429,32,"","Nível 2","Nível 2","-","AGETOP",null,"SERVIÇO EM TERRA","-",null,1,"-",null,null,0,0,""]
[3,3,3,8,1,3,1,0,0,31,8,"","Nível 3","Nível 3","-","SINAPI",null,"VESTIÁRIO","-",null,1,"-",null,null,0,0,""]
["S",3,"S",0,1,3,1,0,0,0,0,"","Serviço","Serviço","-","SINAPI",79480,"ESCAVACAO MECANICA CAMPO ABERTO EM SOLO EXCETO ROCHA ATE 2,00M PROFUNDIDADE","M3",10.35,1,10.35,null,null,0,0,"Referência: AGETOP - 41004"]
["S",3,"S",0,1,3,1,0,0,0,0,"","Serviço","Serviço","-","SINAPI",72898,"CARGA E DESCARGA MECANIZADAS DE ENTULHO EM CAMINHAO BASCULANTE 6 M3","M3",10.35,1,10.35,null,null,0,0,"Referência: AGETOP - 41005"]
["S",3,"S",0,1,3,1,0,0,0,0,"","Serviço","Serviço","-","AGETOP",41012,"INDENIZAÇÃO DE JAZIDA","m3    ",10.35,1,10.35,null,null,0,0,""]
["S",3,"S",0,1,3,1,0,0,0,0,"","Serviço","Serviço","-","AGETOP",41006,"TRANSPORTE DE MATERIAL ESCAVADO M3.KM","m3km  ",103.5,1,103.5,null,null,0,0,""]
["S",3,"S",0,1,3,1,0,0,0,0,"","Serviço","Serviço","-","SINAPI","74005/2","COMPACTACAO MECANICA C/ CONTROLE DO GC>=95% DO PN (AREAS) (C/MONIVELADORA 140 HP E ROLO COMPRESSOR VIBRATORIO 80 HP)","M3",8.2799999999999994,1,8.2799999999999994,null,null,0,0,"Referência: AGETOP - 41008"]
["S",3,"S",0,1,3,1,0,0,0,0,"","Serviço","Serviço","-","AGETOP",41140,"REGULARIZAÇÃO DO TERRENO SEM APILOAMENTO COM TRANSPORTE MANUAL DA TERRA ESCAVADA ","m2    ",55.24,1,55.24,null,null,0,0,""]
["S",3,"S",0,1,3,1,0,0,0,0,"","Serviço","Serviço","-","AGETOP",41002,"APILOAMENTO","m2    ",55.24,1,55.24,null,null,0,0,""]
[3,3,3,8,1,3,2,0,0,23,8,"","Nível 3","Nível 3","-","SINAPI",null,"PÁTIO MULTIUSO","-",null,1,"-",null,null,0,0,""]
["S",3,"S",0,1,3,2,0,0,0,0,"","Serviço","Serviço","-","SINAPI",79480,"ESCAVACAO MECANICA CAMPO ABERTO EM SOLO EXCETO ROCHA ATE 2,00M PROFUNDIDADE","M3",32.979999999999997,1,32.979999999999997,null,null,0,0,"Referência: AGETOP - 41004"]
["S",3,"S",0,1,3,2,0,0,0,0,"","Serviço","Serviço","-","SINAPI",72898,"CARGA E DESCARGA MECANIZADAS DE ENTULHO EM CAMINHAO BASCULANTE 6 M3","M3",32.979999999999997,1,32.979999999999997,null,null,0,0,"Referência: AGETOP - 41005"]
["S",3,"S",0,1,3,2,0,0,0,0,"","Serviço","Serviço","-","AGETOP",41012,"INDENIZAÇÃO DE JAZIDA","m3    ",32.979999999999997,1,32.979999999999997,null,null,0,0,""]
["S",3,"S",0,1,3,2,0,0,0,0,"","Serviço","Serviço","-","AGETOP",41006,"TRANSPORTE DE MATERIAL ESCAVADO M3.KM","m3km  ",329.79999999999995,1,329.79999999999995,null,null,0,0,""]
["S",3,"S",0,1,3,2,0,0,0,0,"","Serviço","Serviço","-","SINAPI","74005/2","COMPACTACAO MECANICA C/ CONTROLE DO GC>=95% DO PN (AREAS) (C/MONIVELADORA 140 HP E ROLO COMPRESSOR VIBRATORIO 80 HP)","M3",26.39,1,26.39,null,null,0,0,"Referência: AGETOP - 41008"]
["S",3,"S",0,1,3,2,0,0,0,0,"","Serviço","Serviço","-","AGETOP",41140,"REGULARIZAÇÃO DO TERRENO SEM APILOAMENTO COM TRANSPORTE MANUAL DA TERRA ESCAVADA ","m2    ",133.97999999999999,1,133.97999999999999,null,null,0,0,""]
["S",3,"S",0,1,3,2,0,0,0,0,"","Serviço","Serviço","-","AGETOP",41002,"APILOAMENTO","m2    ",133.97999999999999,1,133.97999999999999,null,null,0,0,""]
[3,3,3,3,1,3,3,0,0,15,3,"","Nível 3","Nível 3","-","SINAPI",null,"PASSARELAS","-",null,1,"-",null,null,0,0,""]
["S",3,"S",0,1,3,3,0,0,0,0,"","Serviço","Serviço","-","AGETOP",41140,"REGULARIZAÇÃO DO TERRENO SEM APILOAMENTO COM TRANSPORTE MANUAL DA TERRA ESCAVADA ","m2    ",20.16,1,20.16,null,null,0,0,""]
["S",3,"S",0,1,3,3,0,0,0,0,"","Serviço","Serviço","-","AGETOP",41002,"APILOAMENTO","m2    ",20.16,1,20.16,null,null,0,0,""]
[3,3,3,3,1,3,4,0,0,12,3,"","Nível 3","Nível 3","-","SINAPI",null,"PASSEIO","-",null,1,"-",null,null,0,0,""]
["S",3,"S",0,1,3,4,0,0,0,0,"","Serviço","Serviço","-","AGETOP",41140,"REGULARIZAÇÃO DO TERRENO SEM APILOAMENTO COM TRANSPORTE MANUAL DA TERRA ESCAVADA ","m2    ",366.11,1,366.11,null,null,0,0,""]
["S",3,"S",0,1,3,4,0,0,0,0,"","Serviço","Serviço","-","AGETOP",41002,"APILOAMENTO","m2    ",366.11,1,366.11,null,null,0,0,""]
[3,3,3,3,1,3,5,0,0,9,3,"","Nível 3","Nível 3","-","SINAPI",null,"CENTRAL DE GÁS","-",null,1,"-",null,null,0,0,""]
["S",3,"S",0,1,3,5,0,0,0,0,"","Serviço","Serviço","-","SINAPI",93358,"ESCAVAÇÃO MANUAL DE VALA COM PROFUNDIDADE MENOR OU IGUAL A 1,30 M. AF_03/2016","M3",0.6,1,0.6,null,null,0,0,"Referência: AGETOP - 40101"]
["S",3,"S",0,1,3,5,0,0,0,0,"","Serviço","Serviço","-","SINAPI",96995,"REATERRO MANUAL APILOADO COM SOQUETE. AF_10/2017","M3",0.6,1,0.6,null,null,0,0,"Referência: AGETOP - 40902"]
[3,3,3,3,1,3,6,0,0,6,3,"","Nível 3","Nível 3","-","SINAPI",null,"COMBATE À INCÊNDIO","-",null,1,"-",null,null,0,0,""]
["S",3,"S",0,1,3,6,0,0,0,0,"","Serviço","Serviço","-","SINAPI",93358,"ESCAVAÇÃO MANUAL DE VALA COM PROFUNDIDADE MENOR OU IGUAL A 1,30 M. AF_03/2016","M3",10.54,1,10.54,null,null,0,0,"Referência: AGETOP - 40101"]
["S",3,"S",0,{"$f":"IF($C86=1,OFFSET(E86,-1,0)+1,OFFSET(E86,-1,0))","v":1},{"$f":"IF($C86=1,0,IF($C86=2,OFFSET(F86,-1,0)+1,OFFSET(F86,-1,0)))","v":3},{"$f":"IF(AND($C86<=2,$C86<>0),0,IF($C86=3,OFFSET(G86,-1,0)+1,OFFSET(G86,-1,0)))","v":6},{"$f":"IF(AND($C86<=3,$C86<>0),0,IF($C86=4,OFFSET(H86,-1,0)+1,OFFSET(H86,-1,0)))","v":0},0,0,0,"","Serviço","Serviço","-","SINAPI",96995,"REATERRO MANUAL APILOADO COM SOQUETE. AF_10/2017","M3",10.54,1,10.54,null,null,0,0,"Referência: AGETOP - 40902"]
[3,3,3,3,1,3,7,0,0,{"$f":"IF(OR($C87=\"S\",$C87=0),0,MATCH(0,OFFSET($D87,1,$C87,ROW($C$830)-ROW($C87)),0))","v":3},{"$f":"IF(OR($C87=\"S\",$C87=0),0,MATCH(OFFSET($D87,0,$C87)+1,OFFSET($D87,1,$C87,ROW($C$830)-ROW($C87)),0))","v":383},"","Nível 3","Nível 3","-","SINAPI",null,"INST. ELÉTRICAS","-",null,1,"-",null,null,0,0,""]
["S",3,"S",0,1,3,7,0,0,0,0,"","Serviço","Serviço","-","SINAPI",93358,"ESCAVAÇÃO MANUAL DE VALA COM PROFUNDIDADE MENOR OU IGUAL A 1,30 M. AF_03/2016","M3",14.77,1,14.77,null,null,0,0,"Referência: AGETOP - 40101"]
["S",3,"S",0,1,3,7,0,0,0,0,"","Serviço","Serviço","-","SINAPI",96995,"REATERRO MANUAL APILOADO COM SOQUETE. AF_10/2017","M3",14.77,1,14.77,null,null,0,0,"Referência: AGETOP - 40902"]
[{"$f":"CHOOSE(1+LOG(1+2*(ORÇAMENTO.Nivel=\"Nível 1\")+4*(ORÇAMENTO.Nivel=\"Nível 2\")+8*(ORÇAMENTO.Nivel=\"Nível 3\")+16*(ORÇAMENTO.Nivel=\"Nível 4\")+32*(ORÇAMENTO.Nivel=\"Serviço\"),2),0,1,2,3,4,\"S\")","v":2},{"$f":"IF(OR(C90=\"s\",C90=0),OFFSET(B90,-1,0),C90)","v":2},{"$f":"IF(OFFSET(C90,-1,0)=\"L\",1,IF(OFFSET(C90,-1,0)=1,2,IF(OR(A90=\"s\",A90=0),\"S\",IF(AND(OFFSET(C90,-1,0)=2,A90=4),3,IF(AND(OR(OFFSET(C90,-1,0)=\"s\",OFFSET(C90,-1,0)=0),A90<>\"s\",A90>OFFSET(B90,-1,0)),OFFSET(B90,-1,0),A90)))))","v":2},{"$f":"IF(OR(C90=\"S\",C90=0),0,IF(ISERROR(K90),J90,SMALL(J90:K90,1)))","v":19},{"$f":"IF($C90=1,OFFSET(E90,-1,0)+1,OFFSET(E90,-1,0))","v":1},{"$f":"IF($C90=1,0,IF($C90=2,OFFSET(F90,-1,0)+1,OFFSET(F90,-1,0)))","v":4},{"$f":"IF(AND($C90<=2,$C90<>0),0,IF($C90=3,OFFSET(G90,-1,0)+1,OFFSET(G90,-1,0)))","v":0},{"$f":"IF(AND($C90<=3,$C90<>0),0,IF($C90=4,OFFSET(H90,-1,0)+1,OFFSET(H90,-1,0)))","v":0},{"$f":"IF(AND($C90<=4,$C90<>0),0,IF(AND($C90=\"S\",$Y90>0),OFFSET(I90,-1,0)+1,OFFSET(I90,-1,0)))","v":0},{"$f":"IF(OR($C90=\"S\",$C90=0),0,MATCH(0,OFFSET($D90,1,$C90,ROW($C$830)-ROW($C90)),0))","v":397},{"$f":"IF(OR($C90=\"S\",$C90=0),0,MATCH(OFFSET($D90,0,$C90)+1,OFFSET($D90,1,$C90,ROW($C$830)-ROW($C90)),0))","v":19},"","Nível 2","Nível 2","-","AGETOP",null,"FUNDAÇÕES E SONDAGENS","-",null,1,"-",null,null,0,0,""]
[3,3,3,4,1,4,1,0,0,18,4,"","Nível 3","Nível 3","-","SINAPI",null,"ESTACAS","-",null,1,"-",null,null,0,0,""]
["S",3,"S",0,1,4,1,0,0,0,0,"","Serviço","Serviço","-","SINAPI",98230,"ESTACA BROCA DE CONCRETO, DIÂMETRO DE 30 CM, PROFUNDIDADE DE ATÉ 3 M, ESCAVAÇÃO MANUAL COM TRADO CONCHA, NÃO ARMADA. AF_03/2018","M",10,1,10,null,null,0,0,"Referência: AGETOP - 50302"]
["S",3,"S",0,1,4,1,0,0,0,0,"","Serviço","Serviço","-","SINAPI",95577,"MONTAGEM DE ARMADURA LONGITUDINAL DE ESTACAS DE SEÇÃO CIRCULAR, DIÂMETRO = 10,0 MM. AF_11/2016","KG",30,1,30,null,null,0,0,"Referência: AGETOP - 52005"]
["S",3,"S",0,1,4,1,0,0,0,0,"","Serviço","Serviço","-","SINAPI",95583,"MONTAGEM DE ARMADURA TRANSVERSAL DE ESTACAS DE SEÇÃO CIRCULAR, DIÂMETRO = 5,0 MM. AF_11/2016","KG",9.7200000000000006,1,9.7200000000000006,null,null,0,0,"Referência: AGETOP - 52014"]
[3,3,3,6,1,4,2,0,0,14,6,"","Nível 3","Nível 3","-","SINAPI",null,"BLOCO","-",null,1,"-",null,null,0,0,""]
["S",3,"S",0,1,4,2,0,{"$f":"IF(AND($C96<=4,$C96<>0),0,IF(AND($C96=\"S\",$Y96>0),OFFSET(I96,-1,0)+1,OFFSET(I96,-1,0)))","v":0},0,0,"","Serviço","Serviço","-","SINAPI",96522,"ESCAVAÇÃO MANUAL PARA BLOCO DE COROAMENTO OU SAPATA, SEM PREVISÃO DE FÔRMA. AF_06/2017","M3",0.75,1,0.75,null,null,0,0,"Referência: AGETOP - 50901"]
["S",3,"S",0,1,4,2,0,0,0,0,"","Serviço","Serviço","-","AGETOP",50902,"APILOAMENTO (BLOCOS/SAPATAS)","m2    ",1.44,1,1.44,null,null,0,0,""]
["S",3,"S",0,1,4,2,0,0,0,0,"","Serviço","Serviço","-","SINAPI",94965,"CONCRETO FCK = 25MPA, TRAÇO 1:2,3:2,7 (CIMENTO/ AREIA MÉDIA/ BRITA 1)  - PREPARO MECÂNICO COM BETONEIRA 400 L. AF_07/2016","M3",0.75,1,0.75,null,null,0,0,""]
["S",3,"S",0,1,4,2,0,0,0,0,"","Serviço","Serviço","-","SINAPI","74157/4","LANCAMENTO/APLICACAO MANUAL DE CONCRETO EM FUNDACOES","M3",0.75,1,0.75,null,null,0,0,"Referência: AGETOP - 51026"]
["S",3,"S",0,1,4,2,0,0,0,0,"","Serviço","Serviço","-","SINAPI",96543,"ARMAÇÃO DE BLOCO, VIGA BALDRAME E SAPATA UTILIZANDO AÇO CA-60 DE 5 MM - MONTAGEM. AF_06/2017","KG",9.27,1,9.27,null,null,0,0,"Referência: AGETOP - 52014"]
[3,3,3,8,1,4,3,0,0,8,237,"","Nível 3","Nível 3","-","SINAPI",null,"VIGAS BALDRAMES","-",null,1,"-",null,null,0,0,""]
["S",3,"S",0,1,4,3,0,0,0,0,"","Serviço","Serviço","-","SINAPI",96527,"ESCAVAÇÃO MANUAL DE VALA PARA VIGA BALDRAME, COM PREVISÃO DE FÔRMA. AF_06/2017","M3",0.6,1,0.6,null,null,0,0,"Referência: AGETOP - 40101"]
["S",3,"S",0,1,4,3,0,0,0,0,"","Serviço","Serviço","-","SINAPI",96995,"REATERRO MANUAL APILOADO COM SOQUETE. AF_10/2017","M3",0.25999999999999995,1,0.25999999999999995,null,null,0,0,"Referência: AGETOP - 40902"]
["S",3,"S",0,1,4,3,0,0,0,0,"","Serviço","Serviço","-","AGETOP",60191,"FORMA DE TABUA CINTA BALDRAME U=8 VEZES","m2    ",5.67,1,5.67,null,null,0,0,""]
["S",3,"S",0,1,4,3,0,0,0,0,"","Serviço","Serviço","-","SINAPI",94965,"CONCRETO FCK = 25MPA, TRAÇO 1:2,3:2,7 (CIMENTO/ AREIA MÉDIA/ BRITA 1)  - PREPARO MECÂNICO COM BETONEIRA 400 L. AF_07/2016","M3",0.34,1,0.34,null,null,0,0,""]
["S",3,"S",0,1,4,3,0,0,0,0,"","Serviço","Serviço","-","SINAPI","74157/4","LANCAMENTO/APLICACAO MANUAL DE CONCRETO EM FUNDACOES","M3",0.34,1,0.34,null,null,0,0,"Referência: AGETOP - 51026"]
["S",3,"S",0,1,4,3,0,0,0,0,"","Serviço","Serviço","-","SINAPI",96545,"ARMAÇÃO DE BLOCO, VIGA BALDRAME OU SAPATA UTILIZANDO AÇO CA-50 DE 8 MM - MONTAGEM. AF_06/2017","KG",12.09,1,12.09,null,null,0,0,"Referência: AGETOP - 52004"]
["S",3,"S",0,1,4,3,0,0,0,0,"","Serviço","Serviço","-","SINAPI",96543,"ARMAÇÃO DE BLOCO, VIGA BALDRAME E SAPATA UTILIZANDO AÇO CA-60 DE 5 MM - MONTAGEM. AF_06/2017","KG",4.72,1,4.72,null,null,0,0,"Referência: AGETOP - 52014"]
[2,2,2,16,1,5,0,0,0,378,16,"","Nível 2","Nível 2","-","AGETOP",null,"ESTRUTURA","-",null,1,"-",null,null,0,0,""]
[3,3,3,6,1,5,1,0,0,15,6,"","Nível 3","Nível 3","-","SINAPI",null,"PILARES","-",null,1,"-",null,null,0,0,""]
["S",3,"S",0,1,5,1,0,0,0,0,"","Serviço","Serviço","-","SINAPI",92426,"MONTAGEM E DESMONTAGEM DE FÔRMA DE PILARES RETANGULARES E ESTRUTURAS SIMILARES COM ÁREA MÉDIA DAS SEÇÕES MENOR OU IGUAL A 0,25 M², PÉ-DIREITO SIMPLES, EM CHAPA DE MADEIRA COMPENSADA RESINADA, 8 UTILIZAÇÕES. AF_12/2015","M2",26.57,1,26.57,null,null,0,0,""]
["S",3,"S",0,1,5,1,0,0,0,0,"","Serviço","Serviço","-","SINAPI",94965,"CONCRETO FCK = 25MPA, TRAÇO 1:2,3:2,7 (CIMENTO/ AREIA MÉDIA/ BRITA 1)  - PREPARO MECÂNICO COM BETONEIRA 400 L. AF_07/2016","M3",1.33,1,1.33,null,null,0,0,""]
["S",3,"S",0,1,5,1,0,0,0,0,"","Serviço","Serviço","-","SINAPI",92873,"LANÇAMENTO COM USO DE BALDES, ADENSAMENTO E ACABAMENTO DE CONCRETO EM ESTRUTURAS. AF_12/2015","M3",1.33,1,1.33,null,null,0,0,"Referência: AGETOP - 60801"]
["S",3,"S",0,1,5,1,0,0,0,0,"","Serviço","Serviço","-","SINAPI",92778,"ARMAÇÃO DE PILAR OU VIGA DE UMA ESTRUTURA CONVENCIONAL DE CONCRETO ARMADO EM UMA EDIFICAÇÃO TÉRREA OU SOBRADO UTILIZANDO AÇO CA-50 DE 10,0 MM - MONTAGEM. AF_12/2015","KG",77.63,1,77.63,null,null,0,0,"Referência: AGETOP - 60305"]
["S",3,"S",0,1,5,1,0,0,0,0,"","Serviço","Serviço","-","SINAPI",92775,"ARMAÇÃO DE PILAR OU VIGA DE UMA ESTRUTURA CONVENCIONAL DE CONCRETO ARMADO EM UMA EDIFICAÇÃO TÉRREA OU SOBRADO UTILIZANDO AÇO CA-60 DE 5,0 MM - MONTAGEM. AF_12/2015","KG",31.54,1,31.54,null,null,0,0,"Referência: AGETOP - 60314"]
[3,3,3,6,1,5,2,0,0,9,6,"","Nível 3","Nível 3","-",null,null,"VIGAS DE COBERTURA","-",null,1,"-",null,null,0,0,""]
["S",3,"S",0,1,5,2,0,0,0,0,"","Serviço","Serviço","-","SINAPI",92464,"MONTAGEM E DESMONTAGEM DE FÔRMA DE VIGA, ESCORAMENTO METÁLICO, PÉ-DIREITO SIMPLES, EM CHAPA DE MADEIRA RESINADA, 8 UTILIZAÇÕES. AF_12/2015","M2",11.34,1,11.34,null,null,0,0,"Referência: AGETOP - 60209"]
["S",3,"S",0,1,5,2,0,0,0,0,"","Serviço","Serviço","-","SINAPI",94964,"CONCRETO FCK = 20MPA, TRAÇO 1:2,7:3 (CIMENTO/ AREIA MÉDIA/ BRITA 1)  - PREPARO MECÂNICO COM BETONEIRA 400 L. AF_07/2016","M3",0.68,1,0.68,null,null,0,0,""]
["S",3,"S",0,1,5,2,0,0,0,0,"","Serviço","Serviço","-","SINAPI",92873,"LANÇAMENTO COM USO DE BALDES, ADENSAMENTO E ACABAMENTO DE CONCRETO EM ESTRUTURAS. AF_12/2015","M3",0.68,1,0.68,null,null,0,0,"Referência: AGETOP - 60801"]
["S",3,"S",0,1,5,2,0,0,0,0,"","Serviço","Serviço","-","SINAPI",92777,"ARMAÇÃO DE PILAR OU VIGA DE UMA ESTRUTURA CONVENCIONAL DE CONCRETO ARMADO EM UMA EDIFICAÇÃO TÉRREA OU SOBRADO UTILIZANDO AÇO CA-50 DE 8,0 MM - MONTAGEM. AF_12/2015","KG",24.81,1,24.81,null,null,0,0,"Referência: AGETOP - 60304"]
["S",3,"S",0,1,5,2,0,0,0,0,"","Serviço","Serviço","-","SINAPI",92775,"ARMAÇÃO DE PILAR OU VIGA DE UMA ESTRUTURA CONVENCIONAL DE CONCRETO ARMADO EM UMA EDIFICAÇÃO TÉRREA OU SOBRADO UTILIZANDO AÇO CA-60 DE 5,0 MM - MONTAGEM. AF_12/2015","KG",9.4499999999999993,1,9.4499999999999993,null,null,0,0,"Referência: AGETOP - 60314"]
[3,3,3,3,1,5,3,0,0,{"$f":"IF(OR($C122=\"S\",$C122=0),0,MATCH(0,OFFSET($D122,1,$C122,ROW($C$830)-ROW($C122)),0))","v":3},{"$f":"IF(OR($C122=\"S\",$C122=0),0,MATCH(OFFSET($D122,0,$C122)+1,OFFSET($D122,1,$C122,ROW($C$830)-ROW($C122)),0))","v":216},"","Nível 3","Nível 3","-",null,null,"LAJE","-",null,1,"-",null,null,0,0,""]
["S",3,"S",0,1,5,3,0,0,0,0,"","Serviço","Serviço","-","SINAPI",92267,"FABRICAÇÃO DE FÔRMA PARA LAJES, EM CHAPA DE MADEIRA COMPENSADA RESINADA, E = 17 MM. AF_12/2015","M2",2.57,1,2.57,null,null,0,0,""]
["S",3,"S",0,1,5,3,0,0,0,0,"","Serviço","Serviço","-","SINAPI",92784,"ARMAÇÃO DE LAJE DE UMA ESTRUTURA CONVENCIONAL DE CONCRETO ARMADO EM UMA EDIFICAÇÃO TÉRREA OU SOBRADO UTILIZANDO AÇO CA-60 DE 5,0 MM - MONTAGEM. AF_12/2015","KG",5.63,1,5.63,null,null,0,0,"Referência: AGETOP - 60314"]
[{"$f":"CHOOSE(1+LOG(1+2*(ORÇAMENTO.Nivel=\"Nível 1\")+4*(ORÇAMENTO.Nivel=\"Nível 2\")+8*(ORÇAMENTO.Nivel=\"Nível 3\")+16*(ORÇAMENTO.Nivel=\"Nível 4\")+32*(ORÇAMENTO.Nivel=\"Serviço\"),2),0,1,2,3,4,\"S\")","v":2},{"$f":"IF(OR(C125=\"s\",C125=0),OFFSET(B125,-1,0),C125)","v":2},{"$f":"IF(OFFSET(C125,-1,0)=\"L\",1,IF(OFFSET(C125,-1,0)=1,2,IF(OR(A125=\"s\",A125=0),\"S\",IF(AND(OFFSET(C125,-1,0)=2,A125=4),3,IF(AND(OR(OFFSET(C125,-1,0)=\"s\",OFFSET(C125,-1,0)=0),A125<>\"s\",A125>OFFSET(B125,-1,0)),OFFSET(B125,-1,0),A125)))))","v":2},{"$f":"IF(OR(C125=\"S\",C125=0),0,IF(ISERROR(K125),J125,SMALL(J125:K125,1)))","v":158},{"$f":"IF($C125=1,OFFSET(E125,-1,0)+1,OFFSET(E125,-1,0))","v":1},{"$f":"IF($C125=1,0,IF($C125=2,OFFSET(F125,-1,0)+1,OFFSET(F125,-1,0)))","v":6},{"$f":"IF(AND($C125<=2,$C125<>0),0,IF($C125=3,OFFSET(G125,-1,0)+1,OFFSET(G125,-1,0)))","v":0},{"$f":"IF(AND($C125<=3,$C125<>0),0,IF($C125=4,OFFSET(H125,-1,0)+1,OFFSET(H125,-1,0)))","v":0},{"$f":"IF(AND($C125<=4,$C125<>0),0,IF(AND($C125=\"S\",$Y125>0),OFFSET(I125,-1,0)+1,OFFSET(I125,-1,0)))","v":0},362,158,"","Nível 2","Nível 2","-",null,null,"INSTALAÇÕES ELÉTRICAS","-",null,1,"-",null,null,0,0,""]
[3,3,3,62,1,6,1,0,0,157,62,"","Nível 3","Nível 3","-","SINAPI",null,"REFORMA","-",null,1,"-",null,null,0,0,""]
["S",3,"S",0,1,6,1,0,0,0,0,"","Serviço","Serviço","-","SINAPI","74131/4","QUADRO DE DISTRIBUICAO DE ENERGIA DE EMBUTIR, EM CHAPA METALICA, PARA 18 DISJUNTORES TERMOMAGNETICOS MONOPOLARES, COM BARRAMENTO TRIFASICO E NEUTRO, FORNECIMENTO E INSTALACAO","UN",3,1,3,null,null,0,0,""]
["S",3,"S",0,1,6,1,0,0,0,0,"","Serviço","Serviço","-","SINAPI","74131/5","QUADRO DE DISTRIBUICAO DE ENERGIA DE EMBUTIR, EM CHAPA METALICA, PARA 24 DISJUNTORES TERMOMAGNETICOS MONOPOLARES, COM BARRAMENTO TRIFASICO E NEUTRO, FORNECIMENTO E INSTALACAO","UN",2,1,2,null,null,0,0,""]
["S",3,"S",0,1,6,1,0,0,0,0,"","Serviço","Serviço","-","SINAPI",93673,"DISJUNTOR TRIPOLAR TIPO DIN, CORRENTE NOMINAL DE 50A - FORNECIMENTO E INSTALAÇÃO. AF_04/2016","UN",1,1,1,null,null,0,0,"Referência: AGETOP - 71174"]
["S",3,"S",0,1,6,1,0,0,0,0,"","Serviço","Serviço","-","SINAPI",93669,"DISJUNTOR TRIPOLAR TIPO DIN, CORRENTE NOMINAL DE 20A - FORNECIMENTO E INSTALAÇÃO. AF_04/2016","UN",1,1,1,null,null,0,0,""]
["S",3,"S",0,1,6,1,0,0,0,0,"","Serviço","Serviço","-","SINAPI",93671,"DISJUNTOR TRIPOLAR TIPO DIN, CORRENTE NOMINAL DE 32A - FORNECIMENTO E INSTALAÇÃO. AF_04/2016","UN",4,1,4,null,null,0,0,"Referência: AGETOP - 71173"]
["S",3,"S",0,1,6,1,0,0,0,0,"","Serviço","Serviço","-","AGETOP",71175,"DISJUNTOR TRIPOLAR DE 60 A 100-A","Un    ",2,1,2,null,null,0,0,""]
["S",3,"S",0,1,6,1,0,0,0,0,"","Serviço","Serviço","-","SINAPI",93656,"DISJUNTOR MONOPOLAR TIPO DIN, CORRENTE NOMINAL DE 25A - FORNECIMENTO E INSTALAÇÃO. AF_04/2016","UN",32,1,32,null,null,0,0,""]
["S",3,"S",0,1,6,1,0,0,0,0,"","Serviço","Serviço","-","SINAPI",93654,"DISJUNTOR MONOPOLAR TIPO DIN, CORRENTE NOMINAL DE 16A - FORNECIMENTO E INSTALAÇÃO. AF_04/2016","UN",16,1,16,null,null,0,0,""]
["S",3,"S",0,1,6,1,0,0,0,0,"","Serviço","Serviço","-","SINAPI",93653,"DISJUNTOR MONOPOLAR TIPO DIN, CORRENTE NOMINAL DE 10A - FORNECIMENTO E INSTALAÇÃO. AF_04/2016","UN",21,1,21,null,null,0,0,""]
["S",3,"S",0,1,6,1,0,0,0,0,"","Serviço","Serviço","-","AGETOP",71456,"INTERRUPTOR DIFERENCIAL RESIDUAL (D.R.) TETRAPOLAR DE 40A-30mA","Un    ",11,1,11,null,null,0,0,""]
["S",3,"S",0,1,6,1,0,0,0,0,"","Serviço","Serviço","-","SINAPI",91926,"CABO DE COBRE FLEXÍVEL ISOLADO, 2,5 MM², ANTI-CHAMA 450/750 V, PARA CIRCUITOS TERMINAIS - FORNECIMENTO E INSTALAÇÃO. AF_12/2015","M",5303.95,1,5303.95,null,null,0,0,"Referência: AGETOP - 70563"]
["S",3,"S",0,1,6,1,0,0,0,0,"","Serviço","Serviço","-","SINAPI",91928,"CABO DE COBRE FLEXÍVEL ISOLADO, 4 MM², ANTI-CHAMA 450/750 V, PARA CIRCUITOS TERMINAIS - FORNECIMENTO E INSTALAÇÃO. AF_12/2015","M",1530,1,1530,null,null,0,0,"Referência: AGETOP - 70564"]
["S",3,"S",0,1,6,1,0,0,0,0,"","Serviço","Serviço","-","SINAPI",91930,"CABO DE COBRE FLEXÍVEL ISOLADO, 6 MM², ANTI-CHAMA 450/750 V, PARA CIRCUITOS TERMINAIS - FORNECIMENTO E INSTALAÇÃO. AF_12/2015","M",1389.3,1,1389.3,null,null,0,0,"Referência: AGETOP - 70565"]
["S",3,"S",0,1,6,1,0,0,0,0,"","Serviço","Serviço","-","SINAPI",92979,"CABO DE COBRE FLEXÍVEL ISOLADO, 10 MM², ANTI-CHAMA 450/750 V, PARA DISTRIBUIÇÃO - FORNECIMENTO E INSTALAÇÃO. AF_12/2015","M",313,1,313,null,null,0,0,""]
["S",3,"S",0,1,6,1,0,0,0,0,"","Serviço","Serviço","-","SINAPI",92981,"CABO DE COBRE FLEXÍVEL ISOLADO, 16 MM², ANTI-CHAMA 450/750 V, PARA DISTRIBUIÇÃO - FORNECIMENTO E INSTALAÇÃO. AF_12/2015","M",631.20000000000005,1,631.20000000000005,null,null,0,0,""]
["S",3,"S",0,1,6,1,0,0,0,0,"","Serviço","Serviço","-","SINAPI",92983,"CABO DE COBRE FLEXÍVEL ISOLADO, 25 MM², ANTI-CHAMA 450/750 V, PARA DISTRIBUIÇÃO - FORNECIMENTO E INSTALAÇÃO. AF_12/2015","M",435.6,1,435.6,null,null,0,0,""]
["S",3,"S",0,1,6,1,0,0,0,0,"","Serviço","Serviço","-","SINAPI",92986,"CABO DE COBRE FLEXÍVEL ISOLADO, 35 MM², ANTI-CHAMA 0,6/1,0 KV, PARA DISTRIBUIÇÃO - FORNECIMENTO E INSTALAÇÃO. AF_12/2015","M",60,1,60,null,null,0,0,"Referência: AGETOP - 70512"]
["S",3,"S",0,1,6,1,0,0,0,0,"","Serviço","Serviço","-","AGETOP",70541,"CABO DE COBRE NU No. 16 MM2 (6,94 M/KG)","M     ",50,1,50,null,null,0,0,""]
["S",3,"S",0,1,6,1,0,0,0,0,"","Serviço","Serviço","-","AGETOP",70544,"CABO DE COBRE NÚ No. 50 MM2","M     ",100,1,100,null,null,0,0,""]
["S",3,"S",0,1,6,1,0,0,0,0,"","Serviço","Serviço","-","SINAPI",91867,"ELETRODUTO RÍGIDO ROSCÁVEL, PVC, DN 25 MM (3/4\"), PARA CIRCUITOS TERMINAIS, INSTALADO EM LAJE - FORNECIMENTO E INSTALAÇÃO. AF_12/2015","M",2861.85,1,2861.85,null,null,0,0,"Referência: AGETOP - 71201"]
["S",3,"S",0,1,6,1,0,0,0,0,"","Serviço","Serviço","-","SINAPI",91868,"ELETRODUTO RÍGIDO ROSCÁVEL, PVC, DN 32 MM (1\"), PARA CIRCUITOS TERMINAIS, INSTALADO EM LAJE - FORNECIMENTO E INSTALAÇÃO. AF_12/2015","M",1187.4000000000001,1,1187.4000000000001,null,null,0,0,"Referência: AGETOP - 71202"]
["S",3,"S",0,1,6,1,0,0,0,0,"","Serviço","Serviço","-","SINAPI",93008,"ELETRODUTO RÍGIDO ROSCÁVEL, PVC, DN 50 MM (1 1/2\") - FORNECIMENTO E INSTALAÇÃO. AF_12/2015","M",204.4,1,204.4,null,null,0,0,""]
["S",3,"S",0,1,6,1,0,0,0,0,"","Serviço","Serviço","-","SINAPI",93010,"ELETRODUTO RÍGIDO ROSCÁVEL, PVC, DN 75 MM (2 1/2\") - FORNECIMENTO E INSTALAÇÃO. AF_12/2015","M",20,1,20,null,null,0,0,""]
["S",3,"S",0,1,6,1,0,0,0,0,"","Serviço","Serviço","-","SINAPI",91865,"ELETRODUTO RÍGIDO ROSCÁVEL, PVC, DN 40 MM (1 1/4\"), PARA CIRCUITOS TERMINAIS, INSTALADO EM FORRO - FORNECIMENTO E INSTALAÇÃO. AF_12/2015","M",77.7,1,77.7,null,null,0,0,""]
["S",3,"S",0,1,6,1,0,0,0,0,"","Serviço","Serviço","-","SINAPI",93009,"ELETRODUTO RÍGIDO ROSCÁVEL, PVC, DN 60 MM (2\") - FORNECIMENTO E INSTALAÇÃO. AF_12/2015","M",149.80000000000001,1,149.80000000000001,null,null,0,0,""]
["S",3,"S",0,1,6,1,0,0,0,0,"","Serviço","Serviço","-","AGETOP",70351,"BRACADEIRA METALICA TIPO \"U\" DIAM. 3/4\"","Un    ",900,1,900,null,null,0,0,""]
["S",3,"S",0,1,6,1,0,0,0,0,"","Serviço","Serviço","-","AGETOP",70352,"BRACADEIRA METALICA TIPO \"U\" DIAM. 1\"","Un    ",395,1,395,null,null,0,0,""]
["S",3,"S",0,1,6,1,0,0,{"$f":"IF(OR($C154=\"S\",$C154=0),0,MATCH(0,OFFSET($D154,1,$C154,ROW($C$830)-ROW($C154)),0))","v":0},{"$f":"IF(OR($C154=\"S\",$C154=0),0,MATCH(OFFSET($D154,0,$C154)+1,OFFSET($D154,1,$C154,ROW($C$830)-ROW($C154)),0))","v":0},"","Serviço","Serviço","-","AGETOP",70354,"BRACADEIRA METALICA TIPO \"U\" DIAM. 1.1/2\"","Un    ",69,1,69,null,null,0,0,""]
["S",3,"S",0,1,6,1,0,0,0,0,"","Serviço","Serviço","-","AGETOP",70353,"BRACADEIRA METALICA TIPO \"U\" DIAM. 1.1/4\"","Un    ",26,1,26,null,null,0,0,""]
["S",3,"S",0,1,6,1,0,0,0,0,"","Serviço","Serviço","-","AGETOP",70355,"BRACADEIRA METALICA TIPO \"U\" DIAM. 2\"","Un    ",50,1,50,null,null,0,0,""]
["S",3,"S",0,1,6,1,0,0,0,0,"","Serviço","Serviço","-","SINAPI",91879,"LUVA PARA ELETRODUTO, PVC, ROSCÁVEL, DN 25 MM (3/4\"), PARA CIRCUITOS TERMINAIS, INSTALADA EM LAJE - FORNECIMENTO E INSTALAÇÃO. AF_12/2015","UN",900,1,900,null,null,0,0,"Referência: AGETOP - 71741"]
["S",3,"S",0,1,6,1,0,0,0,0,"","Serviço","Serviço","-","SINAPI",91880,"LUVA PARA ELETRODUTO, PVC, ROSCÁVEL, DN 32 MM (1\"), PARA CIRCUITOS TERMINAIS, INSTALADA EM LAJE - FORNECIMENTO E INSTALAÇÃO. AF_12/2015","UN",395,1,395,null,null,0,0,"Referência: AGETOP - 71742"]
["S",3,"S",0,1,6,1,0,0,0,0,"","Serviço","Serviço","-","SINAPI",93013,"LUVA PARA ELETRODUTO, PVC, ROSCÁVEL, DN 50 MM (1 1/2\") - FORNECIMENTO E INSTALAÇÃO. AF_12/2015","UN",69,1,69,null,null,0,0,"Referência: AGETOP - 71744"]
["S",3,"S",0,1,6,1,0,0,0,0,"","Serviço","Serviço","-","SINAPI",91877,"LUVA PARA ELETRODUTO, PVC, ROSCÁVEL, DN 40 MM (1 1/4\"), PARA CIRCUITOS TERMINAIS, INSTALADA EM FORRO - FORNECIMENTO E INSTALAÇÃO. AF_12/2015","UN",26,1,26,null,null,0,0,""]
["S",3,"S",0,1,6,1,0,0,0,0,"","Serviço","Serviço","-","SINAPI",93014,"LUVA PARA ELETRODUTO, PVC, ROSCÁVEL, DN 60 MM (2\") - FORNECIMENTO E INSTALAÇÃO. AF_12/2015","UN",50,1,50,null,null,0,0,"Referência: AGETOP - 71745"]
["S",3,"S",0,1,6,1,0,0,0,0,"","Serviço","Serviço","-","SINAPI",95801,"CONDULETE DE ALUMÍNIO, TIPO X, PARA ELETRODUTO DE AÇO GALVANIZADO DN 20 MM (3/4''), APARENTE - FORNECIMENTO E INSTALAÇÃO. AF_11/2016_P","UN",122,1,122,null,null,0,0,"Referência: AGETOP - 70929"]
["S",3,"S",0,1,6,1,0,0,0,0,"","Serviço","Serviço","-","AGETOP",72385,"TAMPA CEGA PARA CONDULETE DE PVC","Un    ",122,1,122,null,null,0,0,""]
["S",3,"S",0,1,6,1,0,0,0,0,"","Serviço","Serviço","-","SINAPI",91902,"CURVA 90 GRAUS PARA ELETRODUTO, PVC, ROSCÁVEL, DN 25 MM (3/4\"), PARA CIRCUITOS TERMINAIS, INSTALADA EM LAJE - FORNECIMENTO E INSTALAÇÃO. AF_12/2015","UN",100,1,100,null,null,0,0,"Referência: AGETOP - 71141"]
["S",3,"S",0,1,6,1,0,0,0,0,"","Serviço","Serviço","-","SINAPI",91905,"CURVA 90 GRAUS PARA ELETRODUTO, PVC, ROSCÁVEL, DN 32 MM (1\"), PARA CIRCUITOS TERMINAIS, INSTALADA EM LAJE - FORNECIMENTO E INSTALAÇÃO. AF_12/2015","UN",90,1,90,null,null,0,0,"Referência: AGETOP - 71142"]
["S",3,"S",0,1,6,1,0,0,0,0,"","Serviço","Serviço","-","AGETOP",71124,"CURVA 90 GRAUS AÇO ZINCADO DIÂMETRO 1.1/2\"","Un    ",50,1,50,null,null,0,0,""]
["S",3,"S",0,1,6,1,0,0,0,0,"","Serviço","Serviço","-","AGETOP",71123,"CURVA 90 GRAUS AÇO ZINCADO DIÂMETRO 1.1/4\"","Un    ",10,1,10,null,null,0,0,""]
["S",3,"S",0,1,6,1,0,0,0,0,"","Serviço","Serviço","-","AGETOP",71125,"CURVA 90 GRAUS AÇO ZINCADO DIÂMETRO 2\"","Un    ",20,1,20,null,null,0,0,""]
["S",3,"S",0,1,6,1,0,0,0,0,"","Serviço","Serviço","-","SINAPI",92870,"CAIXA RETANGULAR 4\" X 4\" ALTA (2,00 M DO PISO), METÁLICA, INSTALADA EM PAREDE - FORNECIMENTO E INSTALAÇÃO. AF_12/2015","UN",408,1,408,null,null,0,0,""]
["S",3,"S",0,1,6,1,0,0,0,0,"","Serviço","Serviço","-","SINAPI",91953,"INTERRUPTOR SIMPLES (1 MÓDULO), 10A/250V, INCLUINDO SUPORTE E PLACA - FORNECIMENTO E INSTALAÇÃO. AF_12/2015","UN",29,1,29,null,null,0,0,"Referência: AGETOP - 71440"]
["S",3,"S",0,1,6,1,0,0,0,0,"","Serviço","Serviço","-","SINAPI",91959,"INTERRUPTOR SIMPLES (2 MÓDULOS), 10A/250V, INCLUINDO SUPORTE E PLACA - FORNECIMENTO E INSTALAÇÃO. AF_12/2015","UN",21,1,21,null,null,0,0,"Referência: AGETOP - 71441"]
["S",3,"S",0,1,6,1,0,0,0,0,"","Serviço","Serviço","-","SINAPI",92000,"TOMADA BAIXA DE EMBUTIR (1 MÓDULO), 2P+T 10 A, INCLUINDO SUPORTE E PLACA - FORNECIMENTO E INSTALAÇÃO. AF_12/2015","UN",13,1,13,null,null,0,0,"Referência: AGETOP - 72578"]
["S",3,"S",0,1,6,1,0,0,0,0,"","Serviço","Serviço","-","SINAPI",92008,"TOMADA BAIXA DE EMBUTIR (2 MÓDULOS), 2P+T 10 A, INCLUINDO SUPORTE E PLACA - FORNECIMENTO E INSTALAÇÃO. AF_12/2015","UN",4,1,4,null,null,0,0,""]
["S",3,"S",0,1,6,1,0,0,0,0,"","Serviço","Serviço","-","SINAPI",91996,"TOMADA MÉDIA DE EMBUTIR (1 MÓDULO), 2P+T 10 A, INCLUINDO SUPORTE E PLACA - FORNECIMENTO E INSTALAÇÃO. AF_12/2015","UN",5,1,5,null,null,0,0,"Referência: AGETOP - 72578"]
["S",3,"S",0,1,6,1,0,0,0,0,"","Serviço","Serviço","-","SINAPI",92004,"TOMADA MÉDIA DE EMBUTIR (2 MÓDULOS), 2P+T 10 A, INCLUINDO SUPORTE E PLACA - FORNECIMENTO E INSTALAÇÃO. AF_12/2015","UN",6,1,6,null,null,0,0,"Referência: AGETOP - 72578"]
["S",3,"S",0,1,6,1,0,0,0,0,"","Serviço","Serviço","-","SINAPI",91993,"TOMADA ALTA DE EMBUTIR (1 MÓDULO), 2P+T 20 A, INCLUINDO SUPORTE E PLACA - FORNECIMENTO E INSTALAÇÃO. AF_12/2015","UN",31,1,31,null,null,0,0,"Referência: AGETOP - 72585"]
["S",3,"S",0,1,6,1,0,0,0,0,"","Serviço","Serviço","-","SINAPI",91992,"TOMADA ALTA DE EMBUTIR (1 MÓDULO), 2P+T 10 A, INCLUINDO SUPORTE E PLACA - FORNECIMENTO E INSTALAÇÃO. AF_12/2015","UN",6,1,6,null,null,0,0,""]
["S",3,"S",0,1,6,1,0,0,0,0,"","Serviço","Serviço","-","SINAPI",97585,"LUMINÁRIA TIPO CALHA, DE SOBREPOR, COM 2 LÂMPADAS TUBULARES DE 18 W - FORNECIMENTO E INSTALAÇÃO. AF_11/2017","UN",228,1,228,null,null,0,0,""]
["S",3,"S",0,1,6,1,0,0,0,0,"","Serviço","Serviço","-","SINAPI",97593,"LUMINÁRIA TIPO SPOT, DE SOBREPOR, COM 1 LÂMPADA DE 15 W - FORNECIMENTO E INSTALAÇÃO. AF_11/2017","UN",11,1,11,null,null,0,0,"Referência: AGETOP - 71688"]
["S",3,"S",0,1,6,1,0,0,0,0,"","Serviço","Serviço","-","SINAPI",97606,"LUMINÁRIA ARANDELA TIPO MEIA-LUA, PARA 1 LÂMPADA DE 15 W - FORNECIMENTO E INSTALAÇÃO. AF_11/2017","UN",22,1,22,null,null,0,0,""]
["S",3,"S",0,1,6,1,0,0,0,0,"","Serviço","Serviço","-","SINAPI",97610,"LÂMPADA COMPACTA DE LED 10 W, BASE E27 - FORNECIMENTO E INSTALAÇÃO. AF_11/2017","UN",487,1,487,null,null,0,0,""]
["S",3,"S",0,1,6,1,0,0,0,0,"","Serviço","Serviço","-","SINAPI",97889,"CAIXA ENTERRADA ELÉTRICA RETANGULAR, EM ALVENARIA COM TIJOLOS CERÂMICOS MACIÇOS, FUNDO COM BRITA, DIMENSÕES INTERNAS: 0,8X0,8X0,6 M. AF_05/2018","UN",2,1,2,null,null,0,0,""]
["S",3,"S",0,1,6,1,0,0,0,0,"","Serviço","Serviço","-","SINAPI",6171,"TAMPA DE CONCRETO ARMADO 60X60X5CM PARA CAIXA","UN",2,1,2,null,null,0,0,""]
["S",3,"S",0,1,6,1,0,0,0,0,"","Serviço","Serviço","-","SINAPI",92870,"CAIXA RETANGULAR 4\" X 4\" ALTA (2,00 M DO PISO), METÁLICA, INSTALADA EM PAREDE - FORNECIMENTO E INSTALAÇÃO. AF_12/2015","UN",1,1,1,null,null,0,0,""]
["S",3,"S",0,1,6,1,0,0,0,0,"","Serviço","Serviço","-","AGETOP",71861,"PARAFUSO P/BUCHA S-6","Un    ",5760,1,5760,null,null,0,0,""]
["S",3,"S",0,1,6,1,0,0,{"$f":"IF(OR($C186=\"S\",$C186=0),0,MATCH(0,OFFSET($D186,1,$C186,ROW($C$830)-ROW($C186)),0))","v":0},{"$f":"IF(OR($C186=\"S\",$C186=0),0,MATCH(OFFSET($D186,0,$C186)+1,OFFSET($D186,1,$C186,ROW($C$830)-ROW($C186)),0))","v":0},"","Serviço","Serviço","-","AGETOP",70647,"CAIXA DE PASSAGEM METÁLICA DE EMBUTIR 30X30X12 CM","Un    ",7,1,7,null,null,0,0,""]
["S",3,"S",0,1,6,1,0,0,0,0,"","Serviço","Serviço","-","AGETOP",70391,"BUCHA DE NYLON S-6","Un    ",5760,1,5760,null,null,0,0,""]
[3,3,3,20,1,6,2,0,0,95,20,"","Nível 3","Nível 3","-",null,"IMPLANTAÇÃO","AMPLIAÇÃO","-",null,1,"-",null,null,0,0,""]
["S",3,"S",0,1,6,2,0,0,0,0,"","Serviço","Serviço","-","SINAPI",93671,"DISJUNTOR TRIPOLAR TIPO DIN, CORRENTE NOMINAL DE 32A - FORNECIMENTO E INSTALAÇÃO. AF_04/2016","UN",1,1,1,null,null,0,0,"Referência: AGETOP - 71173"]
["S",3,"S",0,1,6,2,0,0,0,0,"","Serviço","Serviço","-","SINAPI",93672,"DISJUNTOR TRIPOLAR TIPO DIN, CORRENTE NOMINAL DE 40A - FORNECIMENTO E INSTALAÇÃO. AF_04/2016","UN",1,1,1,null,null,0,0,"Referência: AGETOP - 71174"]
["S",3,"S",0,1,6,2,0,0,0,0,"","Serviço","Serviço","-","SINAPI",91930,"CABO DE COBRE FLEXÍVEL ISOLADO, 6 MM², ANTI-CHAMA 450/750 V, PARA CIRCUITOS TERMINAIS - FORNECIMENTO E INSTALAÇÃO. AF_12/2015","M",621,1,621,null,null,0,0,"Referência: AGETOP - 70565"]
["S",3,"S",0,1,6,2,0,0,0,0,"","Serviço","Serviço","-","SINAPI",92979,"CABO DE COBRE FLEXÍVEL ISOLADO, 10 MM², ANTI-CHAMA 450/750 V, PARA DISTRIBUIÇÃO - FORNECIMENTO E INSTALAÇÃO. AF_12/2015","M",412,1,412,null,null,0,0,""]
["S",3,"S",0,1,6,2,0,0,0,0,"","Serviço","Serviço","-","SINAPI",91872,"ELETRODUTO RÍGIDO ROSCÁVEL, PVC, DN 32 MM (1\"), PARA CIRCUITOS TERMINAIS, INSTALADO EM PAREDE - FORNECIMENTO E INSTALAÇÃO. AF_12/2015","M",87,1,87,null,null,0,0,"Referência: AGETOP - 71202"]
["S",3,"S",0,1,6,2,0,0,0,0,"","Serviço","Serviço","-","SINAPI",93008,"ELETRODUTO RÍGIDO ROSCÁVEL, PVC, DN 50 MM (1 1/2\") - FORNECIMENTO E INSTALAÇÃO. AF_12/2015","M",48,1,48,null,null,0,0,""]
["S",3,"S",0,1,6,2,0,0,0,0,"","Serviço","Serviço","-","SINAPI",93009,"ELETRODUTO RÍGIDO ROSCÁVEL, PVC, DN 60 MM (2\") - FORNECIMENTO E INSTALAÇÃO. AF_12/2015","M",81,1,81,null,null,0,0,""]
["S",3,"S",0,1,6,2,0,0,0,0,"","Serviço","Serviço","-","AGETOP",70352,"BRACADEIRA METALICA TIPO \"U\" DIAM. 1\"","Un    ",29,1,29,null,null,0,0,""]
["S",3,"S",0,1,6,2,0,0,0,0,"","Serviço","Serviço","-","AGETOP",70354,"BRACADEIRA METALICA TIPO \"U\" DIAM. 1.1/2\"","Un    ",16,1,16,null,null,0,0,""]
["S",3,"S",0,1,6,2,0,0,0,0,"","Serviço","Serviço","-","AGETOP",70355,"BRACADEIRA METALICA TIPO \"U\" DIAM. 2\"","Un    ",27,1,27,null,null,0,0,""]
["S",3,"S",0,1,6,2,0,0,0,0,"","Serviço","Serviço","-","SINAPI",91880,"LUVA PARA ELETRODUTO, PVC, ROSCÁVEL, DN 32 MM (1\"), PARA CIRCUITOS TERMINAIS, INSTALADA EM LAJE - FORNECIMENTO E INSTALAÇÃO. AF_12/2015","UN",29,1,29,null,null,0,0,"Referência: AGETOP - 71742"]
["S",3,"S",0,1,6,2,0,0,0,0,"","Serviço","Serviço","-","SINAPI",93013,"LUVA PARA ELETRODUTO, PVC, ROSCÁVEL, DN 50 MM (1 1/2\") - FORNECIMENTO E INSTALAÇÃO. AF_12/2015","UN",16,1,16,null,null,0,0,"Referência: AGETOP - 71744"]
["S",3,"S",0,1,6,2,0,0,0,0,"","Serviço","Serviço","-","SINAPI",93014,"LUVA PARA ELETRODUTO, PVC, ROSCÁVEL, DN 60 MM (2\") - FORNECIMENTO E INSTALAÇÃO. AF_12/2015","UN",27,1,27,null,null,0,0,"Referência: AGETOP - 71745"]
["S",3,"S",0,1,6,2,0,0,0,0,"","Serviço","Serviço","-","AGETOP",70647,"CAIXA DE PASSAGEM METÁLICA DE EMBUTIR 30X30X12 CM","Un    ",4,1,4,null,null,0,0,""]
["S",3,"S",0,1,6,2,0,0,0,0,"","Serviço","Serviço","-","SINAPI",97889,"CAIXA ENTERRADA ELÉTRICA RETANGULAR, EM ALVENARIA COM TIJOLOS CERÂMICOS MACIÇOS, FUNDO COM BRITA, DIMENSÕES INTERNAS: 0,8X0,8X0,6 M. AF_05/2018","UN",1,1,1,null,null,0,0,""]
["S",3,"S",0,1,6,2,0,0,0,0,"","Serviço","Serviço","-","SINAPI",6171,"TAMPA DE CONCRETO ARMADO 60X60X5CM PARA CAIXA","UN",1,1,1,null,null,0,0,""]
["S",3,"S",0,1,6,2,0,0,0,0,"","Serviço","Serviço","-","SINAPI",92870,"CAIXA RETANGULAR 4\" X 4\" ALTA (2,00 M DO PISO), METÁLICA, INSTALADA EM PAREDE - FORNECIMENTO E INSTALAÇÃO. AF_12/2015","UN",3,1,3,null,null,0,0,""]
["S",3,"S",0,1,6,2,0,0,0,0,"","Serviço","Serviço","-","AGETOP",71861,"PARAFUSO P/BUCHA S-6","Un    ",288,1,288,null,null,0,0,""]
["S",3,"S",0,1,6,2,0,0,0,0,"","Serviço","Serviço","-","AGETOP",70391,"BUCHA DE NYLON S-6","Un    ",288,1,288,null,null,0,0,""]
[3,3,3,75,1,6,3,0,0,75,130,"","Nível 3","Nível 3","-","SINAPI",null,"SUBESTAÇÃO","-",null,1,"-",null,null,0,0,""]
["S",3,"S",0,1,6,3,0,0,0,0,"","Serviço","Serviço","-","AGETOP",70386,"BRAÇO C AÇO GALVANIZADO , CONFORME NTD-17","un    ",1,1,1,null,null,0,0,""]
["S",3,"S",0,1,6,3,0,0,0,0,"","Serviço","Serviço","-","SINAPI","73767/2","ALCA PRE-FORMADA DISTRIBUIÇÃO EM  ACO RECOBERTO COM ALUMINIO PARA CABO 25MM2, ENCAPADO. FORNECIMENTO E INSTALAÇÃO.","UN",3,1,3,null,null,0,0,""]
["S",3,"S",0,1,6,3,0,0,0,0,"","Serviço","Serviço","-","SINAPI","73767/1","GRAMPO PARALELO EM ALUMINIO FUNDIDO OU ESTRUDADO DE 2 PARAFUSOS, PARA CABO DE 6 A 50 MM2, PASTA ANTIOXIDANTE. FORNEC E INSTALAÇÃO.","UN",6,1,6,null,null,0,0,""]
["S",3,"S",0,1,6,3,0,0,0,0,"","Serviço","Serviço","-","AGETOP",71036,"CONECTOR TIPO PARAFUSO FENDIDO 50 MM2","Un    ",6,1,6,null,null,0,0,""]
["S",3,"S",0,1,6,3,0,0,0,0,"","Serviço","Serviço","-","SINAPI",72263,"TERMINAL OU CONECTOR DE PRESSAO - PARA CABO 50MM2 - FORNECIMENTO E INSTALACAO","UN",1,1,1,null,null,0,0,""]
["S",3,"S",0,1,6,3,0,0,0,0,"","Serviço","Serviço","-","AGETOP",71833,"PARA RAIOS DISTRIBUIDOR POLIMÉRICO ÓXIDO DE ZINCO S/CENTELHADOR C/ DESLIGAMENTO AUTOMÁTICO 15KV,10KA","Un    ",3,1,3,null,null,0,0,""]
["S",3,"S",0,1,6,3,0,0,{"$f":"IF(OR($C215=\"S\",$C215=0),0,MATCH(0,OFFSET($D215,1,$C215,ROW($C$830)-ROW($C215)),0))","v":0},{"$f":"IF(OR($C215=\"S\",$C215=0),0,MATCH(OFFSET($D215,0,$C215)+1,OFFSET($D215,1,$C215,ROW($C$830)-ROW($C215)),0))","v":0},"","Serviço","Serviço","-","AGETOP",72145,"PROTETOR PARA PARA-RAIO POLIMÉRICO","un    ",6,1,6,null,null,0,0,""]
["S",3,"S",0,1,6,3,0,0,0,0,"","Serviço","Serviço","-","SINAPI",88544,"ARMACAO SECUNDARIA OU REX COMPLETA PARA DUAS LINHAS-FORNECIMENTO E INSTALACAO.","UN",1,1,1,null,null,0,0,""]
["S",3,"S",0,1,6,3,0,0,0,0,"","Serviço","Serviço","-","COMPOSIÇÃO","COMP 046_SEE","CAPUZ PARA PROTEÇÃO DOS PARA RAIOS","UN ",3,1,3,null,null,0,0,""]
["S",3,"S",0,1,6,3,0,0,0,0,"","Serviço","Serviço","-","COMPOSIÇÃO","COMP 047_SEE","CAPUZ DE PROTEÇÃO PARA BUCHA DE TRANSFORMADOR","UN ",3,1,3,null,null,0,0,""]
["S",3,"S",0,1,6,3,0,0,0,0,"","Serviço","Serviço","-","COMPOSIÇÃO","COMP 048_SEE","HASTE ROSQUEADA \"TIRANTE\" 3/8\"","M",0.5,1,0.5,null,null,0,0,""]
["S",3,"S",0,1,6,3,0,0,0,0,"","Serviço","Serviço","-","COMPOSIÇÃO","COMP 049_SEE","PORCA SEXTAVADA 3/8\"","UN ",8,1,8,null,null,0,0,""]
["S",3,"S",0,1,6,3,0,0,0,0,"","Serviço","Serviço","-","AGETOP",71476,"ISOLADOR DE ANCORAGEM POLIMÉRICO 15KV","un    ",3,1,3,null,null,0,0,""]
["S",3,"S",0,1,6,3,0,0,0,0,"","Serviço","Serviço","-","AGETOP",71365,"GRAMPO DE ANCORAGEM POLIMÉRICO","un    ",3,1,3,null,null,0,0,""]
["S",3,"S",0,1,6,3,0,0,0,0,"","Serviço","Serviço","-","AGETOP",70252,"ARRUELA LISA D=5/16\"","Un    ",8,1,8,null,null,0,0,""]
["S",3,"S",0,1,6,3,0,0,0,0,"","Serviço","Serviço","-","AGETOP",70696,"CAIXA METÁLICA PARA PROTEÇÃO GERAL 820X750X266MM DE 250A A 350A","Un    ",1,1,1,null,null,0,0,""]
["S",3,"S",0,1,6,3,0,0,0,0,"","Serviço","Serviço","-","AGETOP",70697,"CAIXA METÁLICA PARA T.C. 820X750X266MM - 250 A 350A","Un    ",1,1,1,null,null,0,0,""]
["S",3,"S",0,1,6,3,0,0,0,0,"","Serviço","Serviço","-","SINAPI",93205,"CINTA DE AMARRAÇÃO DE ALVENARIA MOLDADA IN LOCO COM UTILIZAÇÃO DE BLOCOS CANALETA. AF_03/2016","M",6,1,6,null,null,0,0,""]
["S",3,"S",0,1,6,3,0,0,0,0,"","Serviço","Serviço","-","AGETOP",71270,"ELO FUSIVEL 8 K - 15 KV","Un    ",3,1,3,null,null,0,0,""]
["S",3,"S",0,1,6,3,0,0,0,0,"","Serviço","Serviço","-","AGETOP",70791,"CHAVE FUSIVEL,15 KV,100A, (CHAVE MATHEUS)","Un    ",3,1,3,null,null,0,0,""]
["S",3,"S",0,1,6,3,0,0,0,0,"","Serviço","Serviço","-","AGETOP",71186,"DISPOSITIVO DE PROTEÇÃO CONTRA SURTOS (D.P.S.) 275V DE 90KA","Un    ",3,1,3,null,null,0,0,""]
["S",3,"S",0,1,6,3,0,0,0,0,"","Serviço","Serviço","-","AGETOP",71320,"FITA DE AUTO FUSAO, ROLO DE 2,00 M","Un    ",5,1,5,null,null,0,0,""]
["S",3,"S",0,1,6,3,0,0,0,0,"","Serviço","Serviço","-","AGETOP",70771,"CANTONEIRA AUXILIAR PARA BRAÇO TIPO C","un    ",3,1,3,null,null,0,0,""]
["S",3,"S",0,1,6,3,0,0,0,0,"","Serviço","Serviço","-","SINAPI",93022,"CURVA 90 GRAUS PARA ELETRODUTO, PVC, ROSCÁVEL, DN 75 MM (2 1/2\") - FORNECIMENTO E INSTALAÇÃO. AF_12/2015","UN",2,1,2,null,null,0,0,""]
["S",3,"S",0,1,6,3,0,0,0,0,"","Serviço","Serviço","-","AGETOP",72329,"SAPATILHA DE AÇO GALVANIZADO PARA POSTE COM TRANSFORMADOR","un    ",3,1,3,null,null,0,0,""]
["S",3,"S",0,1,6,3,0,0,0,0,"","Serviço","Serviço","-","AGETOP",71795,"OLHAL PARA PARAFUSO","un    ",3,1,3,null,null,0,0,""]
["S",3,"S",0,1,6,3,0,0,0,0,"","Serviço","Serviço","-","AGETOP",71761,"MURETA MEDIÇÃO ALVEN. 1 1/2 V.(35CM) REBOC.C/PINTURA ACRÍL. E LAJE CONC. 20MPA MALHA 8.0MM CADA 10CM REVEST.C/ARGAMASSA 1:3 C/ IMPERMEABILIZANTE","m2    ",1,1,1,null,null,0,0,""]
["S",3,"S",0,1,6,3,0,0,0,0,"","Serviço","Serviço","-","AGETOP",71776,"NIPLE METALICO Fo.Zo. DIAMETRO 2.1/2\"","Un    ",2,1,2,null,null,0,0,""]
["S",3,"S",0,1,6,3,0,0,0,0,"","Serviço","Serviço","-","AGETOP",71791,"NIPLE DUPLO FERRO GALVANIZADO 2\"","Un    ",1,1,1,null,null,0,0,""]
["S",3,"S",0,1,6,3,0,0,0,0,"","Serviço","Serviço","-","SINAPI",73624,"SUPORTE PARA TRANSFORMADOR EM POSTE DE CONCRETO CIRCULAR","UN",3,1,3,null,null,0,0,""]
["S",3,"S",0,1,6,3,0,0,0,0,"","Serviço","Serviço","-","AGETOP",72061,"POSTE DE CONCRETO SC 11/600 - SEM FUNDAÇÃO/CONCRETO","Un    ",1,1,1,null,null,0,0,""]
["S",3,"S",0,1,6,3,0,0,0,0,"","Serviço","Serviço","-","AGETOP",72000,"POSTE - ENGASTAMENTO SIMPLES PARA POSTE DE CONCRETO SEÇÃO CIRCULAR","m3    ",0.2,1,0.2,null,null,0,0,""]
["S",3,"S",0,1,6,3,0,0,0,0,"","Serviço","Serviço","-","AGETOP",71997,"POSTE - FUNDAÇÃO EM CONCRETO SIMPLES DA BASE DOS POSTES 11/600 PARA TRAFO ( DIAM. 1000MM)","m     ",1,1,1,null,null,0,0,""]
["S",3,"S",0,1,6,3,0,0,0,0,"","Serviço","Serviço","-","AGETOP",72080,"POSTE/TRAFO - CAMINHÃO MUNCK 12 TON. (MÍNIMO 4H/DIA)","H     ",8,1,8,null,null,0,0,""]
["S",3,"S",0,1,6,3,0,0,0,0,"","Serviço","Serviço","-","SINAPI",72263,"TERMINAL OU CONECTOR DE PRESSAO - PARA CABO 50MM2 - FORNECIMENTO E INSTALACAO","UN",3,1,3,null,null,0,0,""]
["S",3,"S",0,1,6,3,0,0,0,0,"","Serviço","Serviço","-","AGETOP",72535,"TERMINAL DE PRESSAO 70 MMM2","Un    ",2,1,2,null,null,0,0,""]
["S",3,"S",0,1,6,3,0,0,0,0,"","Serviço","Serviço","-","AGETOP",72528,"TERMINAL DE PRESSAO 35 MM2","Un    ",5,1,5,null,null,0,0,""]
["S",3,"S",0,1,6,3,0,0,0,0,"","Serviço","Serviço","-","AGETOP",72518,"TERMINAL DE PRESSAO 10 MM2","Un    ",1,1,1,null,null,0,0,""]
["S",3,"S",0,1,6,3,0,0,0,0,"","Serviço","Serviço","-","AGETOP",72550,"TERMINAL DE PRESSAO 150 MM2","Un    ",10,1,10,null,null,0,0,""]
["S",3,"S",0,1,6,3,0,0,0,0,"","Serviço","Serviço","-","SINAPI","73857/3","TRANSFORMADOR DISTRIBUICAO  150KVA TRIFASICO 60HZ CLASSE 15KV IMERSO EM ÓLEO MINERAL FORNECIMENTO E INSTALACAO","UN",1,1,1,null,null,0,0,""]
["S",3,"S",0,1,6,3,0,0,0,0,"","Serviço","Serviço","-","AGETOP",72630,"TRILHO OU SUPORTE P/BORNE TERMINAL","M     ",0.2,1,0.2,null,null,0,0,""]
["S",3,"S",0,1,6,3,0,0,0,0,"","Serviço","Serviço","-","AGETOP",70920,"CINTA DE ACO GALVANIZADO DIAM.190 MM","Un    ",1,1,1,null,null,0,0,""]
["S",3,"S",0,1,6,3,0,0,0,0,"","Serviço","Serviço","-","AGETOP",70921,"CINTA DE ACO GALVANIZADO DIAM.220 MM","Un    ",4,1,4,null,null,0,0,""]
["S",3,"S",0,1,6,3,0,0,0,0,"","Serviço","Serviço","-","AGETOP",70922,"CINTA DE ACO GALVANIZADO DIAM.230MM","Un    ",1,1,1,null,null,0,0,""]
["S",3,"S",0,1,6,3,0,0,0,0,"","Serviço","Serviço","-","AGETOP",71835,"PARAFUSO CABEÇA ABAULADA (FRANCES) M16 X 45 MM","Un    ",3,1,3,null,null,0,0,""]
["S",3,"S",0,1,6,3,0,0,0,0,"","Serviço","Serviço","-","AGETOP",71841,"PARAFUSO CABEÇA ABAULADA (FRANCES) M16 X 150 MM","Un    ",3,1,3,null,null,0,0,""]
["S",3,"S",0,1,6,3,0,0,0,0,"","Serviço","Serviço","-","AGETOP",71750,"MANILHA-SAPATILHA EM AÇO GALVANIZADO","un    ",1,1,1,null,null,0,0,""]
["S",3,"S",0,1,6,3,0,0,0,0,"","Serviço","Serviço","-","AGETOP",70218,"ARAME DE AÇO GALVANIZADO No. 12 BWG","M     ",3,1,3,null,null,0,0,""]
["S",3,"S",0,1,6,3,0,0,0,0,"","Serviço","Serviço","-","AGETOP",71480,"ISOLADOR ROLDANA PORCELANA 72 X 72","Un    ",3,1,3,null,null,0,0,""]
["S",3,"S",0,1,6,3,0,0,0,0,"","Serviço","Serviço","-","AGETOP",70505,"CABECOTE DE LIGA DE ALUMINIO DIAM. 2.1/2\"","Un    ",1,1,1,null,null,0,0,""]
["S",3,"S",0,1,6,3,0,0,0,0,"","Serviço","Serviço","-","AGETOP",72661,"VERGALHAO ROSCA TOTAL D=5/16\"","M     ",0.2,1,0.2,null,null,0,0,""]
["S",3,"S",0,1,6,3,0,0,0,0,"","Serviço","Serviço","-","AGETOP",70268,"BARRA DE COBRE 2\" X 3/16\"  (2,0865 KG/M)","m     ",1.5,1,1.5,null,null,0,0,""]
["S",3,"S",0,1,6,3,0,0,0,0,"","Serviço","Serviço","-","AGETOP",71463,"ISOLADOR EPOXI 50X40 (BUJAO)","Un    ",2,1,2,null,null,0,0,""]
["S",3,"S",0,1,6,3,0,0,0,0,"","Serviço","Serviço","-","SINAPI","74130/7","DISJUNTOR TERMOMAGNETICO TRIPOLAR EM CAIXA MOLDADA 250A 600V, FORNECIMENTO E INSTALACAO","UN",2,1,2,null,null,0,0,""]
["S",3,"S",0,1,6,3,0,0,0,0,"","Serviço","Serviço","-","SINAPI",92996,"CABO DE COBRE FLEXÍVEL ISOLADO, 150 MM², ANTI-CHAMA 0,6/1,0 KV, PARA DISTRIBUIÇÃO - FORNECIMENTO E INSTALAÇÃO. AF_12/2015","M",113.89,1,113.89,null,null,0,0,""]
["S",3,"S",0,1,6,3,0,0,0,0,"","Serviço","Serviço","-","SINAPI",92990,"CABO DE COBRE FLEXÍVEL ISOLADO, 70 MM², ANTI-CHAMA 0,6/1,0 KV, PARA DISTRIBUIÇÃO - FORNECIMENTO E INSTALAÇÃO. AF_12/2015","M",28.47,1,28.47,null,null,0,0,"Referência: AGETOP - 70514"]
["S",3,"S",0,1,6,3,0,0,0,0,"","Serviço","Serviço","-","AGETOP",70543,"CABO DE COBRE NÚ No. 35 MM2","M     ",15,1,15,null,null,0,0,""]
["S",3,"S",0,1,6,3,0,0,0,0,"","Serviço","Serviço","-","AGETOP",70541,"CABO DE COBRE NU No. 16 MM2 (6,94 M/KG)","M     ",5,1,5,null,null,0,0,""]
["S",3,"S",0,1,6,3,0,0,0,0,"","Serviço","Serviço","-","AGETOP",70544,"CABO DE COBRE NÚ No. 50 MM2","M     ",40,1,40,null,null,0,0,""]
["S",3,"S",0,1,6,3,0,0,0,0,"","Serviço","Serviço","-","AGETOP",70584,"CABO PVC (70ºC) 1 KV No. 10 MM2","M     ",3,1,3,null,null,0,0,""]
["S",3,"S",0,1,6,3,0,0,0,0,"","Serviço","Serviço","-","SINAPI",97893,"CAIXA ENTERRADA ELÉTRICA RETANGULAR, EM ALVENARIA COM BLOCOS DE CONCRETO, FUNDO COM BRITA, DIMENSÕES INTERNAS: 0,8X0,8X0,6 M. AF_05/2018","UN",3,1,3,null,null,0,0,""]
["S",3,"S",0,1,6,3,0,0,0,0,"","Serviço","Serviço","-","AGETOP",81826,"TAMPA EM CONCRETO ARMADO 25 MPA E=5CM PARA A CAIXA DE PASSAGEM 60X60CM","Un    ",3,1,3,null,null,0,0,""]
["S",3,"S",0,1,6,3,0,0,0,0,"","Serviço","Serviço","-","AGETOP",71218,"ELETRODUTO EM AÇO GALVANIZADO A FOGO DIÂMETRO 4\" - PESADO ","M     ",20,1,20,null,null,0,0,""]
["S",3,"S",0,1,6,3,0,0,0,0,"","Serviço","Serviço","-","AGETOP",70378,"BRACADEIRA METALICA TIPO \"D\" DIAM. 4\"","Un    ",10,1,10,null,null,0,0,""]
["S",3,"S",0,1,6,3,0,0,0,0,"","Serviço","Serviço","-","AGETOP",71780,"NIPLE METALICO Fo.Zo. DIAMETRO 4\"","Un    ",1,1,1,null,null,0,0,""]
["S",3,"S",0,1,6,3,0,0,0,0,"","Serviço","Serviço","-","AGETOP",70428,"BUCHA E ARRUELA METALICA DIAM. 4\"","PR    ",10,1,10,null,null,0,0,""]
["S",3,"S",0,1,6,3,0,0,0,0,"","Serviço","Serviço","-","AGETOP",70421,"BUCHA E ARRUELA METALICA DIAM. 3/4\"","PR    ",2,1,2,null,null,0,0,""]
["S",3,"S",0,1,6,3,0,0,0,0,"","Serviço","Serviço","-","AGETOP",70422,"BUCHA E ARRUELA METALICA DIAM. 1\"","PR    ",1,1,1,null,null,0,0,""]
["S",3,"S",0,1,6,3,0,0,0,0,"","Serviço","Serviço","-","SINAPI",93012,"ELETRODUTO RÍGIDO ROSCÁVEL, PVC, DN 110 MM (4\") - FORNECIMENTO E INSTALAÇÃO. AF_12/2015","M",60,1,60,null,null,0,0,""]
["S",3,"S",0,1,6,3,0,0,0,0,"","Serviço","Serviço","-","SINAPI",93026,"CURVA 90 GRAUS PARA ELETRODUTO, PVC, ROSCÁVEL, DN 110 MM (4\") - FORNECIMENTO E INSTALAÇÃO. AF_12/2015","UN",10,1,10,null,null,0,0,""]
["S",3,"S",0,1,6,3,0,0,{"$f":"IF(OR($C279=\"S\",$C279=0),0,MATCH(0,OFFSET($D279,1,$C279,ROW($C$830)-ROW($C279)),0))","v":0},{"$f":"IF(OR($C279=\"S\",$C279=0),0,MATCH(OFFSET($D279,0,$C279)+1,OFFSET($D279,1,$C279,ROW($C$830)-ROW($C279)),0))","v":0},"","Serviço","Serviço","-","SINAPI",93017,"LUVA PARA ELETRODUTO, PVC, ROSCÁVEL, DN 110 MM (4\") - FORNECIMENTO E INSTALAÇÃO. AF_12/2015","UN",28.47,1,28.47,null,null,0,0,"Referência: AGETOP - 71748"]
["S",3,"S",0,1,6,3,0,0,0,0,"","Serviço","Serviço","-","SINAPI",91872,"ELETRODUTO RÍGIDO ROSCÁVEL, PVC, DN 32 MM (1\"), PARA CIRCUITOS TERMINAIS, INSTALADO EM PAREDE - FORNECIMENTO E INSTALAÇÃO. AF_12/2015","M",3,1,3,null,null,0,0,"Referência: AGETOP - 71202"]
["S",3,"S",0,1,6,3,0,0,0,0,"","Serviço","Serviço","-","SINAPI",91917,"CURVA 90 GRAUS PARA ELETRODUTO, PVC, ROSCÁVEL, DN 32 MM (1\"), PARA CIRCUITOS TERMINAIS, INSTALADA EM PAREDE - FORNECIMENTO E INSTALAÇÃO. AF_12/2015","UN",1,1,1,null,null,0,0,""]
["S",3,"S",0,1,6,3,0,0,0,0,"","Serviço","Serviço","-","SINAPI",91885,"LUVA PARA ELETRODUTO, PVC, ROSCÁVEL, DN 32 MM (1\"), PARA CIRCUITOS TERMINAIS, INSTALADA EM PAREDE - FORNECIMENTO E INSTALAÇÃO. AF_12/2015","UN",2,1,2,null,null,0,0,"Referência: AGETOP - 71742"]
[{"$f":"CHOOSE(1+LOG(1+2*(ORÇAMENTO.Nivel=\"Nível 1\")+4*(ORÇAMENTO.Nivel=\"Nível 2\")+8*(ORÇAMENTO.Nivel=\"Nível 3\")+16*(ORÇAMENTO.Nivel=\"Nível 4\")+32*(ORÇAMENTO.Nivel=\"Serviço\"),2),0,1,2,3,4,\"S\")","v":2},{"$f":"IF(OR(C283=\"s\",C283=0),OFFSET(B283,-1,0),C283)","v":2},{"$f":"IF(OFFSET(C283,-1,0)=\"L\",1,IF(OFFSET(C283,-1,0)=1,2,IF(OR(A283=\"s\",A283=0),\"S\",IF(AND(OFFSET(C283,-1,0)=2,A283=4),3,IF(AND(OR(OFFSET(C283,-1,0)=\"s\",OFFSET(C283,-1,0)=0),A283<>\"s\",A283>OFFSET(B283,-1,0)),OFFSET(B283,-1,0),A283)))))","v":2},{"$f":"IF(OR(C283=\"S\",C283=0),0,IF(ISERROR(K283),J283,SMALL(J283:K283,1)))","v":104},{"$f":"IF($C283=1,OFFSET(E283,-1,0)+1,OFFSET(E283,-1,0))","v":1},{"$f":"IF($C283=1,0,IF($C283=2,OFFSET(F283,-1,0)+1,OFFSET(F283,-1,0)))","v":7},{"$f":"IF(AND($C283<=2,$C283<>0),0,IF($C283=3,OFFSET(G283,-1,0)+1,OFFSET(G283,-1,0)))","v":0},{"$f":"IF(AND($C283<=3,$C283<>0),0,IF($C283=4,OFFSET(H283,-1,0)+1,OFFSET(H283,-1,0)))","v":0},{"$f":"IF(AND($C283<=4,$C283<>0),0,IF(AND($C283=\"S\",$Y283>0),OFFSET(I283,-1,0)+1,OFFSET(I283,-1,0)))","v":0},204,104,"","Nível 2","Nível 2","-","AGETOP",null,"INSTALAÇÕES HIDROSSANITÁRIAS","-",null,1,"-",null,null,0,0,""]
[3,3,3,19,1,7,1,0,0,103,19,"","Nível 3","Nível 3","-","SINAPI",null,"PEÇAS E ACESSÓRIOS","-",null,1,"-",null,null,0,0,""]
[4,4,4,8,1,7,1,1,0,18,8,"","Nível 4","Nível 4","-","SINAPI",null,"VASO SANITÁRIO E ACESSÓRIOS","-",null,1,"-",null,null,0,0,""]
["S",4,"S",0,1,7,1,1,0,0,0,"","Serviço","Serviço","-","SINAPI",95470,"VASO SANITARIO SIFONADO CONVENCIONAL COM LOUÇA BRANCA, INCLUSO CONJUNTO DE LIGAÇÃO PARA BACIA SANITÁRIA AJUSTÁVEL - FORNECIMENTO E INSTALAÇÃO. AF_10/2016","UN",8,1,8,null,null,0,0,""]
["S",4,"S",0,1,7,1,1,0,0,0,"","Serviço","Serviço","-","SINAPI",99635,"VÁLVULA DE DESCARGA METÁLICA, BASE 1 1/2 \", ACABAMENTO METALICO CROMADO - FORNECIMENTO E INSTALAÇÃO. AF_01/2019","UN",8,1,8,null,null,0,0,"Referência: AGETOP - 80515"]
["S",4,"S",0,1,7,1,1,0,0,0,"","Serviço","Serviço","-","AGETOP",80513,"TUBO PARA VÁLVULA DE DESCARGA ( CURTO 1.1/4\" )","Un    ",8,1,8,null,null,0,0,""]
["S",4,"S",0,1,7,1,1,0,0,0,"","Serviço","Serviço","-","AGETOP",80520,"CONJUNTO DE FIXACAO P/VASO SANITARIO (PAR)","CJ    ",8,1,8,null,null,0,0,""]
["S",4,"S",0,1,7,1,1,0,0,0,"","Serviço","Serviço","-","AGETOP",80510,"ANEL DE VEDAÇÃO PARA VASO SANITÁRIO","Un    ",8,1,8,null,null,0,0,""]
["S",4,"S",0,1,7,1,1,0,0,0,"","Serviço","Serviço","-","AGETOP",80526,"ASSENTO EM POLIPROPILENO COM SISTEMA DE FECHAMENTO SUAVE PARA VASO SANITÁRIO","Un    ",8,1,8,null,null,0,0,""]
["S",4,"S",0,1,7,1,1,0,0,0,"","Serviço","Serviço","-","SINAPI",95544,"PAPELEIRA DE PAREDE EM METAL CROMADO SEM TAMPA, INCLUSO FIXAÇÃO. AF_10/2016","UN",8,1,8,null,null,0,0,""]
[4,4,4,6,1,7,1,2,0,10,6,"","Nível 4","Nível 4","-","SINAPI",null,"LAVATÓRIO E ACESSÓRIOS","-",null,1,"-",null,null,0,0,""]
["S",4,"S",0,1,7,1,2,0,0,0,"","Serviço","Serviço","-","AGETOP",80556,"LIGAÇÃO FLEXÍVEL PVC DIAM.1/2\" (ENGATE)","Un    ",6,1,6,null,null,0,0,""]
["S",4,"S",0,1,7,1,2,0,0,0,"","Serviço","Serviço","-","SINAPI",86883,"SIFÃO DO TIPO FLEXÍVEL EM PVC 1\u0094 X 1.1/2\u0094 - FORNECIMENTO E INSTALAÇÃO. AF_12/2013","UN",6,1,6,null,null,0,0,""]
["S",4,"S",0,1,7,1,2,0,0,0,"","Serviço","Serviço","-","SINAPI",86915,"TORNEIRA CROMADA DE MESA, 1/2\" OU 3/4\", PARA LAVATÓRIO, PADRÃO MÉDIO - FORNECIMENTO E INSTALAÇÃO. AF_12/2013","UN",6,1,6,null,null,0,0,"Referência: AGETOP - 80570"]
["S",4,"S",0,1,7,1,2,0,0,0,"","Serviço","Serviço","-","SINAPI",86877,"VÁLVULA EM METAL CROMADO 1.1/2\" X 1.1/2\" PARA TANQUE OU LAVATÓRIO, COM OU SEM LADRÃO - FORNECIMENTO E INSTALAÇÃO. AF_12/2013","UN",6,1,6,null,null,0,0,""]
["S",4,"S",0,1,7,1,2,0,0,0,"","Serviço","Serviço","-","SINAPI",86901,"CUBA DE EMBUTIR OVAL EM LOUÇA BRANCA, 35 X 50CM OU EQUIVALENTE - FORNECIMENTO E INSTALAÇÃO. AF_12/2013","UN",6,1,6,null,null,0,0,"Referência: AGETOP - 80587"]
[4,4,4,4,1,7,1,3,0,4,15,"","Nível 4","Nível 4","-","SINAPI",null,"REGISTROS","-",null,1,"-",null,null,0,0,""]
["S",4,"S",0,1,7,1,3,0,0,0,"","Serviço","Serviço","-","AGETOP",80980,"REGISTRO DE ESFERA DIAMETRO 2\"","Un    ",1,1,1,null,null,0,0,""]
["S",4,"S",0,1,7,1,3,0,0,0,"","Serviço","Serviço","-","AGETOP",80926,"REGISTRO DE GAVETA C/CANOPLA DIAMETRO 3/4\"","Un    ",2,1,2,null,null,0,0,""]
["S",4,"S",0,1,7,1,3,0,0,0,"","Serviço","Serviço","-","AGETOP",80929,"REGISTRO DE GAVETA C/CANOPLA DIAMETRO 1.1/2\"","Un    ",4,1,4,null,null,0,0,""]
[3,3,3,31,1,7,2,0,0,84,31,"","Nível 3","Nível 3","-","SINAPI",null,"ÁGUA FRIA","-",null,1,"-",null,null,0,0,""]
[4,4,4,4,1,7,2,1,0,30,4,"","Nível 4","Nível 4","-","SINAPI",null,"TUBOS DE PVC SOLDÁVEL","-",null,1,"-",null,null,0,0,""]
["S",4,"S",0,1,7,2,1,0,0,0,"","Serviço","Serviço","-","SINAPI",89402,"TUBO, PVC, SOLDÁVEL, DN 25MM, INSTALADO EM RAMAL DE DISTRIBUIÇÃO DE ÁGUA - FORNECIMENTO E INSTALAÇÃO. AF_12/2014","M",105,1,105,null,null,0,0,"Referência: AGETOP - 81003"]
["S",4,"S",0,1,7,2,1,0,0,0,"","Serviço","Serviço","-","SINAPI",94649,"TUBO, PVC, SOLDÁVEL, DN 32 MM, INSTALADO EM RESERVAÇÃO DE ÁGUA DE EDIFICAÇÃO QUE POSSUA RESERVATÓRIO DE FIBRA/FIBROCIMENTO   FORNECIMENTO E INSTALAÇÃO. AF_06/2016","M",32,1,32,null,null,0,0,"Referência: AGETOP - 81004"]
["S",4,"S",0,1,7,2,1,0,0,0,"","Serviço","Serviço","-","SINAPI",89449,"TUBO, PVC, SOLDÁVEL, DN 50MM, INSTALADO EM PRUMADA DE ÁGUA - FORNECIMENTO E INSTALAÇÃO. AF_12/2014","M",20,1,20,null,null,0,0,""]
[4,4,4,4,1,7,2,2,0,26,4,"","Nível 4","Nível 4","-","SINAPI",null,"ADAPTADORES DE PVC SOLDÁVEL","-",null,1,"-",null,null,0,0,""]
["S",4,"S",0,1,7,2,2,0,0,0,"","Serviço","Serviço","-","SINAPI",94664,"ADAPTADOR CURTO COM BOLSA E ROSCA PARA REGISTRO, PVC, SOLDÁVEL, DN 60 MM X 2 , INSTALADO EM RESERVAÇÃO DE ÁGUA DE EDIFICAÇÃO QUE POSSUA RESERVATÓRIO DE FIBRA/FIBROCIMENTO   FORNECIMENTO E INSTALAÇÃO. AF_06/2016","UN",2,1,2,null,null,0,0,"Referência: AGETOP - 81070"]
["S",4,"S",0,1,7,2,2,0,0,0,"","Serviço","Serviço","-","SINAPI",89383,"ADAPTADOR CURTO COM BOLSA E ROSCA PARA REGISTRO, PVC, SOLDÁVEL, DN 25MM X 3/4\u0094, INSTALADO EM RAMAL OU SUB-RAMAL DE ÁGUA - FORNECIMENTO E INSTALAÇÃO. AF_12/2014","UN",4,1,4,null,null,0,0,"Referência: AGETOP - 81066"]
["S",4,"S",0,1,7,2,2,0,0,0,"","Serviço","Serviço","-","SINAPI",89596,"ADAPTADOR CURTO COM BOLSA E ROSCA PARA REGISTRO, PVC, SOLDÁVEL, DN 50MM X 1.1/2\u0094, INSTALADO EM PRUMADA DE ÁGUA - FORNECIMENTO E INSTALAÇÃO. AF_12/2014","UN",16,1,16,null,null,0,0,"Referência: AGETOP - 81069"]
[4,4,4,2,1,7,2,3,0,22,2,"","Nível 4","Nível 4","-","SINAPI",null,"BUCHAS","-",null,1,"-",null,null,0,0,""]
["S",4,"S",0,1,7,2,3,0,0,0,"","Serviço","Serviço","-","AGETOP",81182,"BUCHA DE REDUCAO SOLDAVEL LONGA 60 X 32 mm","Un    ",1,1,1,null,null,0,0,""]
[4,4,4,8,1,7,2,4,0,20,8,"","Nível 4","Nível 4","-","SINAPI",null,"JOELHO","-",null,1,"-",null,null,0,0,""]
["S",4,"S",0,1,7,2,4,0,0,0,"","Serviço","Serviço","-","SINAPI",89409,"JOELHO 45 GRAUS, PVC, SOLDÁVEL, DN 25MM, INSTALADO EM RAMAL DE DISTRIBUIÇÃO DE ÁGUA - FORNECIMENTO E INSTALAÇÃO. AF_12/2014","UN",2,1,2,null,null,0,0,""]
["S",4,"S",0,1,7,2,4,0,0,0,"","Serviço","Serviço","-","SINAPI",89414,"JOELHO 45 GRAUS, PVC, SOLDÁVEL, DN 32MM, INSTALADO EM RAMAL DE DISTRIBUIÇÃO DE ÁGUA - FORNECIMENTO E INSTALAÇÃO. AF_12/2014","UN",1,1,1,null,null,0,0,"Referência: AGETOP - 81303"]
["S",4,"S",0,1,7,2,4,0,0,0,"","Serviço","Serviço","-","SINAPI",89481,"JOELHO 90 GRAUS, PVC, SOLDÁVEL, DN 25MM, INSTALADO EM PRUMADA DE ÁGUA - FORNECIMENTO E INSTALAÇÃO. AF_12/2014","UN",10,1,10,null,null,0,0,""]
["S",4,"S",0,1,7,2,4,0,0,0,"","Serviço","Serviço","-","SINAPI",89413,"JOELHO 90 GRAUS, PVC, SOLDÁVEL, DN 32MM, INSTALADO EM RAMAL DE DISTRIBUIÇÃO DE ÁGUA - FORNECIMENTO E INSTALAÇÃO. AF_12/2014","UN",2,1,2,null,null,0,0,""]
["S",4,"S",0,1,7,2,4,0,0,0,"","Serviço","Serviço","-","AGETOP",81325,"JOELHO 90 GRAUS SOLDAVEL DIAMETRO 60 mm","Un    ",3,1,3,null,null,0,0,""]
["S",4,"S",0,1,7,2,4,0,0,0,"","Serviço","Serviço","-","SINAPI",89501,"JOELHO 90 GRAUS, PVC, SOLDÁVEL, DN 50MM, INSTALADO EM PRUMADA DE ÁGUA - FORNECIMENTO E INSTALAÇÃO. AF_12/2014","UN",18,1,18,null,null,0,0,""]
["S",4,"S",0,1,7,2,4,0,0,0,"","Serviço","Serviço","-","SINAPI",89366,"JOELHO 90 GRAUS COM BUCHA DE LATÃO, PVC, SOLDÁVEL, DN 25MM, X 3/4\u0094 INSTALADO EM RAMAL OU SUB-RAMAL DE ÁGUA - FORNECIMENTO E INSTALAÇÃO. AF_12/2014","UN",6,1,6,null,null,0,0,"Referência: AGETOP - 81369"]
[4,4,4,4,1,7,2,5,0,12,4,"","Nível 4","Nível 4","-","SINAPI",null,"TÊ","-",null,1,"-",null,null,0,0,""]
["S",4,"S",0,1,7,2,5,0,0,0,"","Serviço","Serviço","-","SINAPI",89395,"TE, PVC, SOLDÁVEL, DN 25MM, INSTALADO EM RAMAL OU SUB-RAMAL DE ÁGUA - FORNECIMENTO E INSTALAÇÃO. AF_12/2014","UN",8,1,8,null,null,0,0,"Referência: AGETOP - 81402"]
["S",4,"S",0,1,7,2,5,0,0,0,"","Serviço","Serviço","-","SINAPI",89625,"TE, PVC, SOLDÁVEL, DN 50MM, INSTALADO EM PRUMADA DE ÁGUA - FORNECIMENTO E INSTALAÇÃO. AF_12/2014","UN",4,1,4,null,null,0,0,""]
["S",4,"S",0,1,7,2,5,0,0,0,"","Serviço","Serviço","-","SINAPI",94696,"TÊ, PVC, SOLDÁVEL, DN 60 MM INSTALADO EM RESERVAÇÃO DE ÁGUA DE EDIFICAÇÃO QUE POSSUA RESERVATÓRIO DE FIBRA/FIBROCIMENTO   FORNECIMENTO E INSTALAÇÃO. AF_06/2016","UN",1,1,1,null,null,0,0,"Referência: AGETOP - 81406"]
[4,4,4,5,1,7,2,6,0,8,5,"","Nível 4","Nível 4","-","SINAPI",null,"UNIÃO","-",null,1,"-",null,null,0,0,""]
["S",4,"S",0,1,7,2,6,0,0,0,"","Serviço","Serviço","-","SINAPI",89428,"UNIÃO, PVC, SOLDÁVEL, DN 25MM, INSTALADO EM RAMAL DE DISTRIBUIÇÃO DE ÁGUA - FORNECIMENTO E INSTALAÇÃO. AF_12/2014","UN",5,1,5,null,null,0,0,"Referência: AGETOP - 81462"]
["S",4,"S",0,1,7,2,6,0,0,0,"","Serviço","Serviço","-","SINAPI",89435,"UNIÃO, PVC, SOLDÁVEL, DN 32MM, INSTALADO EM RAMAL DE DISTRIBUIÇÃO DE ÁGUA - FORNECIMENTO E INSTALAÇÃO. AF_12/2014","UN",2,1,2,null,null,0,0,"Referência: AGETOP - 81463"]
["S",4,"S",0,1,7,2,6,0,0,0,"","Serviço","Serviço","-","SINAPI",89594,"UNIÃO, PVC, SOLDÁVEL, DN 50MM, INSTALADO EM PRUMADA DE ÁGUA - FORNECIMENTO E INSTALAÇÃO. AF_12/2014","UN",3,1,3,null,null,0,0,""]
["S",4,"S",0,1,7,2,6,0,0,0,"","Serviço","Serviço","-","SINAPI",89609,"UNIÃO, PVC, SOLDÁVEL, DN 60MM, INSTALADO EM PRUMADA DE ÁGUA - FORNECIMENTO E INSTALAÇÃO. AF_12/2014","UN",2,1,2,null,null,0,0,"Referência: AGETOP - 81466"]
[4,4,4,3,1,7,2,7,0,3,{"$error":"#N/A"},"","Nível 4","Nível 4","-","SINAPI",null,"ADESIVOS","-",null,1,"-",null,null,0,0,""]
["S",4,"S",0,1,7,2,7,0,0,0,"","Serviço","Serviço","-","AGETOP",81501,"ADESIVO PLASTICO - FRASCO 850 G","Un    ",3,1,3,null,null,0,0,""]
["S",4,"S",0,1,7,2,7,0,0,0,"","Serviço","Serviço","-","AGETOP",81504,"SOLUCAO LIMPADORA 1000 CM3","Un    ",3,1,3,null,null,0,0,""]
[3,3,3,4,1,7,3,0,0,53,4,"","Nível 3","Nível 3","-","SINAPI",null,"ESGOTO SANITÁRIO","-",null,1,"-",null,null,0,0,""]
[4,4,4,3,1,7,3,1,0,3,{"$error":"#N/A"},"","Nível 4","Nível 4","-","SINAPI",null,"TUBOS","-",null,1,"-",null,null,0,0,""]
["S",4,"S",0,1,7,3,1,0,0,0,"","Serviço","Serviço","-","SINAPI",89799,"TUBO PVC, SERIE NORMAL, ESGOTO PREDIAL, DN 75 MM, FORNECIDO E INSTALADO EM PRUMADA DE ESGOTO SANITÁRIO OU VENTILAÇÃO. AF_12/2014","M",22,1,22,null,null,0,0,""]
["S",4,"S",0,1,7,3,1,0,0,0,"","Serviço","Serviço","-","SINAPI",89800,"TUBO PVC, SERIE NORMAL, ESGOTO PREDIAL, DN 100 MM, FORNECIDO E INSTALADO EM PRUMADA DE ESGOTO SANITÁRIO OU VENTILAÇÃO. AF_12/2014","M",126,1,126,null,null,0,0,""]
[3,3,3,8,1,7,4,0,0,49,8,"","Nível 3","Nível 3","-","SINAPI",null,"OUTROS","-",null,1,"-",null,null,0,0,""]
["S",3,"S",0,1,7,4,0,0,0,0,"","Serviço","Serviço","-","AGETOP",80845,"CAIXA DE ALVENARIA 20x20x25 CM (REVESTIMENTO IMPERMEABILIZADO), FUNDO DE BRITA SEM TAMPA - PARA REGISTRO/TORNEIRA JARDIM","Un    ",1,1,1,null,null,0,0,""]
["S",3,"S",0,1,7,4,0,0,0,0,"","Serviço","Serviço","-","AGETOP",81825,"CAIXA DE PASSAGEM 60 X 60 CM SEM TAMPA","Un    ",6,1,6,null,null,0,0,""]
["S",3,"S",0,1,7,4,0,0,0,0,"","Serviço","Serviço","-","AGETOP",81826,"TAMPA EM CONCRETO ARMADO 25 MPA E=5CM PARA A CAIXA DE PASSAGEM 60X60CM","Un    ",6,1,6,null,null,0,0,""]
["S",3,"S",0,1,7,4,0,0,0,0,"","Serviço","Serviço","-","AGETOP",81835,"CAIXA DE AREIA - TAMPA EM GRELHA DE CONCRETO ARMADO 25MPA E=5CM","m2    ",5,1,5,null,null,0,0,""]
["S",3,"S",0,1,7,4,0,0,{"$f":"IF(OR($C343=\"S\",$C343=0),0,MATCH(0,OFFSET($D343,1,$C343,ROW($C$830)-ROW($C343)),0))","v":0},{"$f":"IF(OR($C343=\"S\",$C343=0),0,MATCH(OFFSET($D343,0,$C343)+1,OFFSET($D343,1,$C343,ROW($C$830)-ROW($C343)),0))","v":0},"","Serviço","Serviço","-","AGETOP",81882,"RES.METALICO TAÇA AÇO PATINÁVEL-V=15M3-COL.SEC.H=6M+FUNDAÇÃO+LOGOTIPO","Un    ",1,1,1,null,null,0,0,""]
["S",3,"S",0,1,7,4,0,0,0,0,"","Serviço","Serviço","-","SINAPI",94797,"TORNEIRA DE BOIA, ROSCÁVEL, 1\u0094, FORNECIDA E INSTALADA EM RESERVAÇÃO DE ÁGUA. AF_06/2016","UN",1,1,1,null,null,0,0,""]
["S",3,"S",0,1,7,4,0,0,0,0,"","Serviço","Serviço","-","AGETOP",81885,"TERMINAL DE VENTILACAO DIAMETRO 50 MM","Un    ",2,1,2,null,null,0,0,""]
[3,3,3,41,1,7,5,0,0,41,119,"","Nível 3","Nível 3","-","SINAPI",null,"INSTALAÇÕES DE INCENDIO","-",null,1,"-",null,null,0,0,""]
["S",3,"S",0,1,7,5,0,0,0,0,"","Serviço","Serviço","-","COMPOSIÇÃO","COMP 040_SEE","CONJUNTO MOTOR-BOMBA ELÉTRICA TRIFÁSICO 380/220 V PARA VZ= 24,33 M³/H, HM= 46,24 M POTÊNCIA= 7,5 CV","UN ",1,1,1,null,null,0,0,""]
["S",3,"S",0,1,7,5,0,0,0,0,"","Serviço","Serviço","-","AGETOP",72338,"SIRENE METALICA ALCANCE 500 M","Un    ",2,1,2,null,null,0,0,""]
["S",3,"S",0,1,7,5,0,0,0,0,"","Serviço","Serviço","-","AGETOP",80910,"REGISTRO DE GAVETA BRUTO DIAMETRO 2.1/2\"","Un    ",5,1,5,null,null,0,0,""]
["S",3,"S",0,1,7,5,0,0,0,0,"","Serviço","Serviço","-","AGETOP",82379,"TUBO FERRO GALVANIZADO DIAM.2.1/2\"","m     ",139,1,139,null,null,0,0,""]
["S",3,"S",0,1,7,5,0,0,0,0,"","Serviço","Serviço","-","AGETOP",85003,"EXTINTOR PO QUIMICO SECO (6 KG) - CAPACIDADE EXTINTORA 20 BC","Un    ",6,1,6,null,null,0,0,""]
["S",3,"S",0,1,7,5,0,0,0,0,"","Serviço","Serviço","-","SINAPI","73775/2","EXTINTOR INCENDIO AGUA-PRESSURIZADA 10L INCL SUPORTE PAREDE CARGA     COMPLETA FORNECIMENTO E COLOCACAO","UN",3,1,3,null,null,0,0,""]
["S",3,"S",0,1,7,5,0,0,0,0,"","Serviço","Serviço","-","AGETOP",85011,"CAIXA DE INCÊNDIO METÁLICA COM SUPORTE PARA MANGUEIRA, TAMPA E MURETA 17X60X90 CM C/PINTURA","Un    ",5,1,5,null,null,0,0,""]
["S",3,"S",0,1,7,5,0,0,0,0,"","Serviço","Serviço","-","AGETOP",85017,"MANGUEIRA DE INCÊNDIO D.I. = 38 MM TIPO 2 COMP. = 15 M","CJ    ",10,1,10,null,null,0,0,""]
["S",3,"S",0,1,7,5,0,0,0,0,"","Serviço","Serviço","-","AGETOP",85025,"ESGUICHO REGULÁVEL 1.1/2\"","Un    ",5,1,5,null,null,0,0,""]
["S",3,"S",0,1,7,5,0,0,0,0,"","Serviço","Serviço","-","AGETOP",85027,"ADAPTADOR P/ENGATE STORZ 2.1/2\" X 1.1/2\"","Un    ",6,1,6,null,null,0,0,""]
["S",3,"S",0,1,7,5,0,0,0,0,"","Serviço","Serviço","-","AGETOP",85031,"REGISTRO GLOBO ANGULAR 2.1/2\"","Un    ",5,1,5,null,null,0,0,""]
["S",3,"S",0,1,7,5,0,0,0,0,"","Serviço","Serviço","-","COMPOSIÇÃO","COMP 194_SEE","TAMPÃO CEGO COM CORRENTE 1.1/2\"","UN ",5,1,5,null,null,0,0,""]
["S",3,"S",0,1,7,5,0,0,0,0,"","Serviço","Serviço","-","AGETOP",85035,"TAMPÃO CEGO COM CORRENTE 2.1/2\"","Un    ",1,1,1,null,null,0,0,""]
["S",3,"S",0,1,7,5,0,0,0,0,"","Serviço","Serviço","-","AGETOP",85037,"TANQUE DE PRESSÃO DE 10 L","Un    ",1,1,1,null,null,0,0,""]
["S",3,"S",0,1,7,5,0,0,0,0,"","Serviço","Serviço","-","AGETOP",85039,"PRESSOSTATO 50 A 80 PSI","Un    ",1,1,1,null,null,0,0,""]
["S",3,"S",0,1,7,5,0,0,0,0,"","Serviço","Serviço","-","AGETOP",85041,"MANOMETRO - 0 A 10 KG/CM2","Un    ",1,1,1,null,null,0,0,""]
["S",3,"S",0,1,7,5,0,0,0,0,"","Serviço","Serviço","-","AGETOP",85047,"NIPLE DUPLO FERRO GALVANIZADO 2.1/2\"","Un    ",11,1,11,null,null,0,0,""]
["S",3,"S",0,1,7,5,0,0,0,0,"","Serviço","Serviço","-","SINAPI",92377,"NIPLE, EM FERRO GALVANIZADO, DN 65 (2 1/2\"), CONEXÃO ROSQUEADA, INSTALADO EM REDE DE ALIMENTAÇÃO PARA HIDRANTE - FORNECIMENTO E INSTALAÇÃO. AF_12/2015","UN",5,1,5,null,null,0,0,""]
["S",3,"S",0,1,7,5,0,0,0,0,"","Serviço","Serviço","-","AGETOP",85077,"VÁLVULA DE RETENÇÃO HORIZONTAL 2.1/2\"","Un    ",2,1,2,null,null,0,0,""]
["S",3,"S",0,1,7,5,0,0,0,0,"","Serviço","Serviço","-","COMPOSIÇÃO","COMP 017_SEE","REDUCAO GIRATÓRIA TIPO STORZ LATAO P/ INST. PREDIAL COMBATE A INCENDIO ENGATE RAPIDO 2.1/2\" X 1.1/2\"","UN ",5,1,5,null,null,0,0,""]
["S",3,"S",0,1,7,5,0,0,0,0,"","Serviço","Serviço","-","COMPOSIÇÃO","COMP 018_SEE","CHAVE DUPLA P/ CONEXÕES TIPO STORZ EM LATÃO ENGATE RÁPIDO 1 1/2\" X 2 1/2\"","UN ",5,1,5,null,null,0,0,""]
["S",3,"S",0,1,7,5,0,0,0,0,"","Serviço","Serviço","-","SINAPI","74169/1","REGISTRO/VALVULA GLOBO ANGULAR 45 GRAUS EM LATAO PARA HIDRANTES DE INCÊNDIO PREDIAL DN 2.1/2\u0094, COM VOLANTE, CLASSE DE PRESSAO DE ATE 200 PSI - FORNECIMENTO E INSTALACAO","UN",5,1,5,null,null,0,0,""]
["S",3,"S",0,1,7,5,0,0,0,0,"","Serviço","Serviço","-","COMPOSIÇÃO","COMP 087_SEE","REGISTRO DE GAVETA COM HASTE ASCENDENTE DE BRONZE 2 1/2\"","UN ",1,1,1,null,null,0,0,""]
["S",3,"S",0,1,7,5,0,0,0,0,"","Serviço","Serviço","-","AGETOP",85056,"TÊ DE FERRO GALVANIZADO 90º X 2 1/2\"","un    ",7,1,7,null,null,0,0,""]
["S",3,"S",0,1,7,5,0,0,0,0,"","Serviço","Serviço","-","COMPOSIÇÃO","COMP 030_SEE","COTOVELO DE FERRO GALV. 90° X 2 1/2\"","UN ",15,1,15,null,null,0,0,""]
["S",3,"S",0,1,7,5,0,0,0,0,"","Serviço","Serviço","-","COMPOSIÇÃO","COMP 077_SEE","UNIAO FERRO GALV C/ASSENTO CONICO BRONZE 2 1/2\"","UN ",12,1,12,null,null,0,0,""]
["S",3,"S",0,1,7,5,0,0,0,0,"","Serviço","Serviço","-","COMPOSIÇÃO","COMP 347_SEE","ADAPTADOR PVC SOLDAVEL, COM FLANGES LIVRES, 75 MM X 2 1/2\", PARA CAIXA D' AGUA","UN ",1,1,1,null,null,0,0,""]
["S",3,"S",0,1,7,5,0,0,0,0,"","Serviço","Serviço","-","COMPOSIÇÃO","COMP 022_SEE","TAMPÃO FOFO 40X50CM C/INSCRIÇÃO ","UN ",1,1,1,null,null,0,0,""]
["S",3,"S",0,1,7,5,0,0,0,0,"","Serviço","Serviço","-","COMPOSIÇÃO","COMP 546_SEE","BUJÃO DE REBORDO 2.1/2\"","UN ",1,1,1,null,null,0,0,""]
["S",3,"S",0,1,7,5,0,0,0,0,"","Serviço","Serviço","-","COMPOSIÇÃO","COMP 186_SEE","BOTOEIRA BOMBA DE INCÊNDIO C/ MARTELO CONVENCIONAL/ ANALÓGICA","UN ",2,1,2,null,null,0,0,""]
["S",3,"S",0,1,7,5,0,0,0,0,"","Serviço","Serviço","-","COMPOSIÇÃO","COMP 188_SEE","ACIONADOR MANUAL DE ALARME","UN ",5,1,5,null,null,0,0,""]
["S",3,"S",0,1,7,5,0,0,0,0,"","Serviço","Serviço","-","COMPOSIÇÃO","COMP 190_SEE","CENTRAL DE DETECÇÃO E ALARME DE 40 SETORES COM BATERIA","UN ",1,1,1,null,null,0,0,""]
["S",3,"S",0,1,7,5,0,0,0,0,"","Serviço","Serviço","-","SINAPI",97599,"LUMINÁRIA DE EMERGÊNCIA - FORNECIMENTO E INSTALAÇÃO. AF_11/2017","UN",21,1,21,null,null,0,0,""]
["S",3,"S",0,1,7,5,0,0,0,0,"","Serviço","Serviço","-","COMPOSIÇÃO","COMP 024_SEE","SINALIZADOR FOTOLUMINESCENTE PARA EXTINTOR","UN ",9,1,9,null,null,0,0,""]
["S",3,"S",0,1,7,5,0,0,0,0,"","Serviço","Serviço","-","COMPOSIÇÃO","COMP 025_SEE","SINALIZADOR FOTOLUMINESCENTE DE EMERGÊNCIA","UN ",20,1,20,null,null,0,0,""]
["S",3,"S",0,1,7,5,0,0,0,0,"","Serviço","Serviço","-","COMPOSIÇÃO","COMP 277_SEE","MARCAÇÃO NO PISO - 1X1 M PARA EXTINTOR","M2",9,1,9,null,null,0,0,""]
["S",3,"S",0,1,7,5,0,0,0,0,"","Serviço","Serviço","-","COMPOSIÇÃO","COMP 235_SEE","PLACA DE SINALIZAÇÃO EM PVC COD 01 - (300X300) PROIBIDO FUMAR","UN ",1,1,1,null,null,0,0,""]
["S",3,"S",0,1,7,5,0,0,0,0,"","Serviço","Serviço","-","COMPOSIÇÃO","COMP 236_SEE","PLACA DE SINALIZAÇÃO EM PVC COD 06 - (300X300) PERIGO INFLAMÁVEL","UN ",1,1,1,null,null,0,0,""]
["S",3,"S",0,1,7,5,0,0,0,0,"","Serviço","Serviço","-","COMPOSIÇÃO","COMP 411_SEE","PLACA DE SINALIZAÇÃO EM PVC COD 13 - (316X158) SAÍDA DE EMERGÊNCIA","UN ",2,1,2,null,null,0,0,""]
["S",3,"S",0,1,7,5,0,0,0,0,"","Serviço","Serviço","-","COMPOSIÇÃO","COMP 412_SEE","PLACA DE SINALIZAÇÃO EM PVC COD 17 - (316X158) MENSAGEM \"SAÍDA\"","UN ",2,1,2,null,null,0,0,""]
[{"$f":"CHOOSE(1+LOG(1+2*(ORÇAMENTO.Nivel=\"Nível 1\")+4*(ORÇAMENTO.Nivel=\"Nível 2\")+8*(ORÇAMENTO.Nivel=\"Nível 3\")+16*(ORÇAMENTO.Nivel=\"Nível 4\")+32*(ORÇAMENTO.Nivel=\"Serviço\"),2),0,1,2,3,4,\"S\")","v":2},{"$f":"IF(OR(C387=\"s\",C387=0),OFFSET(B387,-1,0),C387)","v":2},{"$f":"IF(OFFSET(C387,-1,0)=\"L\",1,IF(OFFSET(C387,-1,0)=1,2,IF(OR(A387=\"s\",A387=0),\"S\",IF(AND(OFFSET(C387,-1,0)=2,A387=4),3,IF(AND(OR(OFFSET(C387,-1,0)=\"s\",OFFSET(C387,-1,0)=0),A387<>\"s\",A387>OFFSET(B387,-1,0)),OFFSET(B387,-1,0),A387)))))","v":2},{"$f":"IF(OR(C387=\"S\",C387=0),0,IF(ISERROR(K387),J387,SMALL(J387:K387,1)))","v":28},{"$f":"IF($C387=1,OFFSET(E387,-1,0)+1,OFFSET(E387,-1,0))","v":1},{"$f":"IF($C387=1,0,IF($C387=2,OFFSET(F387,-1,0)+1,OFFSET(F387,-1,0)))","v":8},{"$f":"IF(AND($C387<=2,$C387<>0),0,IF($C387=3,OFFSET(G387,-1,0)+1,OFFSET(G387,-1,0)))","v":0},{"$f":"IF(AND($C387<=3,$C387<>0),0,IF($C387=4,OFFSET(H387,-1,0)+1,OFFSET(H387,-1,0)))","v":0},{"$f":"IF(AND($C387<=4,$C387<>0),0,IF(AND($C387=\"S\",$Y387>0),OFFSET(I387,-1,0)+1,OFFSET(I387,-1,0)))","v":0},100,28,"","Nível 2","Nível 2","-",null,null,"INSTALAÇÕES ESPECIAIS","-",null,1,"-",null,null,0,0,""]
["S",2,"S",0,1,8,0,0,0,0,0,"","Serviço","Serviço","-","AGETOP",91007,"CENTRAL DE GÁS PADRÃO GOINFRA SEM INSTALAÇÕES (1+1 CILINDRO 45 KG)","Un    ",1,1,1,null,null,0,0,""]
["S",2,"S",0,1,8,0,0,0,0,0,"","Serviço","Serviço","-","AGETOP",91023,"UNIÃO S/BRONZE PRETA 3/4\" NPT 300 LBS","Un    ",3,1,3,null,null,0,0,""]
["S",2,"S",0,1,8,0,0,0,0,0,"","Serviço","Serviço","-","COMPOSIÇÃO","COMP 382_SEE","TE DE REDUCAO DE FERRO GALVANIZADO, COM ROSCA BSP, DE 3/4\" X 1/2\"","UN ",1,1,1,null,null,0,0,""]
["S",2,"S",0,1,8,0,0,0,0,0,"","Serviço","Serviço","-","COMPOSIÇÃO","COMP 383_SEE","BUCHA DE REDUCAO DE FERRO GALVANIZADO, COM ROSCA BSP, DE 1/2\" X 1/4\"","UN ",3,1,3,null,null,0,0,""]
["S",2,"S",0,1,8,0,0,0,0,0,"","Serviço","Serviço","-","AGETOP",91021,"LUVA GALVANIZADO DE REDUÇÃO 3/4\" X 1/2\" (GÁS)","Un    ",2,1,2,null,null,0,0,""]
["S",2,"S",0,1,8,0,0,0,0,0,"","Serviço","Serviço","-","SINAPI",92692,"NIPLE, EM FERRO GALVANIZADO, CONEXÃO ROSQUEADA, DN 15 (1/2\"), INSTALADO EM RAMAIS E SUB-RAMAIS DE GÁS - FORNECIMENTO E INSTALAÇÃO. AF_12/2015","UN",6,1,6,null,null,0,0,""]
["S",2,"S",0,1,8,0,0,0,0,0,"","Serviço","Serviço","-","AGETOP",91031,"NIPLE DUPLO 300 PSI 3/4\"","Un    ",6,1,6,null,null,0,0,""]
["S",2,"S",0,1,8,0,0,0,0,0,"","Serviço","Serviço","-","COMPOSIÇÃO","COMP 212_SEE","NIPLE DE REDUÇÃO 1/2\" X 1/4\" BSP","UN ",4,1,4,null,null,0,0,""]
["S",2,"S",0,1,8,0,0,0,0,0,"","Serviço","Serviço","-","COMPOSIÇÃO","COMP 213_SEE","NIPLE DE REDUÇÃO 3/4\" X 1/2\" BSP","UN ",4,1,4,null,null,0,0,""]
["S",2,"S",0,1,8,0,0,0,0,0,"","Serviço","Serviço","-","SINAPI",92688,"TUBO DE AÇO GALVANIZADO COM COSTURA, CLASSE MÉDIA, CONEXÃO ROSQUEADA, DN 20 (3/4\"), INSTALADO EM RAMAIS E SUB-RAMAIS DE GÁS - FORNECIMENTO E INSTALAÇÃO. AF_12/2015","M",30,1,30,null,null,0,0,""]
["S",2,"S",0,1,8,0,0,0,0,0,"","Serviço","Serviço","-","SINAPI",92701,"JOELHO 90 GRAUS, EM FERRO GALVANIZADO, CONEXÃO ROSQUEADA, DN 20 (3/4\"), INSTALADO EM RAMAIS E SUB-RAMAIS DE GÁS - FORNECIMENTO E INSTALAÇÃO. AF_12/2015","UN",10,1,10,null,null,0,0,""]
["S",2,"S",0,1,8,0,0,0,0,0,"","Serviço","Serviço","-","COMPOSIÇÃO","COMP 237_SEE","FITA ANTICORROSIVA","M",16,1,16,null,null,0,0,""]
["S",2,"S",0,1,8,0,0,0,0,0,"","Serviço","Serviço","-","AGETOP",91025,"VÁLVULA ESFERICA LATÃO 3/4\"","Un    ",3,1,3,null,null,0,0,""]
["S",2,"S",0,1,8,0,0,0,0,0,"","Serviço","Serviço","-","AGETOP",91019,"TE PRETO 90º 3/4\" NPT 300 LBS","Un    ",2,1,2,null,null,0,0,""]
["S",2,"S",0,1,8,0,0,0,0,0,"","Serviço","Serviço","-","COMPOSIÇÃO","COMP 542_SEE","VÁLVULA UGV 3/4\" (S) LATÃO","UN ",4,1,4,null,null,0,0,""]
["S",2,"S",0,1,8,0,0,0,0,0,"","Serviço","Serviço","-","COMPOSIÇÃO","COMP 543_SEE","VÁLVULA UGV 1/2\" (S) LATÃO","UN ",4,1,4,null,null,0,0,""]
["S",2,"S",0,1,8,0,0,0,0,0,"","Serviço","Serviço","-","AGETOP",91029,"VALVULA DE RETENÇÃO LATÃO 1/2\" X 7/16\" NPT","Un    ",4,1,4,null,null,0,0,""]
["S",2,"S",0,1,8,0,0,0,0,0,"","Serviço","Serviço","-","COMPOSIÇÃO","COMP 211_SEE","REGULADOR DE 2º ESTÁGIO 5KG/H","UN ",4,1,4,null,null,0,0,""]
["S",2,"S",0,1,8,0,0,0,0,0,"","Serviço","Serviço","-","COMPOSIÇÃO","COMP 210_SEE","REGULADOR DE 1º ESTÁGIO 60KG/H MODELO AP-40  COM MANÔMETRO","UN ",1,1,1,null,null,0,0,""]
["S",2,"S",0,1,8,0,0,0,{"$f":"IF(OR($C407=\"S\",$C407=0),0,MATCH(0,OFFSET($D407,1,$C407,ROW($C$830)-ROW($C407)),0))","v":0},{"$f":"IF(OR($C407=\"S\",$C407=0),0,MATCH(OFFSET($D407,0,$C407)+1,OFFSET($D407,1,$C407,ROW($C$830)-ROW($C407)),0))","v":0},"","Serviço","Serviço","-","AGETOP",85003,"EXTINTOR PO QUIMICO SECO (6 KG) - CAPACIDADE EXTINTORA 20 BC","Un    ",1,1,1,null,null,0,0,""]
["S",2,"S",0,1,8,0,0,0,0,0,"","Serviço","Serviço","-","COMPOSIÇÃO","COMP 235_SEE","PLACA DE SINALIZAÇÃO EM PVC COD 01 - (300X300) PROIBIDO FUMAR","UN ",2,1,2,null,null,0,0,""]
["S",2,"S",0,1,8,0,0,0,0,0,"","Serviço","Serviço","-","COMPOSIÇÃO","COMP 236_SEE","PLACA DE SINALIZAÇÃO EM PVC COD 06 - (300X300) PERIGO INFLAMÁVEL","UN ",2,1,2,null,null,0,0,""]
["S",2,"S",0,1,8,0,0,0,0,0,"","Serviço","Serviço","-","AGETOP",91043,"BRAÇADEIRA METALICA TIPO \"D\" DIAM. 3/4\"","Un    ",8,1,8,null,null,0,0,""]
["S",2,"S",0,1,8,0,0,0,0,0,"","Serviço","Serviço","-","AGETOP",71863,"PARAFUSO P/BUCHA S-10","Un    ",16,1,16,null,null,0,0,""]
["S",2,"S",0,1,8,0,0,0,0,0,"","Serviço","Serviço","-","AGETOP",70393,"BUCHA DE NYLON S-10","Un    ",16,1,16,null,null,0,0,""]
["S",2,"S",0,1,8,0,0,0,0,0,"","Serviço","Serviço","-","AGETOP",91045,"SUPORTE PARA COLETOR","Un    ",2,1,2,null,null,0,0,""]
["S",2,"S",0,1,8,0,0,0,0,0,"","Serviço","Serviço","-","COMPOSIÇÃO","COMP 045_SEE","LAUDO DE ESTANQUEIDADE","UN ",1,1,1,null,null,0,0,""]
[{"$f":"CHOOSE(1+LOG(1+2*(ORÇAMENTO.Nivel=\"Nível 1\")+4*(ORÇAMENTO.Nivel=\"Nível 2\")+8*(ORÇAMENTO.Nivel=\"Nível 3\")+16*(ORÇAMENTO.Nivel=\"Nível 4\")+32*(ORÇAMENTO.Nivel=\"Serviço\"),2),0,1,2,3,4,\"S\")","v":2},2,2,7,1,9,0,0,{"$f":"IF(AND($C415<=4,$C415<>0),0,IF(AND($C415=\"S\",$Y415>0),OFFSET(I415,-1,0)+1,OFFSET(I415,-1,0)))","v":0},72,7,"","Nível 2","Nível 2","-","AGETOP",91045,"ALVENARIAS E DIVISÓRIAS","Un    ",null,1,"-",null,null,0,0,""]
[3,3,3,2,1,9,1,0,0,6,2,"","Nível 3","Nível 3","-","SINAPI",null,"COORDENAÇÃO","-",null,1,"-",null,null,0,0,""]
["S",3,"S",0,1,9,1,0,0,0,0,"","Serviço","Serviço","-","AGETOP",100602,"ALVENARIA DE TIJOLO LAMINADO 1/2 VEZ  - ARG. (1CI : 1CH : 5ARML)","m2    ",1.68,1,1.68,null,null,0,0,""]
[3,3,3,2,1,9,2,0,0,4,2,"","Nível 3","Nível 3","-","SINAPI",null,"ELEVADOR","-",null,1,"-",null,null,0,0,""]
["S",3,"S",0,1,9,2,0,0,0,0,"","Serviço","Serviço","-","SINAPI",87520,"ALVENARIA DE VEDAÇÃO DE BLOCOS CERÂMICOS FURADOS NA HORIZONTAL DE 9X19X19CM (ESPESSURA 9CM) DE PAREDES COM ÁREA LÍQUIDA MAIOR OU IGUAL A 6M² COM VÃOS E ARGAMASSA DE ASSENTAMENTO COM PREPARO MANUAL. AF_06/2014","M2",44.22,1,44.22,null,null,0,0,"Referência: AGETOP - 100201"]
[3,3,3,2,1,9,3,0,0,2,24,"","Nível 3","Nível 3","-","SINAPI",null,"LABORATÓRIO SECO","-",null,1,"-",null,null,0,0,""]
["S",3,"S",0,1,9,3,0,0,0,0,"","Serviço","Serviço","-","SINAPI",87520,"ALVENARIA DE VEDAÇÃO DE BLOCOS CERÂMICOS FURADOS NA HORIZONTAL DE 9X19X19CM (ESPESSURA 9CM) DE PAREDES COM ÁREA LÍQUIDA MAIOR OU IGUAL A 6M² COM VÃOS E ARGAMASSA DE ASSENTAMENTO COM PREPARO MANUAL. AF_06/2014","M2",4.6500000000000004,1,4.6500000000000004,null,null,0,0,"Referência: AGETOP - 100201"]
[2,{"$f":"IF(OR(C422=\"s\",C422=0),OFFSET(B422,-1,0),C422)","v":2},{"$f":"IF(OFFSET(C422,-1,0)=\"L\",1,IF(OFFSET(C422,-1,0)=1,2,IF(OR(A422=\"s\",A422=0),\"S\",IF(AND(OFFSET(C422,-1,0)=2,A422=4),3,IF(AND(OR(OFFSET(C422,-1,0)=\"s\",OFFSET(C422,-1,0)=0),A422<>\"s\",A422>OFFSET(B422,-1,0)),OFFSET(B422,-1,0),A422)))))","v":2},{"$f":"IF(OR(C422=\"S\",C422=0),0,IF(ISERROR(K422),J422,SMALL(J422:K422,1)))","v":2},{"$f":"IF($C422=1,OFFSET(E422,-1,0)+1,OFFSET(E422,-1,0))","v":1},{"$f":"IF($C422=1,0,IF($C422=2,OFFSET(F422,-1,0)+1,OFFSET(F422,-1,0)))","v":10},{"$f":"IF(AND($C422<=2,$C422<>0),0,IF($C422=3,OFFSET(G422,-1,0)+1,OFFSET(G422,-1,0)))","v":0},{"$f":"IF(AND($C422<=3,$C422<>0),0,IF($C422=4,OFFSET(H422,-1,0)+1,OFFSET(H422,-1,0)))","v":0},0,65,2,"","Nível 2","Nível 2","-",null,null,"IMPERMEABILIZAÇÃO","-",null,1,"-",null,null,0,0,""]
["S",2,"S",0,1,10,0,0,0,0,0,"","Serviço","Serviço","-","SINAPI",98562,"IMPERMEABILIZAÇÃO DE FLOREIRA OU VIGA BALDRAME COM ARGAMASSA DE CIMENTO E AREIA, COM ADITIVO IMPERMEABILIZANTE, E = 2 CM. AF_06/2018","M2",5.49,1,5.49,null,null,0,0,"Referência: AGETOP - 120902"]
[2,2,2,2,1,11,0,0,0,63,2,"","Nível 2","Nível 2","-",null,null,"ESQUADRIAS METÁLICAS","-",null,1,"-",null,null,0,0,""]
["S",2,"S",0,1,11,0,0,0,0,0,"","Serviço","Serviço","-","AGETOP",180304,"PORTAO DE ABRIR CHAPA 14  PT-4 C/FERRAGENS","m2    ",2.1,1,2.1,null,null,0,0,""]
[2,2,2,9,1,12,0,0,0,61,9,"","Nível 2","Nível 2","-",null,null,"REVESTIMENTO DE PAREDE","-",null,1,"-",null,null,0,0,""]
[3,3,3,3,1,12,1,0,0,8,3,"","Nível 3","Nível 3","-","SINAPI",null,"ELEVADOR","-",null,1,"-",null,null,0,0,""]
["S",3,"S",0,1,12,1,0,0,0,0,"","Serviço","Serviço","-","SINAPI",87904,"CHAPISCO APLICADO EM ALVENARIA (COM PRESENÇA DE VÃOS) E ESTRUTURAS DE CONCRETO DE FACHADA, COM COLHER DE PEDREIRO.  ARGAMASSA TRAÇO 1:3 COM PREPARO MANUAL. AF_06/2014","M2",88.44,1,88.44,null,null,0,0,"Referência: AGETOP - 200101"]
["S",3,"S",0,1,12,1,0,0,0,0,"","Serviço","Serviço","-","SINAPI",87547,"MASSA ÚNICA, PARA RECEBIMENTO DE PINTURA, EM ARGAMASSA TRAÇO 1:2:8, PREPARO MECÂNICO COM BETONEIRA 400L, APLICADA MANUALMENTE EM FACES INTERNAS DE PAREDES, ESPESSURA DE 10MM, COM EXECUÇÃO DE TALISCAS. AF_06/2014","M2",88.44,1,88.44,null,null,0,0,""]
[3,3,3,3,1,12,2,0,0,5,3,"","Nível 3","Nível 3","-","SINAPI",null,"LABORATÓRIO SECO","-",null,1,"-",null,null,0,0,""]
["S",3,"S",0,1,12,2,0,0,0,0,"","Serviço","Serviço","-","SINAPI",87904,"CHAPISCO APLICADO EM ALVENARIA (COM PRESENÇA DE VÃOS) E ESTRUTURAS DE CONCRETO DE FACHADA, COM COLHER DE PEDREIRO.  ARGAMASSA TRAÇO 1:3 COM PREPARO MANUAL. AF_06/2014","M2",11.21,1,11.21,null,null,0,0,"Referência: AGETOP - 200101"]
["S",3,"S",0,1,12,2,0,0,0,0,"","Serviço","Serviço","-","SINAPI",87547,"MASSA ÚNICA, PARA RECEBIMENTO DE PINTURA, EM ARGAMASSA TRAÇO 1:2:8, PREPARO MECÂNICO COM BETONEIRA 400L, APLICADA MANUALMENTE EM FACES INTERNAS DE PAREDES, ESPESSURA DE 10MM, COM EXECUÇÃO DE TALISCAS. AF_06/2014","M2",11.21,1,11.21,null,null,0,0,""]
[3,3,3,2,1,12,3,0,0,2,11,"","Nível 3","Nível 3","-","SINAPI",null,"SANITÁRIOS 1º PAVIMENTO","-",null,1,"-",null,null,0,0,""]
["S",3,"S",0,1,12,3,0,0,0,0,"","Serviço","Serviço","-","SINAPI",87273,"REVESTIMENTO CERÂMICO PARA PAREDES INTERNAS COM PLACAS TIPO ESMALTADA EXTRA DE DIMENSÕES 33X45 CM APLICADAS EM AMBIENTES DE ÁREA MAIOR QUE 5 M² NA ALTURA INTEIRA DAS PAREDES. AF_06/2014","M2",133.13999999999999,1,133.13999999999999,null,null,0,0,""]
[{"$f":"CHOOSE(1+LOG(1+2*(ORÇAMENTO.Nivel=\"Nível 1\")+4*(ORÇAMENTO.Nivel=\"Nível 2\")+8*(ORÇAMENTO.Nivel=\"Nível 3\")+16*(ORÇAMENTO.Nivel=\"Nível 4\")+32*(ORÇAMENTO.Nivel=\"Serviço\"),2),0,1,2,3,4,\"S\")","v":2},2,2,2,{"$f":"IF($C435=1,OFFSET(E435,-1,0)+1,OFFSET(E435,-1,0))","v":1},{"$f":"IF($C435=1,0,IF($C435=2,OFFSET(F435,-1,0)+1,OFFSET(F435,-1,0)))","v":13},{"$f":"IF(AND($C435<=2,$C435<>0),0,IF($C435=3,OFFSET(G435,-1,0)+1,OFFSET(G435,-1,0)))","v":0},{"$f":"IF(AND($C435<=3,$C435<>0),0,IF($C435=4,OFFSET(H435,-1,0)+1,OFFSET(H435,-1,0)))","v":0},{"$f":"IF(AND($C435<=4,$C435<>0),0,IF(AND($C435=\"S\",$Y435>0),OFFSET(I435,-1,0)+1,OFFSET(I435,-1,0)))","v":0},52,2,"","Nível 2","Nível 2","-",null,null,"FORROS","-",null,1,"-",null,null,0,0,""]
["S",{"$f":"IF(OR(C436=\"s\",C436=0),OFFSET(B436,-1,0),C436)","v":2},{"$f":"IF(OFFSET(C436,-1,0)=\"L\",1,IF(OFFSET(C436,-1,0)=1,2,IF(OR(A436=\"s\",A436=0),\"S\",IF(AND(OFFSET(C436,-1,0)=2,A436=4),3,IF(AND(OR(OFFSET(C436,-1,0)=\"s\",OFFSET(C436,-1,0)=0),A436<>\"s\",A436>OFFSET(B436,-1,0)),OFFSET(B436,-1,0),A436)))))","v":"S"},{"$f":"IF(OR(C436=\"S\",C436=0),0,IF(ISERROR(K436),J436,SMALL(J436:K436,1)))","v":0},1,13,0,0,0,0,0,"","Serviço","Serviço","-","SINAPI",96113,"FORRO EM PLACAS DE GESSO, PARA AMBIENTES COMERCIAIS. AF_05/2017_P","M2",29.28,1,29.28,null,null,0,0,"Referência: AGETOP - 210501"]
[2,2,2,10,1,14,0,0,0,50,10,"","Nível 2","Nível 2","-",null,null,"REVESTIMENTO DE PISO","-",null,1,"-",null,null,0,0,""]
[3,3,3,2,1,14,1,0,0,9,2,"","Nível 3","Nível 3","-","SINAPI",null,"CENTRAL DE GÁS","-",null,1,"-",null,null,0,0,""]
["S",3,"S",0,1,14,1,0,0,0,0,"","Serviço","Serviço","-","AGETOP",220102,"PISO CONCRETO DESEMPENADO ESPESSURA = 5 CM  1:2,5:3,5","m2    ",1.84,1,1.84,null,null,0,0,""]
[3,3,3,2,1,14,2,0,0,7,2,"","Nível 3","Nível 3","-","SINAPI",null,"COMBATE À INCÊNDIO","-",null,1,"-",null,null,0,0,""]
["S",3,"S",0,1,14,2,0,0,0,0,"","Serviço","Serviço","-","AGETOP",220102,"PISO CONCRETO DESEMPENADO ESPESSURA = 5 CM  1:2,5:3,5","m2    ",17.34,1,17.34,null,null,0,0,""]
[3,3,3,2,1,14,3,0,0,5,2,"","Nível 3","Nível 3","-","SINAPI",null,"INST. ELÉTRICAS","-",null,1,"-",null,null,0,0,""]
["S",3,"S",0,1,14,3,0,0,0,0,"","Serviço","Serviço","-","AGETOP",220102,"PISO CONCRETO DESEMPENADO ESPESSURA = 5 CM  1:2,5:3,5","m2    ",24.6,1,24.6,null,null,0,0,""]
[3,3,3,3,1,14,4,0,0,3,19,"","Nível 3","Nível 3","-","SINAPI",null,"OUTROS","-",null,1,"-",null,null,0,0,""]
["S",3,"S",0,1,14,4,0,0,0,0,"","Serviço","Serviço","-","AGETOP",220102,"PISO CONCRETO DESEMPENADO ESPESSURA = 5 CM  1:2,5:3,5","m2    ",366.11,1,366.11,null,null,0,0,""]
["S",3,"S",0,1,14,4,0,0,0,0,"","Serviço","Serviço","-","AGETOP",221126,"PISO DE LADRILHO HIDRÁULICO COLORIDO MODELO TÁTIL ( ALERTA OU DIRECIONAL) SEM LASTRO","m2    ",97.2,1,97.2,null,null,0,0,""]
[2,2,2,3,1,15,0,0,0,40,3,"","Nível 2","Nível 2","-",null,null,"ADMINISTRAÇÃO","-",null,1,"-",null,null,0,0,""]
["S",2,"S",0,1,15,0,0,0,0,0,"","Serviço","Serviço","-","SINAPI",90778,"ENGENHEIRO CIVIL DE OBRA PLENO COM ENCARGOS COMPLEMENTARES","H",300,1,300,null,null,0,0,"Referência: AGETOP - 250101"]
["S",2,"S",0,1,15,0,0,0,0,0,"","Serviço","Serviço","-","SINAPI",90776,"ENCARREGADO GERAL COM ENCARGOS COMPLEMENTARES","H",880,1,880,null,null,0,0,"Referência: AGETOP - 250103"]
[2,2,2,27,1,16,0,0,0,37,27,"","Nível 2","Nível 2","-",null,null,"PINTURA","-",null,1,"-",null,null,0,0,""]
[3,3,3,3,1,16,1,0,0,26,3,"","Nível 3","Nível 3","-","SINAPI",null,"ELEVADOR","-",null,1,"-",null,null,0,0,""]
["S",3,"S",0,1,16,1,0,0,0,0,"","Serviço","Serviço","-","AGETOP",261005,"PINTURA COM SELADOR ACRILICO","m2    ",44.22,1,44.22,null,null,0,0,""]
["S",3,"S",0,1,16,1,0,0,0,0,"","Serviço","Serviço","-","SINAPI",88489,"APLICAÇÃO MANUAL DE PINTURA COM TINTA LÁTEX ACRÍLICA EM PAREDES, DUAS DEMÃOS. AF_06/2014","M2",44.22,1,44.22,null,null,0,0,"Referência: AGETOP - 261001"]
[3,3,3,3,1,16,2,0,0,23,3,"","Nível 3","Nível 3","-","SINAPI",null,"LABORATÓRIO SECO","-",null,1,"-",null,null,0,0,""]
["S",3,"S",0,1,16,2,0,0,0,0,"","Serviço","Serviço","-","SINAPI",88497,"APLICAÇÃO E LIXAMENTO DE MASSA LÁTEX EM PAREDES, DUAS DEMÃOS. AF_06/2014","M2",11.21,1,11.21,null,null,0,0,"Referência: AGETOP - 261300"]
["S",3,"S",0,1,16,2,0,0,0,0,"","Serviço","Serviço","-","SINAPI",88489,"APLICAÇÃO MANUAL DE PINTURA COM TINTA LÁTEX ACRÍLICA EM PAREDES, DUAS DEMÃOS. AF_06/2014","M2",11.21,1,11.21,null,null,0,0,"Referência: AGETOP - 261001"]
[{"$f":"CHOOSE(1+LOG(1+2*(ORÇAMENTO.Nivel=\"Nível 1\")+4*(ORÇAMENTO.Nivel=\"Nível 2\")+8*(ORÇAMENTO.Nivel=\"Nível 3\")+16*(ORÇAMENTO.Nivel=\"Nível 4\")+32*(ORÇAMENTO.Nivel=\"Serviço\"),2),0,1,2,3,4,\"S\")","v":3},3,3,4,1,16,3,0,{"$f":"IF(AND($C457<=4,$C457<>0),0,IF(AND($C457=\"S\",$Y457>0),OFFSET(I457,-1,0)+1,OFFSET(I457,-1,0)))","v":0},20,4,"","Nível 3","Nível 3","-","AGETOP",null,"LÁTEX ACRÍLICA","-",null,1,"-",null,null,0,0,""]
["S",3,"S",0,1,16,3,0,0,0,0,"","Serviço","Serviço","-","AGETOP",260104,"REMOCAO DE PINTURA ANTIGA A LATEX","m2    ",810.3,1,810.3,null,null,0,0,""]
["S",3,"S",0,1,16,3,0,0,0,0,"","Serviço","Serviço","-","SINAPI",88497,"APLICAÇÃO E LIXAMENTO DE MASSA LÁTEX EM PAREDES, DUAS DEMÃOS. AF_06/2014","M2",810.3,1,810.3,null,null,0,0,"Referência: AGETOP - 261300"]
["S",3,"S",0,{"$f":"IF($C460=1,OFFSET(E460,-1,0)+1,OFFSET(E460,-1,0))","v":1},{"$f":"IF($C460=1,0,IF($C460=2,OFFSET(F460,-1,0)+1,OFFSET(F460,-1,0)))","v":16},{"$f":"IF(AND($C460<=2,$C460<>0),0,IF($C460=3,OFFSET(G460,-1,0)+1,OFFSET(G460,-1,0)))","v":3},{"$f":"IF(AND($C460<=3,$C460<>0),0,IF($C460=4,OFFSET(H460,-1,0)+1,OFFSET(H460,-1,0)))","v":0},0,0,0,"","Serviço","Serviço","-","SINAPI",88489,"APLICAÇÃO MANUAL DE PINTURA COM TINTA LÁTEX ACRÍLICA EM PAREDES, DUAS DEMÃOS. AF_06/2014","M2",2056.39,1,2056.39,null,null,0,0,"Referência: AGETOP - 261001"]
[3,3,3,2,1,16,4,0,0,16,2,"","Nível 3","Nível 3","-","AGETOP",null,"TETO","-",null,1,"-",null,null,0,0,""]
["S",3,"S",0,1,16,4,0,0,0,0,"","Serviço","Serviço","-","SINAPI",88486,"APLICAÇÃO MANUAL DE PINTURA COM TINTA LÁTEX PVA EM TETO, DUAS DEMÃOS. AF_06/2014","M2",1627.6,1,1627.6,null,null,0,0,"Referência: AGETOP - 261307"]
[3,3,3,2,1,16,5,0,0,14,2,"","Nível 3","Nível 3","-","AGETOP",null,"EXTERNA","-",null,1,"-",null,null,0,0,""]
["S",{"$f":"IF(OR(C464=\"s\",C464=0),OFFSET(B464,-1,0),C464)","v":3},{"$f":"IF(OFFSET(C464,-1,0)=\"L\",1,IF(OFFSET(C464,-1,0)=1,2,IF(OR(A464=\"s\",A464=0),\"S\",IF(AND(OFFSET(C464,-1,0)=2,A464=4),3,IF(AND(OR(OFFSET(C464,-1,0)=\"s\",OFFSET(C464,-1,0)=0),A464<>\"s\",A464>OFFSET(B464,-1,0)),OFFSET(B464,-1,0),A464)))))","v":"S"},{"$f":"IF(OR(C464=\"S\",C464=0),0,IF(ISERROR(K464),J464,SMALL(J464:K464,1)))","v":0},1,16,5,0,0,0,0,"","Serviço","Serviço","-","SINAPI",88489,"APLICAÇÃO MANUAL DE PINTURA COM TINTA LÁTEX ACRÍLICA EM PAREDES, DUAS DEMÃOS. AF_06/2014","M2",804.17,1,804.17,null,null,0,0,"Referência: AGETOP - 261001"]
[3,3,3,3,1,16,6,0,0,12,3,"","Nível 3","Nível 3","-","AGETOP",null,"ESQUADRIAS EXISTENTES","-",null,1,"-",null,null,0,0,""]
["S",3,"S",0,1,16,6,0,0,0,0,"","Serviço","Serviço","-","AGETOP",260105,"REMOCAO DE PINTURA ANTIGA A OLEO OU ESMALTE","m2    ",896.38,1,896.38,null,null,0,0,""]
["S",3,"S",0,1,16,6,0,0,0,0,"","Serviço","Serviço","-","SINAPI","73924/3","PINTURA ESMALTE FOSCO, DUAS DEMAOS, SOBRE SUPERFICIE METALICA","M2",896.38,1,896.38,null,null,0,0,"Referência: AGETOP - 261503"]
[3,3,3,2,1,16,7,0,0,9,2,"","Nível 3","Nível 3","-","AGETOP",null,"ESQUADRIAS NOVAS","-",null,1,"-",null,null,0,0,""]
["S",3,"S",0,1,16,7,0,0,0,0,"","Serviço","Serviço","-","SINAPI","74145/1","PINTURA ESMALTE FOSCO, DUAS DEMAOS, SOBRE SUPERFICIE METALICA, INCLUSO UMA DEMAO DE FUNDO ANTICORROSIVO. UTILIZACAO DE REVOLVER ( AR-COMPRIMIDO).","M2",6.3,1,6.3,null,null,0,0,"Referência: AGETOP - 261602"]
[3,3,3,2,1,16,8,0,0,7,2,"","Nível 3","Nível 3","-","AGETOP",null,"ESTRUT. METÁLICA","-",null,1,"-",null,null,0,0,""]
["S",3,"S",0,1,16,8,0,0,0,0,"","Serviço","Serviço","-","SINAPI","74145/1","PINTURA ESMALTE FOSCO, DUAS DEMAOS, SOBRE SUPERFICIE METALICA, INCLUSO UMA DEMAO DE FUNDO ANTICORROSIVO. UTILIZACAO DE REVOLVER ( AR-COMPRIMIDO).","M2",890.33,1,890.33,null,null,0,0,"Referência: AGETOP - 261602"]
[3,3,3,2,1,16,9,0,0,5,2,"","Nível 3","Nível 3","-","AGETOP",null,"QUADRA DE ESPORTES","-",null,1,"-",null,null,0,0,""]
["S",3,"S",0,1,16,9,0,0,{"$f":"IF(OR($C473=\"S\",$C473=0),0,MATCH(0,OFFSET($D473,1,$C473,ROW($C$830)-ROW($C473)),0))","v":0},{"$f":"IF(OR($C473=\"S\",$C473=0),0,MATCH(OFFSET($D473,0,$C473)+1,OFFSET($D473,1,$C473,ROW($C$830)-ROW($C473)),0))","v":0},"","Serviço","Serviço","-","SINAPI",88489,"APLICAÇÃO MANUAL DE PINTURA COM TINTA LÁTEX ACRÍLICA EM PAREDES, DUAS DEMÃOS. AF_06/2014","M2",243.71,1,243.71,null,null,0,0,"Referência: AGETOP - 261001"]
[3,3,3,3,1,16,10,0,0,3,{"$error":"#N/A"},"","Nível 3","Nível 3","-","AGETOP",null,"OUTROS","-",null,1,"-",null,null,0,0,""]
["S",3,"S",0,1,16,10,0,0,0,0,"","Serviço","Serviço","-","AGETOP",260902,"PINTURA C/VERNIZ ACRILICO-02 DEMAOS","m2    ",2905.28,1,2905.28,null,null,0,0,""]
["S",3,"S",0,1,16,10,0,0,0,0,"","Serviço","Serviço","-","AGETOP",261620,"LETREIRO MÉDIO A GRANDE PORTE EM PAREDE FEITO A PINCEL","m2    ",7.2,1,7.2,null,null,0,0,""]
[2,2,2,10,1,17,0,0,0,10,198,"","Nível 2","Nível 2","-",null,null,"DIVERSOS","-",null,1,"-",null,null,0,0,""]
[3,3,3,2,1,17,1,0,0,9,2,"","Nível 3","Nível 3","-","SINAPI",null,"COORDENAÇÃO","-",null,1,"-",null,null,0,0,""]
["S",3,"S",0,1,17,1,0,0,0,0,"","Serviço","Serviço","-","AGETOP",220920,"SOLEIRA EM GRANITO IMPERMEABILIZADA COM CONTRAPISO (1CI:3ARML)","m2    ",1.63,1,1.63,null,null,0,0,""]
[3,3,3,2,1,17,2,0,0,7,2,"","Nível 3","Nível 3","-","SINAPI",null,"LABORATÓRIO SECO","-",null,1,"-",null,null,0,0,""]
["S",3,"S",0,1,17,2,0,0,0,0,"","Serviço","Serviço","-","AGETOP",271608,"BANCADA DE GRANITO C/ESPELHO","m2    ",13.54,1,13.54,null,null,0,0,""]
[3,3,3,2,1,17,3,0,0,5,2,"","Nível 3","Nível 3","-","SINAPI",null,"SANITÁRIOS 1º PAVIMENTO","-",null,1,"-",null,null,0,0,""]
["S",3,"S",0,1,17,3,0,0,0,0,"","Serviço","Serviço","-","AGETOP",271608,"BANCADA DE GRANITO C/ESPELHO","m2    ",2.58,1,2.58,null,null,0,0,""]
[3,3,3,3,1,17,4,0,0,3,{"$error":"#N/A"},"","Nível 3","Nível 3","-","SINAPI",null,"OUTROS","-",null,1,"-",null,null,0,0,""]
["S",3,"S",0,1,17,4,0,0,0,0,"","Serviço","Serviço","-","COMPOSIÇÃO","COMP 086_SEE","ELEVADOR (PLATAFORMA VERTICAL) MODELO HERA OU EQUIVALENTE 02 PARADAS - CAPACIDADE 280KG (INSTALADO)","UN ",1,1,1,null,null,0,0,""]
["S",3,"S",0,1,17,4,0,0,0,0,"","Serviço","Serviço","-","AGETOP",270501,"LIMPEZA FINAL DE OBRA - (OBRAS CIVIS)","m2    ",329.45,1,329.45,null,null,0,0,""]
[1,1,1,199,2,0,0,0,0,343,199,"F","Nível 1","Nível 1","2.","SINAPI",null,"BLOCO VESTIÁRIO (BLOCO G)","UN",1,1,1,null,null,0,0,""]
[2,2,2,2,2,1,0,0,0,198,2,"","Nível 2","Nível 2","-","SINAPI",null,"SERVIÇOS PRELIMINARES","-",null,1,"-",null,null,0,0,""]
["S",2,"S",0,2,1,0,0,0,0,0,"","Serviço","Serviço","-","AGETOP",20701,"LOCAÇÃO DA OBRA, EXECUÇÃO DE GABARITO SEM REAPROVEITAMENTO, INCLUSO PINTURA (FACE INTERNA DO RIPÃO 15CM) E PIQUETE COM TESTEMUNHA","m2    ",55.42,1,55.42,null,null,0,0,""]
[2,2,2,3,2,2,0,0,0,196,3,"","Nível 2","Nível 2","-","SINAPI",null,"TRANSPORTES","-",null,1,"-",null,null,0,0,""]
["S",2,"S",0,2,2,0,0,0,0,0,"","Serviço","Serviço","-","SINAPI",72900,"TRANSPORTE DE ENTULHO COM CAMINHAO BASCULANTE 6 M3, RODOVIA PAVIMENTADA, DMT 0,5 A 1,0 KM","M3",3.87,1,3.87,null,null,0,0,""]
["S",2,"S",0,2,2,0,0,0,0,0,"","Serviço","Serviço","-","SINAPI",72897,"CARGA MANUAL DE ENTULHO EM CAMINHAO BASCULANTE 6 M3","M3",3.87,1,3.87,null,null,0,0,""]
[2,2,2,3,2,3,0,0,0,{"$f":"IF(OR($C493=\"S\",$C493=0),0,MATCH(0,OFFSET($D493,1,$C493,ROW($C$830)-ROW($C493)),0))","v":193},{"$f":"IF(OR($C493=\"S\",$C493=0),0,MATCH(OFFSET($D493,0,$C493)+1,OFFSET($D493,1,$C493,ROW($C$830)-ROW($C493)),0))","v":3},"","Nível 2","Nível 2","-","AGETOP",null,"SERVIÇO EM TERRA","-",null,1,"-",null,null,0,0,""]
["S",2,"S",0,2,3,0,0,0,0,0,"","Serviço","Serviço","-","AGETOP",41002,"APILOAMENTO","m2    ",55.24,1,55.24,null,null,0,0,""]
["S",2,"S",0,2,3,0,0,0,0,0,"","Serviço","Serviço","-","AGETOP",41003,"ATERRO INTERNO SEM APILOAM.C/TR.EM CARRINHO MÃO","m3    ",2.76,1,2.76,null,null,0,0,""]
[2,2,2,9,2,4,0,0,0,190,9,"","Nível 2","Nível 2","-","AGETOP",null,"FUNDAÇÕES E SONDAGENS","-",null,1,"-",null,null,0,0,""]
[3,3,3,8,2,4,1,0,0,8,17,"","Nível 3","Nível 3","-","SINAPI",null,"ESTACAS E BLOCOS","-",null,1,"-",null,null,0,0,""]
["S",3,"S",0,2,4,1,0,0,0,0,"","Serviço","Serviço","-","SINAPI",98230,"ESTACA BROCA DE CONCRETO, DIÂMETRO DE 30 CM, PROFUNDIDADE DE ATÉ 3 M, ESCAVAÇÃO MANUAL COM TRADO CONCHA, NÃO ARMADA. AF_03/2018","M",69.5,1,69.5,null,null,0,0,"Referência: AGETOP - 50302"]
["S",3,"S",0,2,4,1,0,0,0,0,"","Serviço","Serviço","-","SINAPI",96522,"ESCAVAÇÃO MANUAL PARA BLOCO DE COROAMENTO OU SAPATA, SEM PREVISÃO DE FÔRMA. AF_06/2017","M3",3.36,1,3.36,null,null,0,0,"Referência: AGETOP - 50901"]
["S",3,"S",0,2,4,1,0,0,0,0,"","Serviço","Serviço","-","SINAPI",96545,"ARMAÇÃO DE BLOCO, VIGA BALDRAME OU SAPATA UTILIZANDO AÇO CA-50 DE 8 MM - MONTAGEM. AF_06/2017","KG",37.61,1,37.61,null,null,0,0,"Referência: AGETOP - 52004"]
["S",3,"S",0,2,4,1,0,0,0,0,"","Serviço","Serviço","-","SINAPI",96546,"ARMAÇÃO DE BLOCO, VIGA BALDRAME OU SAPATA UTILIZANDO AÇO CA-50 DE 10 MM - MONTAGEM. AF_06/2017","KG",9.09,1,9.09,null,null,0,0,"Referência: AGETOP - 52005"]
["S",3,"S",0,2,4,1,0,0,0,0,"","Serviço","Serviço","-","SINAPI",96543,"ARMAÇÃO DE BLOCO, VIGA BALDRAME E SAPATA UTILIZANDO AÇO CA-60 DE 5 MM - MONTAGEM. AF_06/2017","KG",33.82,1,33.82,null,null,0,0,"Referência: AGETOP - 52014"]
["S",3,"S",0,2,4,1,0,0,0,0,"","Serviço","Serviço","-","SINAPI",94964,"CONCRETO FCK = 20MPA, TRAÇO 1:2,7:3 (CIMENTO/ AREIA MÉDIA/ BRITA 1)  - PREPARO MECÂNICO COM BETONEIRA 400 L. AF_07/2016","M3",7.01,1,7.01,null,null,0,0,""]
["S",3,"S",0,2,4,1,0,0,0,0,"","Serviço","Serviço","-","SINAPI","74157/4","LANCAMENTO/APLICACAO MANUAL DE CONCRETO EM FUNDACOES","M3",7.01,1,7.01,null,null,0,0,"Referência: AGETOP - 51026"]
[2,2,2,26,2,5,0,0,0,181,26,"","Nível 2","Nível 2","-","AGETOP",null,"ESTRUTURA","-",null,1,"-",null,null,0,0,""]
[3,3,3,8,2,5,1,0,0,25,8,"","Nível 3","Nível 3","-","SINAPI",null,"VIGAS BALDRAMES","-",null,1,"-",null,null,0,0,""]
["S",3,"S",0,2,5,1,0,0,0,0,"","Serviço","Serviço","-","AGETOP",60191,"FORMA DE TABUA CINTA BALDRAME U=8 VEZES","m2    ",32.26,1,32.26,null,null,0,0,""]
["S",3,"S",0,2,5,1,0,0,0,0,"","Serviço","Serviço","-","SINAPI",96544,"ARMAÇÃO DE BLOCO, VIGA BALDRAME OU SAPATA UTILIZANDO AÇO CA-50 DE 6,3 MM - MONTAGEM. AF_06/2017","KG",45,1,45,null,null,0,0,"Referência: AGETOP - 52003"]
["S",3,"S",0,2,5,1,0,0,0,0,"","Serviço","Serviço","-","SINAPI",96545,"ARMAÇÃO DE BLOCO, VIGA BALDRAME OU SAPATA UTILIZANDO AÇO CA-50 DE 8 MM - MONTAGEM. AF_06/2017","KG",27.9,1,27.9,null,null,0,0,"Referência: AGETOP - 52004"]
["S",3,"S",0,2,5,1,0,0,0,0,"","Serviço","Serviço","-","SINAPI",96546,"ARMAÇÃO DE BLOCO, VIGA BALDRAME OU SAPATA UTILIZANDO AÇO CA-50 DE 10 MM - MONTAGEM. AF_06/2017","KG",10.8,1,10.8,null,null,0,0,"Referência: AGETOP - 52005"]
["S",3,"S",0,2,5,1,0,0,0,0,"","Serviço","Serviço","-","SINAPI",96543,"ARMAÇÃO DE BLOCO, VIGA BALDRAME E SAPATA UTILIZANDO AÇO CA-60 DE 5 MM - MONTAGEM. AF_06/2017","KG",52.2,1,52.2,null,null,0,0,"Referência: AGETOP - 52014"]
["S",3,"S",0,2,5,1,0,0,0,0,"","Serviço","Serviço","-","SINAPI",94964,"CONCRETO FCK = 20MPA, TRAÇO 1:2,7:3 (CIMENTO/ AREIA MÉDIA/ BRITA 1)  - PREPARO MECÂNICO COM BETONEIRA 400 L. AF_07/2016","M3",1.9,1,1.9,null,null,0,0,""]
["S",3,"S",0,2,5,1,0,0,0,0,"","Serviço","Serviço","-","SINAPI","74157/4","LANCAMENTO/APLICACAO MANUAL DE CONCRETO EM FUNDACOES","M3",1.9,1,1.9,null,null,0,0,"Referência: AGETOP - 51026"]
[3,3,3,7,2,5,2,0,0,17,7,"","Nível 3","Nível 3","-","SINAPI",null,"PILARES","-",null,1,"-",null,null,0,0,""]
["S",3,"S",0,2,5,2,0,0,0,0,"","Serviço","Serviço","-","SINAPI",92418,"MONTAGEM E DESMONTAGEM DE FÔRMA DE PILARES RETANGULARES E ESTRUTURAS SIMILARES COM ÁREA MÉDIA DAS SEÇÕES MENOR OU IGUAL A 0,25 M², PÉ-DIREITO SIMPLES, EM CHAPA DE MADEIRA COMPENSADA RESINADA, 4 UTILIZAÇÕES. AF_12/2015","M2",26.12,1,26.12,null,null,0,0,"Referência: AGETOP - 60209"]
["S",3,"S",0,2,5,2,0,0,0,0,"","Serviço","Serviço","-","SINAPI",94964,"CONCRETO FCK = 20MPA, TRAÇO 1:2,7:3 (CIMENTO/ AREIA MÉDIA/ BRITA 1)  - PREPARO MECÂNICO COM BETONEIRA 400 L. AF_07/2016","M3",1.02,1,1.02,null,null,0,0,""]
["S",3,"S",0,2,5,2,0,0,0,0,"","Serviço","Serviço","-","SINAPI",92873,"LANÇAMENTO COM USO DE BALDES, ADENSAMENTO E ACABAMENTO DE CONCRETO EM ESTRUTURAS. AF_12/2015","M3",1.02,1,1.02,null,null,0,0,"Referência: AGETOP - 60801"]
["S",3,"S",0,2,5,2,0,0,0,0,"","Serviço","Serviço","-","SINAPI",92777,"ARMAÇÃO DE PILAR OU VIGA DE UMA ESTRUTURA CONVENCIONAL DE CONCRETO ARMADO EM UMA EDIFICAÇÃO TÉRREA OU SOBRADO UTILIZANDO AÇO CA-50 DE 8,0 MM - MONTAGEM. AF_12/2015","KG",24.49,1,24.49,null,null,0,0,"Referência: AGETOP - 60304"]
["S",3,"S",0,2,5,2,0,0,0,0,"","Serviço","Serviço","-","SINAPI",92778,"ARMAÇÃO DE PILAR OU VIGA DE UMA ESTRUTURA CONVENCIONAL DE CONCRETO ARMADO EM UMA EDIFICAÇÃO TÉRREA OU SOBRADO UTILIZANDO AÇO CA-50 DE 10,0 MM - MONTAGEM. AF_12/2015","KG",94.4,1,94.4,null,null,0,0,"Referência: AGETOP - 60305"]
["S",3,"S",0,2,5,2,0,0,0,0,"","Serviço","Serviço","-","SINAPI",92775,"ARMAÇÃO DE PILAR OU VIGA DE UMA ESTRUTURA CONVENCIONAL DE CONCRETO ARMADO EM UMA EDIFICAÇÃO TÉRREA OU SOBRADO UTILIZANDO AÇO CA-60 DE 5,0 MM - MONTAGEM. AF_12/2015","KG",29.18,1,29.18,null,null,0,0,"Referência: AGETOP - 60314"]
[3,3,3,10,2,5,3,0,0,10,{"$error":"#N/A"},"","Nível 3","Nível 3","-","SINAPI",null,"VIGAS DE COBERTURA","-",null,1,"-",null,null,0,0,""]
["S",3,"S",0,2,5,3,0,0,0,0,"","Serviço","Serviço","-","SINAPI",92456,"MONTAGEM E DESMONTAGEM DE FÔRMA DE VIGA, ESCORAMENTO METÁLICO, PÉ-DIREITO SIMPLES, EM CHAPA DE MADEIRA RESINADA, 4 UTILIZAÇÕES. AF_12/2015","M2",39.97,1,39.97,null,null,0,0,"Referência: AGETOP - 60209"]
["S",3,"S",0,2,5,3,0,0,0,0,"","Serviço","Serviço","-","SINAPI",94964,"CONCRETO FCK = 20MPA, TRAÇO 1:2,7:3 (CIMENTO/ AREIA MÉDIA/ BRITA 1)  - PREPARO MECÂNICO COM BETONEIRA 400 L. AF_07/2016","M3",2,1,2,null,null,0,0,""]
["S",3,"S",0,2,5,3,0,0,0,0,"","Serviço","Serviço","-","SINAPI",92873,"LANÇAMENTO COM USO DE BALDES, ADENSAMENTO E ACABAMENTO DE CONCRETO EM ESTRUTURAS. AF_12/2015","M3",2,1,2,null,null,0,0,"Referência: AGETOP - 60801"]
["S",3,"S",0,2,5,3,0,0,0,0,"","Serviço","Serviço","-","SINAPI",92776,"ARMAÇÃO DE PILAR OU VIGA DE UMA ESTRUTURA CONVENCIONAL DE CONCRETO ARMADO EM UMA EDIFICAÇÃO TÉRREA OU SOBRADO UTILIZANDO AÇO CA-50 DE 6,3 MM - MONTAGEM. AF_12/2015","KG",27.9,1,27.9,null,null,0,0,"Referência: AGETOP - 60303"]
["S",3,"S",0,2,5,3,0,0,0,0,"","Serviço","Serviço","-","SINAPI",92777,"ARMAÇÃO DE PILAR OU VIGA DE UMA ESTRUTURA CONVENCIONAL DE CONCRETO ARMADO EM UMA EDIFICAÇÃO TÉRREA OU SOBRADO UTILIZANDO AÇO CA-50 DE 8,0 MM - MONTAGEM. AF_12/2015","KG",4.5,1,4.5,null,null,0,0,"Referência: AGETOP - 60304"]
["S",3,"S",0,2,5,3,0,0,0,0,"","Serviço","Serviço","-","SINAPI",92778,"ARMAÇÃO DE PILAR OU VIGA DE UMA ESTRUTURA CONVENCIONAL DE CONCRETO ARMADO EM UMA EDIFICAÇÃO TÉRREA OU SOBRADO UTILIZANDO AÇO CA-50 DE 10,0 MM - MONTAGEM. AF_12/2015","KG",46.8,1,46.8,null,null,0,0,"Referência: AGETOP - 60305"]
["S",3,"S",0,2,5,3,0,0,0,0,"","Serviço","Serviço","-","SINAPI",92779,"ARMAÇÃO DE PILAR OU VIGA DE UMA ESTRUTURA CONVENCIONAL DE CONCRETO ARMADO EM UMA EDIFICAÇÃO TÉRREA OU SOBRADO UTILIZANDO AÇO CA-50 DE 12,5 MM - MONTAGEM. AF_12/2015","KG",34.200000000000003,1,34.200000000000003,null,null,0,0,""]
["S",3,"S",0,2,5,3,0,0,0,0,"","Serviço","Serviço","-","SINAPI",92775,"ARMAÇÃO DE PILAR OU VIGA DE UMA ESTRUTURA CONVENCIONAL DE CONCRETO ARMADO EM UMA EDIFICAÇÃO TÉRREA OU SOBRADO UTILIZANDO AÇO CA-60 DE 5,0 MM - MONTAGEM. AF_12/2015","KG",50.4,1,50.4,null,null,0,0,"Referência: AGETOP - 60314"]
["S",3,"S",0,2,5,3,0,0,0,0,"","Serviço","Serviço","-","SINAPI","74202/1","LAJE PRE-MOLDADA P/FORRO, SOBRECARGA 100KG/M2, VAOS ATE 3,50M/E=8CM, C/LAJOTAS E CAP.C/CONC FCK=20MPA, 3CM, INTER-EIXO 38CM, C/ESCORAMENTO (REAPR.3X) E FERRAGEM NEGATIVA","M2",49.4,1,49.4,null,null,0,0,""]
[2,2,2,32,2,6,0,0,0,155,32,"","Nível 2","Nível 2","-",null,null,"INSTALAÇÕES ELÉTRICAS","-",null,1,"-",null,null,0,0,""]
["S",2,"S",0,2,6,0,0,0,0,0,"","Serviço","Serviço","-","AGETOP",70421,"BUCHA E ARRUELA METALICA DIAM. 3/4\"","PR    ",30,1,30,null,null,0,0,""]
["S",2,"S",0,2,6,0,0,0,0,0,"","Serviço","Serviço","-","AGETOP",70422,"BUCHA E ARRUELA METALICA DIAM. 1\"","PR    ",16,1,16,null,null,0,0,""]
["S",2,"S",0,2,6,0,0,0,0,0,"","Serviço","Serviço","-","AGETOP",70425,"BUCHA E ARRUELA METALICA DIAM. 2\"","PR    ",2,1,2,null,null,0,0,""]
["S",2,"S",0,2,6,0,0,0,0,0,"","Serviço","Serviço","-","SINAPI",96971,"CORDOALHA DE COBRE NU 16 MM², NÃO ENTERRADA, COM ISOLADOR - FORNECIMENTO E INSTALAÇÃO. AF_12/2017","M",10,1,10,null,null,0,0,"Referência: AGETOP - 70541"]
["S",2,"S",0,2,6,0,0,0,0,0,"","Serviço","Serviço","-","SINAPI",91926,"CABO DE COBRE FLEXÍVEL ISOLADO, 2,5 MM², ANTI-CHAMA 450/750 V, PARA CIRCUITOS TERMINAIS - FORNECIMENTO E INSTALAÇÃO. AF_12/2015","M",150,1,150,null,null,0,0,"Referência: AGETOP - 70563"]
["S",2,"S",0,2,6,0,0,0,0,0,"","Serviço","Serviço","-","SINAPI",91929,"CABO DE COBRE FLEXÍVEL ISOLADO, 4 MM², ANTI-CHAMA 0,6/1,0 KV, PARA CIRCUITOS TERMINAIS - FORNECIMENTO E INSTALAÇÃO. AF_12/2015","M",200,1,200,null,null,0,0,"Referência: AGETOP - 70582"]
["S",2,"S",0,2,6,0,0,0,0,0,"","Serviço","Serviço","-","SINAPI",92868,"CAIXA RETANGULAR 4\" X 2\" MÉDIA (1,30 M DO PISO), METÁLICA, INSTALADA EM PAREDE - FORNECIMENTO E INSTALAÇÃO. AF_12/2015","UN",6,1,6,null,null,0,0,"Referência: AGETOP - 70691"]
["S",2,"S",0,2,6,0,0,0,0,0,"","Serviço","Serviço","-","SINAPI",92867,"CAIXA RETANGULAR 4\" X 2\" ALTA (2,00 M DO PISO), METÁLICA, INSTALADA EM PAREDE - FORNECIMENTO E INSTALAÇÃO. AF_12/2015","UN",8,1,8,null,null,0,0,""]
["S",2,"S",0,2,6,0,0,0,0,0,"","Serviço","Serviço","-","SINAPI",91936,"CAIXA OCTOGONAL 4\" X 4\", PVC, INSTALADA EM LAJE - FORNECIMENTO E INSTALAÇÃO. AF_12/2015","UN",8,1,8,null,null,0,0,""]
["S",2,"S",0,2,6,0,0,0,0,0,"","Serviço","Serviço","-","SINAPI",97891,"CAIXA ENTERRADA ELÉTRICA RETANGULAR, EM ALVENARIA COM BLOCOS DE CONCRETO, FUNDO COM BRITA, DIMENSÕES INTERNAS: 0,4X0,4X0,4 M. AF_05/2018","UN",1,1,1,null,null,0,0,""]
["S",2,"S",0,2,6,0,0,0,0,0,"","Serviço","Serviço","-","SINAPI",95817,"CONDULETE DE PVC, TIPO X, PARA ELETRODUTO DE PVC SOLDÁVEL DN 25 MM (3/4''), APARENTE - FORNECIMENTO E INSTALAÇÃO. AF_11/2016","UN",14,1,14,null,null,0,0,""]
["S",2,"S",0,2,6,0,0,0,0,0,"","Serviço","Serviço","-","SINAPI",93653,"DISJUNTOR MONOPOLAR TIPO DIN, CORRENTE NOMINAL DE 10A - FORNECIMENTO E INSTALAÇÃO. AF_04/2016","UN",1,1,1,null,null,0,0,""]
["S",2,"S",0,2,6,0,0,0,0,0,"","Serviço","Serviço","-","SINAPI",93654,"DISJUNTOR MONOPOLAR TIPO DIN, CORRENTE NOMINAL DE 16A - FORNECIMENTO E INSTALAÇÃO. AF_04/2016","UN",1,1,1,null,null,0,0,""]
["S",2,"S",0,2,6,0,0,0,0,0,"","Serviço","Serviço","-","SINAPI",93656,"DISJUNTOR MONOPOLAR TIPO DIN, CORRENTE NOMINAL DE 25A - FORNECIMENTO E INSTALAÇÃO. AF_04/2016","UN",8,1,8,null,null,0,0,""]
["S",2,"S",0,2,6,0,0,0,0,0,"","Serviço","Serviço","-","SINAPI",93673,"DISJUNTOR TRIPOLAR TIPO DIN, CORRENTE NOMINAL DE 50A - FORNECIMENTO E INSTALAÇÃO. AF_04/2016","UN",1,1,1,null,null,0,0,"Referência: AGETOP - 71174"]
["S",2,"S",0,2,6,0,0,0,0,0,"","Serviço","Serviço","-","SINAPI",91867,"ELETRODUTO RÍGIDO ROSCÁVEL, PVC, DN 25 MM (3/4\"), PARA CIRCUITOS TERMINAIS, INSTALADO EM LAJE - FORNECIMENTO E INSTALAÇÃO. AF_12/2015","M",25,1,25,null,null,0,0,"Referência: AGETOP - 71201"]
["S",2,"S",0,2,6,0,0,0,0,0,"","Serviço","Serviço","-","SINAPI",91871,"ELETRODUTO RÍGIDO ROSCÁVEL, PVC, DN 25 MM (3/4\"), PARA CIRCUITOS TERMINAIS, INSTALADO EM PAREDE - FORNECIMENTO E INSTALAÇÃO. AF_12/2015","M",10,1,10,null,null,0,0,"Referência: AGETOP - 71201"]
["S",2,"S",0,2,6,0,0,0,0,0,"","Serviço","Serviço","-","SINAPI",91872,"ELETRODUTO RÍGIDO ROSCÁVEL, PVC, DN 32 MM (1\"), PARA CIRCUITOS TERMINAIS, INSTALADO EM PAREDE - FORNECIMENTO E INSTALAÇÃO. AF_12/2015","M",12,1,12,null,null,0,0,"Referência: AGETOP - 71202"]
["S",2,"S",0,2,6,0,0,0,0,0,"","Serviço","Serviço","-","AGETOP",71331,"FITA ISOLANTE, ROLO DE 20,00 M","Un    ",2,1,2,null,null,0,0,""]
["S",2,"S",0,2,6,0,0,0,0,0,"","Serviço","Serviço","-","SINAPI",91953,"INTERRUPTOR SIMPLES (1 MÓDULO), 10A/250V, INCLUINDO SUPORTE E PLACA - FORNECIMENTO E INSTALAÇÃO. AF_12/2015","UN",2,1,2,null,null,0,0,"Referência: AGETOP - 71440"]
["S",2,"S",0,2,6,0,0,0,0,0,"","Serviço","Serviço","-","COMPOSIÇÃO","COMP 387_SEE","LÂMPADA LED TUBULAR 18W ","UN ",16,1,16,null,null,0,0,""]
["S",2,"S",0,2,6,0,0,0,0,0,"","Serviço","Serviço","-","SINAPI",97585,"LUMINÁRIA TIPO CALHA, DE SOBREPOR, COM 2 LÂMPADAS TUBULARES DE 18 W - FORNECIMENTO E INSTALAÇÃO. AF_11/2017","UN",8,1,8,null,null,0,0,""]
["S",2,"S",0,2,6,0,0,0,0,0,"","Serviço","Serviço","-","SINAPI",91879,"LUVA PARA ELETRODUTO, PVC, ROSCÁVEL, DN 25 MM (3/4\"), PARA CIRCUITOS TERMINAIS, INSTALADA EM LAJE - FORNECIMENTO E INSTALAÇÃO. AF_12/2015","UN",12,1,12,null,null,0,0,"Referência: AGETOP - 71741"]
["S",2,"S",0,2,6,0,0,0,0,0,"","Serviço","Serviço","-","SINAPI",91884,"LUVA PARA ELETRODUTO, PVC, ROSCÁVEL, DN 25 MM (3/4\"), PARA CIRCUITOS TERMINAIS, INSTALADA EM PAREDE - FORNECIMENTO E INSTALAÇÃO. AF_12/2015","UN",6,1,6,null,null,0,0,"Referência: AGETOP - 71741"]
["S",2,"S",0,2,6,0,0,0,0,0,"","Serviço","Serviço","-","SINAPI",91885,"LUVA PARA ELETRODUTO, PVC, ROSCÁVEL, DN 32 MM (1\"), PARA CIRCUITOS TERMINAIS, INSTALADA EM PAREDE - FORNECIMENTO E INSTALAÇÃO. AF_12/2015","UN",8,1,8,null,null,0,0,"Referência: AGETOP - 71742"]
["S",2,"S",0,2,6,0,0,0,{"$f":"IF(OR($C557=\"S\",$C557=0),0,MATCH(0,OFFSET($D557,1,$C557,ROW($C$830)-ROW($C557)),0))","v":0},{"$f":"IF(OR($C557=\"S\",$C557=0),0,MATCH(OFFSET($D557,0,$C557)+1,OFFSET($D557,1,$C557,ROW($C$830)-ROW($C557)),0))","v":0},"","Serviço","Serviço","-","SINAPI",91902,"CURVA 90 GRAUS PARA ELETRODUTO, PVC, ROSCÁVEL, DN 25 MM (3/4\"), PARA CIRCUITOS TERMINAIS, INSTALADA EM LAJE - FORNECIMENTO E INSTALAÇÃO. AF_12/2015","UN",9,1,9,null,null,0,0,"Referência: AGETOP - 71141"]
["S",2,"S",0,2,6,0,0,0,0,0,"","Serviço","Serviço","-","SINAPI",91905,"CURVA 90 GRAUS PARA ELETRODUTO, PVC, ROSCÁVEL, DN 32 MM (1\"), PARA CIRCUITOS TERMINAIS, INSTALADA EM LAJE - FORNECIMENTO E INSTALAÇÃO. AF_12/2015","UN",4,1,4,null,null,0,0,"Referência: AGETOP - 71142"]
["S",2,"S",0,2,6,0,0,0,0,0,"","Serviço","Serviço","-","AGETOP",71450,"INTERRUPTOR DIFERENCIAL RESIDUAL (D.R.) BIPOLAR DE 25A-30mA","Un    ",9,1,9,null,null,0,0,""]
["S",2,"S",0,2,6,0,0,0,0,0,"","Serviço","Serviço","-","SINAPI","74131/4","QUADRO DE DISTRIBUICAO DE ENERGIA DE EMBUTIR, EM CHAPA METALICA, PARA 18 DISJUNTORES TERMOMAGNETICOS MONOPOLARES, COM BARRAMENTO TRIFASICO E NEUTRO, FORNECIMENTO E INSTALACAO","UN",1,1,1,null,null,0,0,""]
["S",2,"S",0,2,6,0,0,0,0,0,"","Serviço","Serviço","-","SINAPI",91996,"TOMADA MÉDIA DE EMBUTIR (1 MÓDULO), 2P+T 10 A, INCLUINDO SUPORTE E PLACA - FORNECIMENTO E INSTALAÇÃO. AF_12/2015","UN",4,1,4,null,null,0,0,"Referência: AGETOP - 72578"]
["S",2,"S",0,2,6,0,0,0,0,0,"","Serviço","Serviço","-","SINAPI",91993,"TOMADA ALTA DE EMBUTIR (1 MÓDULO), 2P+T 20 A, INCLUINDO SUPORTE E PLACA - FORNECIMENTO E INSTALAÇÃO. AF_12/2015","UN",8,1,8,null,null,0,0,"Referência: AGETOP - 72585"]
[2,2,2,77,2,7,0,0,0,123,77,"","Nível 2","Nível 2","-","AGETOP",null,"INSTALAÇÕES HIDROSSANITÁRIAS","-",null,1,"-",null,null,0,0,""]
["S",2,"S",0,2,7,0,0,0,0,0,"","Serviço","Serviço","-","SINAPI",95470,"VASO SANITARIO SIFONADO CONVENCIONAL COM LOUÇA BRANCA, INCLUSO CONJUNTO DE LIGAÇÃO PARA BACIA SANITÁRIA AJUSTÁVEL - FORNECIMENTO E INSTALAÇÃO. AF_10/2016","UN",4,1,4,null,null,0,0,""]
["S",2,"S",0,2,7,0,0,0,0,0,"","Serviço","Serviço","-","SINAPI",99635,"VÁLVULA DE DESCARGA METÁLICA, BASE 1 1/2 \", ACABAMENTO METALICO CROMADO - FORNECIMENTO E INSTALAÇÃO. AF_01/2019","UN",4,1,4,null,null,0,0,"Referência: AGETOP - 80515"]
["S",2,"S",0,2,7,0,0,0,0,0,"","Serviço","Serviço","-","AGETOP",80513,"TUBO PARA VÁLVULA DE DESCARGA ( CURTO 1.1/4\" )","Un    ",4,1,4,null,null,0,0,""]
["S",2,"S",0,2,7,0,0,0,0,0,"","Serviço","Serviço","-","AGETOP",80520,"CONJUNTO DE FIXACAO P/VASO SANITARIO (PAR)","CJ    ",4,1,4,null,null,0,0,""]
["S",2,"S",0,2,7,0,0,0,0,0,"","Serviço","Serviço","-","AGETOP",80514,"TUBO DE LIGACAO PVC CROMADO 1.1/2\" / ESPUDE  - (ENTRADA)","Un    ",4,1,4,null,null,0,0,""]
["S",2,"S",0,2,7,0,0,0,0,0,"","Serviço","Serviço","-","AGETOP",80526,"ASSENTO EM POLIPROPILENO COM SISTEMA DE FECHAMENTO SUAVE PARA VASO SANITÁRIO","Un    ",4,1,4,null,null,0,0,""]
["S",2,"S",0,2,7,0,0,0,0,0,"","Serviço","Serviço","-","SINAPI",95544,"PAPELEIRA DE PAREDE EM METAL CROMADO SEM TAMPA, INCLUSO FIXAÇÃO. AF_10/2016","UN",4,1,4,null,null,0,0,""]
["S",2,"S",0,2,7,0,0,0,0,0,"","Serviço","Serviço","-","AGETOP",80510,"ANEL DE VEDAÇÃO PARA VASO SANITÁRIO","Un    ",4,1,4,null,null,0,0,""]
["S",2,"S",0,2,7,0,0,0,0,0,"","Serviço","Serviço","-","SINAPI",86903,"LAVATÓRIO LOUÇA BRANCA COM COLUNA, 45 X 55CM OU EQUIVALENTE, PADRÃO MÉDIO - FORNECIMENTO E INSTALAÇÃO. AF_12/2013","UN",6,1,6,null,null,0,0,"Referência: AGETOP - 80541"]
["S",2,"S",0,2,7,0,0,0,0,0,"","Serviço","Serviço","-","AGETOP",80550,"FIXACAO P/LAVATORIO (PAR)","PAR   ",6,1,6,null,null,0,0,""]
["S",2,"S",0,2,7,0,0,0,0,0,"","Serviço","Serviço","-","AGETOP",80556,"LIGAÇÃO FLEXÍVEL PVC DIAM.1/2\" (ENGATE)","Un    ",8,1,8,null,null,0,0,""]
["S",2,"S",0,2,7,0,0,0,0,0,"","Serviço","Serviço","-","SINAPI",86883,"SIFÃO DO TIPO FLEXÍVEL EM PVC 1\u0094 X 1.1/2\u0094 - FORNECIMENTO E INSTALAÇÃO. AF_12/2013","UN",8,1,8,null,null,0,0,""]
["S",2,"S",0,2,7,0,0,0,0,0,"","Serviço","Serviço","-","SINAPI",86915,"TORNEIRA CROMADA DE MESA, 1/2\" OU 3/4\", PARA LAVATÓRIO, PADRÃO MÉDIO - FORNECIMENTO E INSTALAÇÃO. AF_12/2013","UN",8,1,8,null,null,0,0,"Referência: AGETOP - 80570"]
["S",2,"S",0,2,7,0,0,0,0,0,"","Serviço","Serviço","-","SINAPI",86877,"VÁLVULA EM METAL CROMADO 1.1/2\" X 1.1/2\" PARA TANQUE OU LAVATÓRIO, COM OU SEM LADRÃO - FORNECIMENTO E INSTALAÇÃO. AF_12/2013","UN",8,1,8,null,null,0,0,""]
["S",2,"S",0,2,7,0,0,0,0,0,"","Serviço","Serviço","-","SINAPI",86901,"CUBA DE EMBUTIR OVAL EM LOUÇA BRANCA, 35 X 50CM OU EQUIVALENTE - FORNECIMENTO E INSTALAÇÃO. AF_12/2013","UN",2,1,2,null,null,0,0,"Referência: AGETOP - 80587"]
["S",2,"S",0,2,7,0,0,0,0,0,"","Serviço","Serviço","-","SINAPI","74234/1","MICTORIO SIFONADO DE LOUCA BRANCA COM PERTENCES, COM REGISTRO DE PRESSAO 1/2\" COM CANOPLA CROMADA ACABAMENTO SIMPLES E CONJUNTO PARA FIXACAO  - FORNECIMENTO E INSTALACAO","UN",2,1,2,null,null,0,0,"Referência: AGETOP - 80601"]
["S",2,"S",0,2,7,0,0,0,0,0,"","Serviço","Serviço","-","AGETOP",80610,"KIT FERR.P/MICT.LOUCA (ESPUDE,CONEXÃO ENTR.PARAFUSOS)","Un    ",2,1,2,null,null,0,0,""]
["S",2,"S",0,2,7,0,0,0,0,0,"","Serviço","Serviço","-","AGETOP",80613,"SIFÃO METÁLICO 1 1/2\" X 2\" P/MICTÓRIO","Un    ",2,1,2,null,null,0,0,""]
["S",2,"S",0,2,7,0,0,0,0,0,"","Serviço","Serviço","-","AGETOP",80620,"VÁLVULA PVC DE 1\" P/MICTÓRIO TIPO COCHO","Un    ",2,1,2,null,null,0,0,""]
["S",2,"S",0,2,7,0,0,0,0,0,"","Serviço","Serviço","-","SINAPI",9535,"CHUVEIRO ELETRICO COMUM CORPO PLASTICO TIPO DUCHA, FORNECIMENTO E INSTALACAO","UN",8,1,8,null,null,0,0,""]
["S",2,"S",0,2,7,0,0,0,0,0,"","Serviço","Serviço","-","AGETOP",80730,"CABIDE TIPO GANCHO EM LOUÇA","Un    ",8,1,8,null,null,0,0,""]
["S",2,"S",0,2,7,0,0,0,0,0,"","Serviço","Serviço","-","SINAPI",88571,"SABONETEIRA DE SOBREPOR (FIXADA NA PAREDE), TIPO CONCHA, EM ACO INOXIDAVEL - FORNECIMENTO E INSTALACAO","UN",8,1,8,null,null,0,0,"Referência: AGETOP - 80741"]
["S",2,"S",0,2,7,0,0,0,0,0,"","Serviço","Serviço","-","SINAPI",89987,"REGISTRO DE GAVETA BRUTO, LATÃO, ROSCÁVEL, 3/4\", COM ACABAMENTO E CANOPLA CROMADOS. FORNECIDO E INSTALADO EM RAMAL DE ÁGUA. AF_12/2014","UN",9,1,9,null,null,0,0,"Referência: AGETOP - 80926"]
["S",2,"S",0,2,7,0,0,0,0,0,"","Serviço","Serviço","-","SINAPI",94792,"REGISTRO DE GAVETA BRUTO, LATÃO, ROSCÁVEL, 1\u0094, COM ACABAMENTO E CANOPLA CROMADOS, INSTALADO EM RESERVAÇÃO DE ÁGUA DE EDIFICAÇÃO QUE POSSUA RESERVATÓRIO DE FIBRA/FIBROCIMENTO \u0096 FORNECIMENTO E INSTALAÇÃO. AF_06/2016","UN",2,1,2,null,null,0,0,"Referência: AGETOP - 80927"]
["S",2,"S",0,2,7,0,0,0,0,0,"","Serviço","Serviço","-","SINAPI",89985,"REGISTRO DE PRESSÃO BRUTO, LATÃO, ROSCÁVEL, 3/4\", COM ACABAMENTO E CANOPLA CROMADOS. FORNECIDO E INSTALADO EM RAMAL DE ÁGUA. AF_12/2014","UN",8,1,8,null,null,0,0,"Referência: AGETOP - 80926"]
["S",2,"S",0,2,7,0,0,0,0,0,"","Serviço","Serviço","-","SINAPI",89402,"TUBO, PVC, SOLDÁVEL, DN 25MM, INSTALADO EM RAMAL DE DISTRIBUIÇÃO DE ÁGUA - FORNECIMENTO E INSTALAÇÃO. AF_12/2014","M",42,1,42,null,null,0,0,"Referência: AGETOP - 81003"]
["S",2,"S",0,2,7,0,0,0,0,0,"","Serviço","Serviço","-","SINAPI",89447,"TUBO, PVC, SOLDÁVEL, DN 32MM, INSTALADO EM PRUMADA DE ÁGUA - FORNECIMENTO E INSTALAÇÃO. AF_12/2014","M",15,1,15,null,null,0,0,""]
["S",2,"S",0,2,7,0,0,0,0,0,"","Serviço","Serviço","-","SINAPI",89449,"TUBO, PVC, SOLDÁVEL, DN 50MM, INSTALADO EM PRUMADA DE ÁGUA - FORNECIMENTO E INSTALAÇÃO. AF_12/2014","M",15,1,15,null,null,0,0,""]
["S",2,"S",0,2,7,0,0,0,0,0,"","Serviço","Serviço","-","SINAPI",89450,"TUBO, PVC, SOLDÁVEL, DN 60MM, INSTALADO EM PRUMADA DE ÁGUA - FORNECIMENTO E INSTALAÇÃO. AF_12/2014","M",72,1,72,null,null,0,0,""]
["S",2,"S",0,2,7,0,0,0,0,0,"","Serviço","Serviço","-","SINAPI",89538,"ADAPTADOR CURTO COM BOLSA E ROSCA PARA REGISTRO, PVC, SOLDÁVEL, DN 25MM X 3/4\u0094, INSTALADO EM PRUMADA DE ÁGUA - FORNECIMENTO E INSTALAÇÃO. AF_12/2014","UN",26,1,26,null,null,0,0,""]
["S",2,"S",0,2,7,0,0,0,0,0,"","Serviço","Serviço","-","SINAPI",89553,"ADAPTADOR CURTO COM BOLSA E ROSCA PARA REGISTRO, PVC, SOLDÁVEL, DN 32MM X 1\u0094, INSTALADO EM PRUMADA DE ÁGUA - FORNECIMENTO E INSTALAÇÃO. AF_12/2014","UN",4,1,4,null,null,0,0,"Referência: AGETOP - 81067"]
["S",2,"S",0,2,7,0,0,0,0,0,"","Serviço","Serviço","-","SINAPI",89596,"ADAPTADOR CURTO COM BOLSA E ROSCA PARA REGISTRO, PVC, SOLDÁVEL, DN 50MM X 1.1/2\u0094, INSTALADO EM PRUMADA DE ÁGUA - FORNECIMENTO E INSTALAÇÃO. AF_12/2014","UN",4,1,4,null,null,0,0,"Referência: AGETOP - 81069"]
["S",2,"S",0,2,7,0,0,0,0,0,"","Serviço","Serviço","-","AGETOP",81145,"LUVA RED.SOLDAVEL C/BUCHA LATAO DIAM.25 X 1/2\"","Un    ",4,1,4,null,null,0,0,""]
["S",2,"S",0,2,7,0,0,0,0,0,"","Serviço","Serviço","-","SINAPI",96662,"BUCHA DE REDUÇÃO, PPR, 32 X 25, CLASSE PN 25, INSTALADO EM RAMAL DE DISTRIBUIÇÃO DE ÁGUA \u0096 FORNECIMENTO E INSTALAÇÃO . AF_06/2015","UN",3,1,3,null,null,0,0,""]
["S",2,"S",0,2,7,0,0,0,0,0,"","Serviço","Serviço","-","SINAPI",89605,"LUVA DE REDUÇÃO, PVC, SOLDÁVEL, DN 60MM X 50MM, INSTALADO EM PRUMADA DE ÁGUA - FORNECIMENTO E INSTALAÇÃO. AF_12/2014","UN",4,1,4,null,null,0,0,""]
["S",2,"S",0,2,7,0,0,0,0,0,"","Serviço","Serviço","-","SINAPI",89579,"LUVA DE REDUÇÃO, PVC, SOLDÁVEL, DN 50MM X 25MM, INSTALADO EM PRUMADA DE ÁGUA   FORNECIMENTO E INSTALAÇÃO. AF_12/2014","UN",4,1,4,null,null,0,0,""]
["S",2,"S",0,2,7,0,0,0,0,0,"","Serviço","Serviço","-","AGETOP",81180,"BUCHA DE REDUCAO SOLDAVEL LONGA 50 X 32 mm","Un    ",3,1,3,null,null,0,0,""]
["S",2,"S",0,2,7,0,0,0,0,0,"","Serviço","Serviço","-","AGETOP",81182,"BUCHA DE REDUCAO SOLDAVEL LONGA 60 X 32 mm","Un    ",2,1,2,null,null,0,0,""]
["S",2,"S",0,2,7,0,0,0,0,0,"","Serviço","Serviço","-","SINAPI",89481,"JOELHO 90 GRAUS, PVC, SOLDÁVEL, DN 25MM, INSTALADO EM PRUMADA DE ÁGUA - FORNECIMENTO E INSTALAÇÃO. AF_12/2014","UN",25,1,25,null,null,0,0,""]
["S",2,"S",0,2,7,0,0,0,0,0,"","Serviço","Serviço","-","SINAPI",89413,"JOELHO 90 GRAUS, PVC, SOLDÁVEL, DN 32MM, INSTALADO EM RAMAL DE DISTRIBUIÇÃO DE ÁGUA - FORNECIMENTO E INSTALAÇÃO. AF_12/2014","UN",6,1,6,null,null,0,0,""]
["S",2,"S",0,2,7,0,0,0,0,0,"","Serviço","Serviço","-","SINAPI",89501,"JOELHO 90 GRAUS, PVC, SOLDÁVEL, DN 50MM, INSTALADO EM PRUMADA DE ÁGUA - FORNECIMENTO E INSTALAÇÃO. AF_12/2014","UN",9,1,9,null,null,0,0,""]
["S",2,"S",0,2,7,0,0,0,0,0,"","Serviço","Serviço","-","AGETOP",81325,"JOELHO 90 GRAUS SOLDAVEL DIAMETRO 60 mm","Un    ",2,1,2,null,null,0,0,""]
["S",2,"S",0,2,7,0,0,0,0,0,"","Serviço","Serviço","-","AGETOP",81360,"JOELHO RED.90 GRAUS SOLD.C/BUCHA LATAO 25X1/2\"","Un    ",16,1,16,null,null,0,0,""]
["S",2,"S",0,2,7,0,0,0,0,0,"","Serviço","Serviço","-","SINAPI",89617,"TE, PVC, SOLDÁVEL, DN 25MM, INSTALADO EM PRUMADA DE ÁGUA - FORNECIMENTO E INSTALAÇÃO. AF_12/2014","UN",1,1,1,null,null,0,0,""]
["S",2,"S",0,2,7,0,0,0,0,0,"","Serviço","Serviço","-","SINAPI",89443,"TE, PVC, SOLDÁVEL, DN 32MM, INSTALADO EM RAMAL DE DISTRIBUIÇÃO DE ÁGUA - FORNECIMENTO E INSTALAÇÃO. AF_12/2014","UN",1,1,1,null,null,0,0,"Referência: AGETOP - 81403"]
["S",2,"S",0,2,7,0,0,0,0,0,"","Serviço","Serviço","-","SINAPI",89625,"TE, PVC, SOLDÁVEL, DN 50MM, INSTALADO EM PRUMADA DE ÁGUA - FORNECIMENTO E INSTALAÇÃO. AF_12/2014","UN",4,1,4,null,null,0,0,""]
["S",2,"S",0,2,7,0,0,0,0,0,"","Serviço","Serviço","-","SINAPI",89628,"TE, PVC, SOLDÁVEL, DN 60MM, INSTALADO EM PRUMADA DE ÁGUA - FORNECIMENTO E INSTALAÇÃO. AF_12/2014","UN",5,1,5,null,null,0,0,"Referência: AGETOP - 81406"]
["S",2,"S",0,2,7,0,0,0,0,0,"","Serviço","Serviço","-","AGETOP",81421,"TE REDUCAO 90 GRAUS SOLDAVEL 32 X 25 mm","Un    ",6,1,6,null,null,0,0,""]
["S",2,"S",0,2,7,0,0,0,0,0,"","Serviço","Serviço","-","AGETOP",81444,"TE 90 GR.SOLD.C/BUC.LATAO NA BOLSA CENT.25X25X3/4\"","Un    ",3,1,3,null,null,0,0,""]
["S",2,"S",0,2,7,0,0,0,0,0,"","Serviço","Serviço","-","AGETOP",81501,"ADESIVO PLASTICO - FRASCO 850 G","Un    ",1,1,1,null,null,0,0,""]
["S",2,"S",0,2,7,0,0,0,0,0,"","Serviço","Serviço","-","AGETOP",81504,"SOLUCAO LIMPADORA 1000 CM3","Un    ",1,1,1,null,null,0,0,""]
["S",2,"S",0,2,7,0,0,0,0,0,"","Serviço","Serviço","-","AGETOP",81664,"CORPO CX. SIFONADA DIAM. 150 X 185 X 75","Un    ",4,1,4,null,null,0,0,""]
["S",2,"S",0,2,7,0,0,0,0,0,"","Serviço","Serviço","-","AGETOP",81679,"CORPO RALO SIFONADO CONICO DIAM. 100 X 40","Un    ",6,1,6,null,null,0,0,""]
["S",2,"S",0,2,7,0,0,0,0,0,"","Serviço","Serviço","-","AGETOP",81730,"CURVA 90 GRAUS CURTA DIAM. 40 MM","Un    ",18,1,18,null,null,0,0,""]
["S",2,"S",0,2,7,0,0,0,0,0,"","Serviço","Serviço","-","AGETOP",81733,"CURVA 90 GRAUS CURTA DIAM. 100 MM","Un    ",4,1,4,null,null,0,0,""]
["S",2,"S",0,2,7,0,0,0,0,0,"","Serviço","Serviço","-","SINAPI",89726,"JOELHO 45 GRAUS, PVC, SERIE NORMAL, ESGOTO PREDIAL, DN 40 MM, JUNTA SOLDÁVEL, FORNECIDO E INSTALADO EM RAMAL DE DESCARGA OU RAMAL DE ESGOTO SANITÁRIO. AF_12/2014","UN",20,1,20,null,null,0,0,""]
["S",2,"S",0,2,7,0,0,0,0,0,"","Serviço","Serviço","-","SINAPI",89802,"JOELHO 45 GRAUS, PVC, SERIE NORMAL, ESGOTO PREDIAL, DN 50 MM, JUNTA ELÁSTICA, FORNECIDO E INSTALADO EM PRUMADA DE ESGOTO SANITÁRIO OU VENTILAÇÃO. AF_12/2014","UN",2,1,2,null,null,0,0,""]
["S",2,"S",0,2,7,0,0,0,{"$f":"IF(OR($C621=\"S\",$C621=0),0,MATCH(0,OFFSET($D621,1,$C621,ROW($C$830)-ROW($C621)),0))","v":0},{"$f":"IF(OR($C621=\"S\",$C621=0),0,MATCH(OFFSET($D621,0,$C621)+1,OFFSET($D621,1,$C621,ROW($C$830)-ROW($C621)),0))","v":0},"","Serviço","Serviço","-","SINAPI",89724,"JOELHO 90 GRAUS, PVC, SERIE NORMAL, ESGOTO PREDIAL, DN 40 MM, JUNTA SOLDÁVEL, FORNECIDO E INSTALADO EM RAMAL DE DESCARGA OU RAMAL DE ESGOTO SANITÁRIO. AF_12/2014","UN",12,1,12,null,null,0,0,""]
["S",2,"S",0,2,7,0,0,0,0,0,"","Serviço","Serviço","-","SINAPI",89731,"JOELHO 90 GRAUS, PVC, SERIE NORMAL, ESGOTO PREDIAL, DN 50 MM, JUNTA ELÁSTICA, FORNECIDO E INSTALADO EM RAMAL DE DESCARGA OU RAMAL DE ESGOTO SANITÁRIO. AF_12/2014","UN",4,1,4,null,null,0,0,""]
["S",2,"S",0,2,7,0,0,0,0,0,"","Serviço","Serviço","-","SINAPI",89809,"JOELHO 90 GRAUS, PVC, SERIE NORMAL, ESGOTO PREDIAL, DN 100 MM, JUNTA ELÁSTICA, FORNECIDO E INSTALADO EM PRUMADA DE ESGOTO SANITÁRIO OU VENTILAÇÃO. AF_12/2014","UN",1,1,1,null,null,0,0,""]
["S",2,"S",0,2,7,0,0,0,0,0,"","Serviço","Serviço","-","SINAPI",89752,"LUVA SIMPLES, PVC, SERIE NORMAL, ESGOTO PREDIAL, DN 40 MM, JUNTA SOLDÁVEL, FORNECIDO E INSTALADO EM RAMAL DE DESCARGA OU RAMAL DE ESGOTO SANITÁRIO. AF_12/2014","UN",2,1,2,null,null,0,0,"Referência: AGETOP - 82001"]
["S",2,"S",0,2,7,0,0,0,0,0,"","Serviço","Serviço","-","SINAPI",89825,"TE, PVC, SERIE NORMAL, ESGOTO PREDIAL, DN 50 X 50 MM, JUNTA ELÁSTICA, FORNECIDO E INSTALADO EM PRUMADA DE ESGOTO SANITÁRIO OU VENTILAÇÃO. AF_12/2014","UN",6,1,6,null,null,0,0,""]
["S",2,"S",0,2,7,0,0,0,0,0,"","Serviço","Serviço","-","AGETOP",82231,"TE SANITARIO DIAMETRO 75 X 50 MM","Un    ",4,1,4,null,null,0,0,""]
["S",2,"S",0,2,7,0,0,0,0,0,"","Serviço","Serviço","-","AGETOP",82233,"TE SANITARIO DIAMETRO 100 X 50 MM","Un    ",4,1,4,null,null,0,0,""]
["S",2,"S",0,2,7,0,0,0,0,0,"","Serviço","Serviço","-","SINAPI",89711,"TUBO PVC, SERIE NORMAL, ESGOTO PREDIAL, DN 40 MM, FORNECIDO E INSTALADO EM RAMAL DE DESCARGA OU RAMAL DE ESGOTO SANITÁRIO. AF_12/2014","M",31,1,31,null,null,0,0,"Referência: AGETOP - 82301"]
["S",2,"S",0,2,7,0,0,0,0,0,"","Serviço","Serviço","-","SINAPI",89798,"TUBO PVC, SERIE NORMAL, ESGOTO PREDIAL, DN 50 MM, FORNECIDO E INSTALADO EM PRUMADA DE ESGOTO SANITÁRIO OU VENTILAÇÃO. AF_12/2014","M",18,1,18,null,null,0,0,""]
["S",2,"S",0,2,7,0,0,0,0,0,"","Serviço","Serviço","-","SINAPI",89799,"TUBO PVC, SERIE NORMAL, ESGOTO PREDIAL, DN 75 MM, FORNECIDO E INSTALADO EM PRUMADA DE ESGOTO SANITÁRIO OU VENTILAÇÃO. AF_12/2014","M",18,1,18,null,null,0,0,""]
["S",2,"S",0,2,7,0,0,0,0,0,"","Serviço","Serviço","-","SINAPI",89800,"TUBO PVC, SERIE NORMAL, ESGOTO PREDIAL, DN 100 MM, FORNECIDO E INSTALADO EM PRUMADA DE ESGOTO SANITÁRIO OU VENTILAÇÃO. AF_12/2014","M",38,1,38,null,null,0,0,""]
["S",2,"S",0,2,7,0,0,0,0,0,"","Serviço","Serviço","-","AGETOP",82377,"TUBO FERRO GALV.DIAM.1.1/2\"","m     ",2.66,1,2.66,null,null,0,0,""]
["S",2,"S",0,2,7,0,0,0,0,0,"","Serviço","Serviço","-","AGETOP",81792,"GRELHA REDONDA CROMADA DIAM.100 MM","Un    ",6,1,6,null,null,0,0,""]
["S",2,"S",0,2,7,0,0,0,0,0,"","Serviço","Serviço","-","AGETOP",81752,"GRELHA QUADRADA ACO INOX ROTATIVO DIAM.150 MM","Un    ",4,1,4,null,null,0,0,""]
["S",2,"S",0,2,7,0,0,0,0,0,"","Serviço","Serviço","-","AGETOP",81825,"CAIXA DE PASSAGEM 60 X 60 CM SEM TAMPA","Un    ",2,1,2,null,null,0,0,""]
["S",2,"S",0,2,7,0,0,0,0,0,"","Serviço","Serviço","-","AGETOP",81885,"TERMINAL DE VENTILACAO DIAMETRO 50 MM","Un    ",2,1,2,null,null,0,0,""]
["S",2,"S",0,2,7,0,0,0,0,0,"","Serviço","Serviço","-","AGETOP",81823,"TAMPA PARA CAIXA PASSAGEM FERRO FUNDIDO T-33 - TRÁFEGO PESADO","Un    ",2,1,2,null,null,0,0,""]
["S",2,"S",0,2,7,0,0,0,0,0,"","Serviço","Serviço","-","AGETOP",82052,"PORTA GRELHA QUADRADO CROMADO DIAM.150 MM","Un    ",4,1,4,null,null,0,0,""]
["S",2,"S",0,2,7,0,0,0,0,0,"","Serviço","Serviço","-","AGETOP",82055,"PORTA GRELHA QUADRADO P/GRELHA RED.CROM.DIAM.100 M","Un    ",6,1,6,null,null,0,0,""]
[2,2,2,4,2,8,0,0,0,46,4,"","Nível 2","Nível 2","-",null,null,"ALVENARIAS E DIVISÓRIAS","-",null,1,"-",null,null,0,0,""]
["S",2,"S",0,2,8,0,0,0,0,0,"","Serviço","Serviço","-","SINAPI",87520,"ALVENARIA DE VEDAÇÃO DE BLOCOS CERÂMICOS FURADOS NA HORIZONTAL DE 9X19X19CM (ESPESSURA 9CM) DE PAREDES COM ÁREA LÍQUIDA MAIOR OU IGUAL A 6M² COM VÃOS E ARGAMASSA DE ASSENTAMENTO COM PREPARO MANUAL. AF_06/2014","M2",50.47,1,50.47,null,null,0,0,"Referência: AGETOP - 100201"]
["S",2,"S",0,2,8,0,0,0,0,0,"","Serviço","Serviço","-","SINAPI",79627,"DIVISORIA EM GRANITO BRANCO POLIDO, ESP = 3CM, ASSENTADO COM ARGAMASSA TRACO 1:4, ARREMATE EM CIMENTO BRANCO, EXCLUSIVE FERRAGENS","M2",0.56000000000000005,1,0.56000000000000005,null,null,0,0,"Referência: AGETOP - 100320"]
["S",2,"S",0,2,8,0,0,0,0,0,"","Serviço","Serviço","-","AGETOP",100602,"ALVENARIA DE TIJOLO LAMINADO 1/2 VEZ  - ARG. (1CI : 1CH : 5ARML)","m2    ",51.39,1,51.39,null,null,0,0,""]
[2,2,2,3,2,9,0,0,0,42,3,"","Nível 2","Nível 2","-",null,null,"IMPERMEABILIZAÇÃO","-",null,1,"-",null,null,0,0,""]
["S",2,"S",0,2,9,0,0,0,0,0,"","Serviço","Serviço","-","SINAPI",98562,"IMPERMEABILIZAÇÃO DE FLOREIRA OU VIGA BALDRAME COM ARGAMASSA DE CIMENTO E AREIA, COM ADITIVO IMPERMEABILIZANTE, E = 2 CM. AF_06/2018","M2",40.36,1,40.36,null,null,0,0,"Referência: AGETOP - 120902"]
["S",2,"S",0,2,9,0,0,0,0,0,"","Serviço","Serviço","-","AGETOP",120208,"IMPERMEABILIZACAO-ARGAM. SINT.SEMI - FLEXIVEL","m2    ",102.62,1,102.62,null,null,0,0,""]
[2,2,2,2,2,10,0,0,0,39,2,"","Nível 2","Nível 2","-",null,null,"ESTRUTURA DE MADEIRA","-",null,1,"-",null,null,0,0,""]
["S",2,"S",0,2,10,0,0,0,0,0,"","Serviço","Serviço","-","SINAPI",92543,"TRAMA DE MADEIRA COMPOSTA POR TERÇAS PARA TELHADOS DE ATÉ 2 ÁGUAS PARA TELHA ONDULADA DE FIBROCIMENTO, METÁLICA, PLÁSTICA OU TERMOACÚSTICA, INCLUSO TRANSPORTE VERTICAL. AF_07/2019","M2",51.15,1,51.15,null,null,0,0,""]
[2,2,2,4,2,11,0,0,0,37,4,"","Nível 2","Nível 2","-",null,null,"COBERTURAS","-",null,1,"-",null,null,0,0,""]
["S",2,"S",0,2,11,0,0,0,0,0,"","Serviço","Serviço","-","AGETOP",160966,"COBERTURA COM TELHA GALVANIZADA ONDULADA 0,5 MM COM ACESSÓRIOS","m2    ",51.15,1,51.15,null,null,0,0,""]
["S",2,"S",0,2,11,0,0,0,0,0,"","Serviço","Serviço","-","SINAPI",94228,"CALHA EM CHAPA DE AÇO GALVANIZADO NÚMERO 24, DESENVOLVIMENTO DE 50 CM, INCLUSO TRANSPORTE VERTICAL. AF_07/2019","M",10.45,1,10.45,null,null,0,0,"Referência: AGETOP - 160601"]
["S",2,"S",0,2,11,0,0,0,0,0,"","Serviço","Serviço","-","SINAPI",94231,"RUFO EM CHAPA DE AÇO GALVANIZADO NÚMERO 24, CORTE DE 25 CM, INCLUSO TRANSPORTE VERTICAL. AF_07/2019","M",20.079999999999998,1,20.079999999999998,null,null,0,0,"Referência: AGETOP - 160602"]
[2,2,2,4,2,12,0,0,0,33,4,"","Nível 2","Nível 2","-",null,null,"ESQUADRIAS METÁLICAS","-",null,1,"-",null,null,0,0,""]
["S",2,"S",0,2,12,0,0,0,0,0,"","Serviço","Serviço","-","SINAPI",94559,"JANELA DE AÇO BASCULANTE, FIXAÇÃO COM ARGAMASSA, SEM VIDROS, PADRONIZADA. AF_07/2016","M2",6.28,1,6.28,null,null,0,0,"Referência: AGETOP - 180404"]
["S",2,"S",0,2,12,0,0,0,0,0,"","Serviço","Serviço","-","SINAPI","73933/4","PORTA DE FERRO DE ABRIR TIPO BARRA CHATA, COM REQUADRO E GUARNICAO COMPLETA","M2",3.78,1,3.78,null,null,0,0,""]
["S",2,"S",0,2,12,0,0,0,0,0,"","Serviço","Serviço","-","SINAPI","73933/4","PORTA DE FERRO DE ABRIR TIPO BARRA CHATA, COM REQUADRO E GUARNICAO COMPLETA","M2",10.24,1,10.24,null,null,0,0,""]
[2,2,2,2,2,13,0,0,0,29,2,"","Nível 2","Nível 2","-",null,null,"VIDROS","-",null,1,"-",null,null,0,0,""]
["S",2,"S",0,2,13,0,0,0,0,0,"","Serviço","Serviço","-","SINAPI",72122,"VIDRO FANTASIA TIPO CANELADO, ESPESSURA 4MM","M2",6.28,1,6.28,null,null,0,0,""]
[2,2,2,5,2,14,0,0,0,27,5,"","Nível 2","Nível 2","-",null,null,"REVESTIMENTO DE PAREDE","-",null,1,"-",null,null,0,0,""]
["S",2,"S",0,2,14,0,0,0,0,0,"","Serviço","Serviço","-","SINAPI",87553,"EMBOÇO, PARA RECEBIMENTO DE CERÂMICA, EM ARGAMASSA TRAÇO 1:2:8, PREPARO MECÂNICO COM BETONEIRA 400L, APLICADO MANUALMENTE EM FACES INTERNAS DE PAREDES, PARA AMBIENTE COM ÁREA MAIOR QUE 10M2, ESPESSURA DE 10MM, COM EXECUÇÃO DE TALISCAS. AF_06/2014","M2",155.1,1,155.1,null,null,0,0,""]
["S",2,"S",0,2,14,0,0,0,0,0,"","Serviço","Serviço","-","SINAPI",87904,"CHAPISCO APLICADO EM ALVENARIA (COM PRESENÇA DE VÃOS) E ESTRUTURAS DE CONCRETO DE FACHADA, COM COLHER DE PEDREIRO.  ARGAMASSA TRAÇO 1:3 COM PREPARO MANUAL. AF_06/2014","M2",185.94,1,185.94,null,null,0,0,"Referência: AGETOP - 200101"]
["S",2,"S",0,2,14,0,0,0,0,0,"","Serviço","Serviço","-","SINAPI",87547,"MASSA ÚNICA, PARA RECEBIMENTO DE PINTURA, EM ARGAMASSA TRAÇO 1:2:8, PREPARO MECÂNICO COM BETONEIRA 400L, APLICADA MANUALMENTE EM FACES INTERNAS DE PAREDES, ESPESSURA DE 10MM, COM EXECUÇÃO DE TALISCAS. AF_06/2014","M2",30.84,1,30.84,null,null,0,0,""]
["S",2,"S",0,2,14,0,0,0,0,0,"","Serviço","Serviço","-","SINAPI",87273,"REVESTIMENTO CERÂMICO PARA PAREDES INTERNAS COM PLACAS TIPO ESMALTADA EXTRA DE DIMENSÕES 33X45 CM APLICADAS EM AMBIENTES DE ÁREA MAIOR QUE 5 M² NA ALTURA INTEIRA DAS PAREDES. AF_06/2014","M2",155.1,1,155.1,null,null,0,0,""]
[2,2,2,3,2,15,0,0,0,22,3,"","Nível 2","Nível 2","-",null,null,"FORROS","-",null,1,"-",null,null,0,0,""]
["S",2,"S",0,2,15,0,0,0,0,0,"","Serviço","Serviço","-","SINAPI",87884,"CHAPISCO APLICADO NO TETO, COM ROLO PARA TEXTURA ACRÍLICA. ARGAMASSA INDUSTRIALIZADA COM PREPARO MANUAL. AF_06/2014","M2",50.82,1,50.82,null,null,0,0,"Referência: AGETOP - 210102"]
["S",2,"S",0,2,15,0,0,0,0,0,"","Serviço","Serviço","-","SINAPI",87414,"APLICAÇÃO MANUAL DE GESSO DESEMPENADO (SEM TALISCAS) EM TETO DE AMBIENTES DE ÁREA MAIOR QUE 10M², ESPESSURA DE 1,0CM. AF_06/2014","M2",50.82,1,50.82,null,null,0,0,"Referência: AGETOP - 210515"]
[2,2,2,5,2,16,0,0,0,19,5,"","Nível 2","Nível 2","-",null,null,"REVESTIMENTO DE PISO","-",null,1,"-",null,null,0,0,""]
["S",2,"S",0,2,16,0,0,0,0,0,"","Serviço","Serviço","-","AGETOP",220101,"LASTRO DE CONCRETO REGULARIZADO IMPERMEABILIZADO 1:3:6 ESP=5CM (BASE)","m2    ",47.26,1,47.26,null,null,0,0,""]
["S",2,"S",0,2,16,0,0,0,0,0,"","Serviço","Serviço","-","SINAPI",87251,"REVESTIMENTO CERÂMICO PARA PISO COM PLACAS TIPO ESMALTADA EXTRA DE DIMENSÕES 45X45 CM APLICADA EM AMBIENTES DE ÁREA MAIOR QUE 10 M2. AF_06/2014","M2",47.26,1,47.26,null,null,0,0,""]
["S",2,"S",0,2,16,0,0,0,0,0,"","Serviço","Serviço","-","SINAPI",94992,"EXECUÇÃO DE PASSEIO (CALÇADA) OU PISO DE CONCRETO COM CONCRETO MOLDADO IN LOCO, FEITO EM OBRA, ACABAMENTO CONVENCIONAL, ESPESSURA 6 CM, ARMADO. AF_07/2016","M2",17.62,1,17.62,null,null,0,0,""]
["S",2,"S",0,2,16,0,0,0,0,0,"","Serviço","Serviço","-","AGETOP",220902,"RODAPE DE MASSA (ICI:3 ARMG)","m     ",27.11,1,27.11,null,null,0,0,""]
[2,2,2,3,2,17,0,0,0,14,3,"","Nível 2","Nível 2","-",null,null,"FERRAGENS","-",null,1,"-",null,null,0,0,""]
["S",2,"S",0,2,17,0,0,0,0,0,"","Serviço","Serviço","-","AGETOP",230174,"BARRA DE APOIO EM AÇO INOX - 40 CM","un    ",6,1,6,null,null,0,0,""]
["S",2,"S",0,2,17,0,0,0,0,0,"","Serviço","Serviço","-","AGETOP",230176,"BARRA DE APOIO EM AÇO INOX - 80 CM ","un    ",12,1,12,null,null,0,0,""]
[2,2,2,7,2,18,0,0,0,11,7,"","Nível 2","Nível 2","-",null,null,"PINTURA","-",null,1,"-",null,null,0,0,""]
["S",2,"S",0,2,18,0,0,0,0,0,"","Serviço","Serviço","-","SINAPI",88497,"APLICAÇÃO E LIXAMENTO DE MASSA LÁTEX EM PAREDES, DUAS DEMÃOS. AF_06/2014","M2",10.82,1,10.82,null,null,0,0,"Referência: AGETOP - 261300"]
["S",2,"S",0,2,18,0,0,0,0,0,"","Serviço","Serviço","-","SINAPI",88494,"APLICAÇÃO E LIXAMENTO DE MASSA LÁTEX EM TETO, UMA DEMÃO. AF_06/2014","M2",50.82,1,50.82,null,null,0,0,""]
["S",2,"S",0,2,18,0,0,0,0,0,"","Serviço","Serviço","-","SINAPI",88486,"APLICAÇÃO MANUAL DE PINTURA COM TINTA LÁTEX PVA EM TETO, DUAS DEMÃOS. AF_06/2014","M2",50.82,1,50.82,null,null,0,0,"Referência: AGETOP - 261307"]
["S",2,"S",0,2,18,0,0,0,0,0,"","Serviço","Serviço","-","AGETOP",260801,"PINTURA A BASE DE SILICONE 1 DEMAO","m2    ",51.39,1,51.39,null,null,0,0,""]
["S",2,"S",0,2,18,0,0,0,0,0,"","Serviço","Serviço","-","SINAPI",88489,"APLICAÇÃO MANUAL DE PINTURA COM TINTA LÁTEX ACRÍLICA EM PAREDES, DUAS DEMÃOS. AF_06/2014","M2",30.84,1,30.84,null,null,0,0,"Referência: AGETOP - 261001"]
["S",2,"S",0,2,18,0,0,0,0,0,"","Serviço","Serviço","-","SINAPI","74145/1","PINTURA ESMALTE FOSCO, DUAS DEMAOS, SOBRE SUPERFICIE METALICA, INCLUSO UMA DEMAO DE FUNDO ANTICORROSIVO. UTILIZACAO DE REVOLVER ( AR-COMPRIMIDO).","M2",54.62,1,54.62,null,null,0,0,"Referência: AGETOP - 261602"]
[2,2,2,4,2,19,0,0,0,4,{"$error":"#N/A"},"","Nível 2","Nível 2","-",null,null,"DIVERSOS","-",null,1,"-",null,null,0,0,""]
["S",2,"S",0,2,19,0,0,0,0,0,"","Serviço","Serviço","-","AGETOP",271307,"BANCO CONCRETO POLIDO BASE EM ALVENARIA TIJOLO APARENTE PINTADA - PADRÃO GOINFRA ","M     ",8.06,1,8.06,null,null,0,0,""]
["S",2,"S",0,2,19,0,0,0,0,0,"","Serviço","Serviço","-","AGETOP",271608,"BANCADA DE GRANITO C/ESPELHO","m2    ",0.41,1,0.41,null,null,0,0,""]
["S",2,"S",0,2,19,0,0,0,{"$f":"IF(OR($C685=\"S\",$C685=0),0,MATCH(0,OFFSET($D685,1,$C685,ROW($C$830)-ROW($C685)),0))","v":0},{"$f":"IF(OR($C685=\"S\",$C685=0),0,MATCH(OFFSET($D685,0,$C685)+1,OFFSET($D685,1,$C685,ROW($C$830)-ROW($C685)),0))","v":0},"","Serviço","Serviço","-","AGETOP",270501,"LIMPEZA FINAL DE OBRA - (OBRAS CIVIS)","m2    ",55.42,1,55.42,null,null,0,0,""]
[1,1,1,108,3,0,0,0,0,144,108,"F","Nível 1","Nível 1","3.","SINAPI",null,"PÁTIO MULTIUSO - PADRÃO SEDUC - OPÇÃO 03","UN",1,1,1,null,null,0,0,""]
[2,2,2,2,3,1,0,0,0,107,2,"","Nível 2","Nível 2","-","SINAPI",null,"SERVIÇOS PRELIMINARES","-",null,1,"-",null,null,0,0,""]
["S",2,"S",0,3,1,0,0,0,0,0,"","Serviço","Serviço","-","AGETOP",20701,"LOCAÇÃO DA OBRA, EXECUÇÃO DE GABARITO SEM REAPROVEITAMENTO, INCLUSO PINTURA (FACE INTERNA DO RIPÃO 15CM) E PIQUETE COM TESTEMUNHA","m2    ",133.97999999999999,1,133.97999999999999,null,null,0,0,""]
[2,2,2,3,3,2,0,0,0,105,3,"","Nível 2","Nível 2","-","SINAPI",null,"TRANSPORTES","-",null,1,"-",null,null,0,0,""]
["S",2,"S",0,3,2,0,0,0,0,0,"","Serviço","Serviço","-","SINAPI",72897,"CARGA MANUAL DE ENTULHO EM CAMINHAO BASCULANTE 6 M3","M3",9.3699999999999992,1,9.3699999999999992,null,null,0,0,""]
[{"$f":"CHOOSE(1+LOG(1+2*(ORÇAMENTO.Nivel=\"Nível 1\")+4*(ORÇAMENTO.Nivel=\"Nível 2\")+8*(ORÇAMENTO.Nivel=\"Nível 3\")+16*(ORÇAMENTO.Nivel=\"Nível 4\")+32*(ORÇAMENTO.Nivel=\"Serviço\"),2),0,1,2,3,4,\"S\")","v":"S"},2,"S",0,3,2,0,0,{"$f":"IF(AND($C691<=4,$C691<>0),0,IF(AND($C691=\"S\",$Y691>0),OFFSET(I691,-1,0)+1,OFFSET(I691,-1,0)))","v":0},0,0,"","Serviço","Serviço","-","SINAPI",72900,"TRANSPORTE DE ENTULHO COM CAMINHAO BASCULANTE 6 M3, RODOVIA PAVIMENTADA, DMT 0,5 A 1,0 KM","M3",9.3699999999999992,1,9.3699999999999992,null,null,0,0,""]
[2,2,2,3,3,3,0,0,0,102,3,"","Nível 2","Nível 2","-","SINAPI",null,"SERVIÇO EM TERRA","-",null,1,"-",null,null,0,0,""]
["S",2,"S",0,3,3,0,0,0,0,0,"","Serviço","Serviço","-","SINAPI",93358,"ESCAVAÇÃO MANUAL DE VALA COM PROFUNDIDADE MENOR OU IGUAL A 1,30 M. AF_03/2016","M3",6.69,1,6.69,null,null,0,0,"Referência: AGETOP - 40101"]
["S",2,"S",0,{"$f":"IF($C694=1,OFFSET(E694,-1,0)+1,OFFSET(E694,-1,0))","v":3},{"$f":"IF($C694=1,0,IF($C694=2,OFFSET(F694,-1,0)+1,OFFSET(F694,-1,0)))","v":3},{"$f":"IF(AND($C694<=2,$C694<>0),0,IF($C694=3,OFFSET(G694,-1,0)+1,OFFSET(G694,-1,0)))","v":0},{"$f":"IF(AND($C694<=3,$C694<>0),0,IF($C694=4,OFFSET(H694,-1,0)+1,OFFSET(H694,-1,0)))","v":0},0,0,0,"","Serviço","Serviço","-","AGETOP",41002,"APILOAMENTO","m2    ",133.97999999999999,1,133.97999999999999,null,null,0,0,""]
[2,2,2,11,3,4,0,0,0,99,11,"","Nível 2","Nível 2","-","SINAPI",null,"FUNDAÇÕES E SONDAGENS","-",null,1,"-",null,null,0,0,""]
["S",2,"S",0,3,4,0,0,0,0,0,"","Serviço","Serviço","-","SINAPI",98230,"ESTACA BROCA DE CONCRETO, DIÂMETRO DE 30 CM, PROFUNDIDADE DE ATÉ 3 M, ESCAVAÇÃO MANUAL COM TRADO CONCHA, NÃO ARMADA. AF_03/2018","M",49,1,49,null,null,0,0,"Referência: AGETOP - 50302"]
["S",2,"S",0,3,4,0,0,0,0,0,"","Serviço","Serviço","-","SINAPI",96521,"ESCAVAÇÃO MECANIZADA PARA BLOCO DE COROAMENTO OU SAPATA, COM PREVISÃO DE FÔRMA, COM RETROESCAVADEIRA. AF_06/2017","M3",4.8600000000000003,1,4.8600000000000003,null,null,0,0,""]
["S",2,"S",0,3,4,0,0,0,0,0,"","Serviço","Serviço","-","SINAPI",93382,"REATERRO MANUAL DE VALAS COM COMPACTAÇÃO MECANIZADA. AF_04/2016","M3",0.36,1,0.36,null,null,0,0,"Referência: AGETOP - 40904"]
["S",2,"S",0,3,4,0,0,0,0,0,"","Serviço","Serviço","-","SINAPI",96534,"FABRICAÇÃO, MONTAGEM E DESMONTAGEM DE FÔRMA PARA BLOCO DE COROAMENTO, EM MADEIRA SERRADA, E=25 MM, 4 UTILIZAÇÕES. AF_06/2017","M2",4.5,1,4.5,null,null,0,0,"Referência: AGETOP - 51009"]
["S",{"$f":"IF(OR(C700=\"s\",C700=0),OFFSET(B700,-1,0),C700)","v":2},{"$f":"IF(OFFSET(C700,-1,0)=\"L\",1,IF(OFFSET(C700,-1,0)=1,2,IF(OR(A700=\"s\",A700=0),\"S\",IF(AND(OFFSET(C700,-1,0)=2,A700=4),3,IF(AND(OR(OFFSET(C700,-1,0)=\"s\",OFFSET(C700,-1,0)=0),A700<>\"s\",A700>OFFSET(B700,-1,0)),OFFSET(B700,-1,0),A700)))))","v":"S"},{"$f":"IF(OR(C700=\"S\",C700=0),0,IF(ISERROR(K700),J700,SMALL(J700:K700,1)))","v":0},3,4,0,0,0,0,0,"","Serviço","Serviço","-","SINAPI",94963,"CONCRETO FCK = 15MPA, TRAÇO 1:3,4:3,5 (CIMENTO/ AREIA MÉDIA/ BRITA 1)  - PREPARO MECÂNICO COM BETONEIRA 400 L. AF_07/2016","M3",0.23,1,0.23,null,null,0,0,""]
["S",2,"S",0,3,4,0,0,0,0,0,"","Serviço","Serviço","-","SINAPI",94964,"CONCRETO FCK = 20MPA, TRAÇO 1:2,7:3 (CIMENTO/ AREIA MÉDIA/ BRITA 1)  - PREPARO MECÂNICO COM BETONEIRA 400 L. AF_07/2016","M3",2.7,1,2.7,null,null,0,0,""]
["S",2,"S",0,3,4,0,0,0,0,0,"","Serviço","Serviço","-","SINAPI",92874,"LANÇAMENTO COM USO DE BOMBA, ADENSAMENTO E ACABAMENTO DE CONCRETO EM ESTRUTURAS. AF_12/2015","M3",2.93,1,2.93,null,null,0,0,""]
["S",2,"S",0,3,4,0,0,0,0,0,"","Serviço","Serviço","-","SINAPI",96544,"ARMAÇÃO DE BLOCO, VIGA BALDRAME OU SAPATA UTILIZANDO AÇO CA-50 DE 6,3 MM - MONTAGEM. AF_06/2017","KG",33,1,33,null,null,0,0,"Referência: AGETOP - 52003"]
["S",2,"S",0,3,4,0,0,0,0,0,"","Serviço","Serviço","-","SINAPI",96545,"ARMAÇÃO DE BLOCO, VIGA BALDRAME OU SAPATA UTILIZANDO AÇO CA-50 DE 8 MM - MONTAGEM. AF_06/2017","KG",148,1,148,null,null,0,0,"Referência: AGETOP - 52004"]
["S",2,"S",0,3,4,0,0,0,0,0,"","Serviço","Serviço","-","SINAPI",96543,"ARMAÇÃO DE BLOCO, VIGA BALDRAME E SAPATA UTILIZANDO AÇO CA-60 DE 5 MM - MONTAGEM. AF_06/2017","KG",26,1,26,null,null,0,0,"Referência: AGETOP - 52014"]
[2,2,2,8,3,5,0,0,0,88,8,"","Nível 2","Nível 2","-","SINAPI",null,"ESTRUTURA","-",null,1,"-",null,null,0,0,""]
["S",2,"S",0,3,5,0,0,0,0,0,"","Serviço","Serviço","-","SINAPI",92415,"MONTAGEM E DESMONTAGEM DE FÔRMA DE PILARES RETANGULARES E ESTRUTURAS SIMILARES COM ÁREA MÉDIA DAS SEÇÕES MAIOR QUE 0,25 M², PÉ-DIREITO SIMPLES, EM CHAPA DE MADEIRA COMPENSADA RESINADA, 2 UTILIZAÇÕES. AF_12/2015","M2",40.270000000000003,1,40.270000000000003,null,null,0,0,""]
["S",2,"S",0,3,5,0,0,0,0,0,"","Serviço","Serviço","-","AGETOP",60192,"FORMA DE TABUA CINTA/PILAR SOBRE/ENTRE ALVENARIA U=8 VEZES","m2    ",93.44,1,93.44,null,null,0,0,""]
["S",2,"S",0,3,5,0,0,0,0,0,"","Serviço","Serviço","-","SINAPI",92777,"ARMAÇÃO DE PILAR OU VIGA DE UMA ESTRUTURA CONVENCIONAL DE CONCRETO ARMADO EM UMA EDIFICAÇÃO TÉRREA OU SOBRADO UTILIZANDO AÇO CA-50 DE 8,0 MM - MONTAGEM. AF_12/2015","KG",104,1,104,null,null,0,0,"Referência: AGETOP - 60304"]
["S",2,"S",0,3,5,0,0,0,0,0,"","Serviço","Serviço","-","SINAPI",92778,"ARMAÇÃO DE PILAR OU VIGA DE UMA ESTRUTURA CONVENCIONAL DE CONCRETO ARMADO EM UMA EDIFICAÇÃO TÉRREA OU SOBRADO UTILIZANDO AÇO CA-50 DE 10,0 MM - MONTAGEM. AF_12/2015","KG",295,1,295,null,null,0,0,"Referência: AGETOP - 60305"]
["S",2,"S",0,3,5,0,0,0,0,0,"","Serviço","Serviço","-","SINAPI",92775,"ARMAÇÃO DE PILAR OU VIGA DE UMA ESTRUTURA CONVENCIONAL DE CONCRETO ARMADO EM UMA EDIFICAÇÃO TÉRREA OU SOBRADO UTILIZANDO AÇO CA-60 DE 5,0 MM - MONTAGEM. AF_12/2015","KG",143,1,143,null,null,0,0,"Referência: AGETOP - 60314"]
["S",2,"S",0,3,5,0,0,0,0,0,"","Serviço","Serviço","-","SINAPI",94964,"CONCRETO FCK = 20MPA, TRAÇO 1:2,7:3 (CIMENTO/ AREIA MÉDIA/ BRITA 1)  - PREPARO MECÂNICO COM BETONEIRA 400 L. AF_07/2016","M3",5.08,1,5.08,null,null,0,0,""]
["S",2,"S",0,3,5,0,0,0,0,0,"","Serviço","Serviço","-","SINAPI",92874,"LANÇAMENTO COM USO DE BOMBA, ADENSAMENTO E ACABAMENTO DE CONCRETO EM ESTRUTURAS. AF_12/2015","M3",5.08,1,5.08,null,null,0,0,""]
[2,2,2,18,3,6,0,0,0,80,18,"","Nível 2","Nível 2","-","SINAPI",null,"INSTALAÇÕES ELÉTRICAS","-",null,1,"-",null,null,0,0,""]
["S",2,"S",0,3,6,0,0,0,0,0,"","Serviço","Serviço","-","AGETOP",70351,"BRACADEIRA METALICA TIPO \"U\" DIAM. 3/4\"","Un    ",30,1,30,null,null,0,0,""]
["S",2,"S",0,3,6,0,0,0,0,0,"","Serviço","Serviço","-","AGETOP",70421,"BUCHA E ARRUELA METALICA DIAM. 3/4\"","PR    ",15,1,15,null,null,0,0,""]
["S",2,"S",0,3,6,0,0,0,0,0,"","Serviço","Serviço","-","SINAPI",91927,"CABO DE COBRE FLEXÍVEL ISOLADO, 2,5 MM², ANTI-CHAMA 0,6/1,0 KV, PARA CIRCUITOS TERMINAIS - FORNECIMENTO E INSTALAÇÃO. AF_12/2015","M",210,1,210,null,null,0,0,"Referência: AGETOP - 70581"]
["S",2,"S",0,3,6,0,0,0,0,0,"","Serviço","Serviço","-","SINAPI",91936,"CAIXA OCTOGONAL 4\" X 4\", PVC, INSTALADA EM LAJE - FORNECIMENTO E INSTALAÇÃO. AF_12/2015","UN",12,1,12,null,null,0,0,""]
["S",2,"S",0,3,6,0,0,0,0,0,"","Serviço","Serviço","-","SINAPI",91940,"CAIXA RETANGULAR 4\" X 2\" MÉDIA (1,30 M DO PISO), PVC, INSTALADA EM PAREDE - FORNECIMENTO E INSTALAÇÃO. AF_12/2015","UN",5,1,5,null,null,0,0,""]
["S",2,"S",0,3,6,0,0,0,0,0,"","Serviço","Serviço","-","SINAPI",95817,"CONDULETE DE PVC, TIPO X, PARA ELETRODUTO DE PVC SOLDÁVEL DN 25 MM (3/4''), APARENTE - FORNECIMENTO E INSTALAÇÃO. AF_11/2016","UN",5,1,5,null,null,0,0,""]
["S",2,"S",0,3,6,0,0,0,0,0,"","Serviço","Serviço","-","SINAPI",91914,"CURVA 90 GRAUS PARA ELETRODUTO, PVC, ROSCÁVEL, DN 25 MM (3/4\"), PARA CIRCUITOS TERMINAIS, INSTALADA EM PAREDE - FORNECIMENTO E INSTALAÇÃO. AF_12/2015","UN",5,1,5,null,null,0,0,""]
["S",2,"S",0,3,6,0,0,0,0,0,"","Serviço","Serviço","-","SINAPI",93654,"DISJUNTOR MONOPOLAR TIPO DIN, CORRENTE NOMINAL DE 16A - FORNECIMENTO E INSTALAÇÃO. AF_04/2016","UN",4,1,4,null,null,0,0,""]
["S",2,"S",0,3,6,0,0,0,0,0,"","Serviço","Serviço","-","SINAPI",93671,"DISJUNTOR TRIPOLAR TIPO DIN, CORRENTE NOMINAL DE 32A - FORNECIMENTO E INSTALAÇÃO. AF_04/2016","UN",1,1,1,null,null,0,0,"Referência: AGETOP - 71173"]
["S",2,"S",0,3,6,0,0,0,0,0,"","Serviço","Serviço","-","SINAPI",91871,"ELETRODUTO RÍGIDO ROSCÁVEL, PVC, DN 25 MM (3/4\"), PARA CIRCUITOS TERMINAIS, INSTALADO EM PAREDE - FORNECIMENTO E INSTALAÇÃO. AF_12/2015","M",45,1,45,null,null,0,0,"Referência: AGETOP - 71201"]
["S",2,"S",0,3,6,0,0,0,0,0,"","Serviço","Serviço","-","SINAPI",91981,"INTERRUPTOR BIPOLAR (1 MÓDULO), 10A/250V, INCLUINDO SUPORTE E PLACA - FORNECIMENTO E INSTALAÇÃO. AF_09/2017","UN",3,1,3,null,null,0,0,""]
["S",2,"S",0,3,6,0,0,0,0,0,"","Serviço","Serviço","-","SINAPI",91967,"INTERRUPTOR SIMPLES (3 MÓDULOS), 10A/250V, INCLUINDO SUPORTE E PLACA - FORNECIMENTO E INSTALAÇÃO. AF_12/2015","UN",1,1,1,null,null,0,0,"Referência: AGETOP - 71442"]
["S",2,"S",0,3,6,0,0,0,0,0,"","Serviço","Serviço","-","SINAPI",97610,"LÂMPADA COMPACTA DE LED 10 W, BASE E27 - FORNECIMENTO E INSTALAÇÃO. AF_11/2017","UN",24,1,24,null,null,0,0,""]
["S",2,"S",0,3,6,0,0,0,0,0,"","Serviço","Serviço","-","SINAPI",97591,"LUMINÁRIA TIPO PLAFON REDONDO COM VIDRO FOSCO, DE SOBREPOR, COM 2 LÂMPADAS DE 15 W - FORNECIMENTO E INSTALAÇÃO. AF_11/2017","UN",12,1,12,null,null,0,0,""]
["S",2,"S",0,3,6,0,0,0,0,0,"","Serviço","Serviço","-","SINAPI",91884,"LUVA PARA ELETRODUTO, PVC, ROSCÁVEL, DN 25 MM (3/4\"), PARA CIRCUITOS TERMINAIS, INSTALADA EM PAREDE - FORNECIMENTO E INSTALAÇÃO. AF_12/2015","UN",15,1,15,null,null,0,0,"Referência: AGETOP - 71741"]
["S",2,"S",0,3,6,0,0,0,0,0,"","Serviço","Serviço","-","SINAPI",91996,"TOMADA MÉDIA DE EMBUTIR (1 MÓDULO), 2P+T 10 A, INCLUINDO SUPORTE E PLACA - FORNECIMENTO E INSTALAÇÃO. AF_12/2015","UN",3,1,3,null,null,0,0,"Referência: AGETOP - 72578"]
["S",2,"S",0,3,6,0,0,0,0,0,"","Serviço","Serviço","-","SINAPI",91997,"TOMADA MÉDIA DE EMBUTIR (1 MÓDULO), 2P+T 20 A, INCLUINDO SUPORTE E PLACA - FORNECIMENTO E INSTALAÇÃO. AF_12/2015","UN",1,1,1,null,null,0,0,""]
[2,2,2,31,3,7,0,0,0,62,31,"","Nível 2","Nível 2","-","SINAPI",null,"INSTALAÇÕES HIDROSSANITÁRIAS","-",null,1,"-",null,null,0,0,""]
[3,3,3,10,3,7,1,0,0,30,10,"","Nível 3","Nível 3","-","SINAPI",null,"PEÇAS E ACESSÓRIOS","-",null,1,"-",null,null,0,0,""]
["S",3,"S",0,3,7,1,0,0,0,0,"","Serviço","Serviço","-","AGETOP",81501,"ADESIVO PLASTICO - FRASCO 850 G","Un    ",2,1,2,null,null,0,0,""]
["S",3,"S",0,3,7,1,0,0,0,0,"","Serviço","Serviço","-","AGETOP",81504,"SOLUCAO LIMPADORA 1000 CM3","Un    ",2,1,2,null,null,0,0,""]
["S",3,"S",0,3,7,1,0,0,0,0,"","Serviço","Serviço","-","AGETOP",81825,"CAIXA DE PASSAGEM 60 X 60 CM SEM TAMPA","Un    ",1,1,1,null,null,0,0,""]
["S",3,"S",0,3,7,1,0,0,0,0,"","Serviço","Serviço","-","SINAPI",6171,"TAMPA DE CONCRETO ARMADO 60X60X5CM PARA CAIXA","UN",1,1,1,null,null,0,0,""]
["S",3,"S",0,3,7,1,0,0,0,0,"","Serviço","Serviço","-","SINAPI",86901,"CUBA DE EMBUTIR OVAL EM LOUÇA BRANCA, 35 X 50CM OU EQUIVALENTE - FORNECIMENTO E INSTALAÇÃO. AF_12/2013","UN",2,1,2,null,null,0,0,"Referência: AGETOP - 80587"]
["S",3,"S",0,3,7,1,0,0,0,0,"","Serviço","Serviço","-","AGETOP",80556,"LIGAÇÃO FLEXÍVEL PVC DIAM.1/2\" (ENGATE)","Un    ",2,1,2,null,null,0,0,""]
["S",3,"S",0,3,7,1,0,0,0,0,"","Serviço","Serviço","-","AGETOP",80562,"SIFAO FLEXIVEL UNIVERSAL ( SANFONADO) EM PVC PARA LAVATORIO","Un    ",2,1,2,null,null,0,0,""]
["S",3,"S",0,3,7,1,0,0,0,0,"","Serviço","Serviço","-","SINAPI",86877,"VÁLVULA EM METAL CROMADO 1.1/2\" X 1.1/2\" PARA TANQUE OU LAVATÓRIO, COM OU SEM LADRÃO - FORNECIMENTO E INSTALAÇÃO. AF_12/2013","UN",2,1,2,null,null,0,0,""]
["S",3,"S",0,3,7,1,0,0,0,0,"","Serviço","Serviço","-","AGETOP",80570,"TORNEIRA DE MESA PARA LAVATÓRIO DIÂMETRO DE 1/2\"","Un    ",2,1,2,null,null,0,0,""]
[3,3,3,12,3,7,2,0,0,20,12,"","Nível 3","Nível 3","-",null,null,"ÁGUA FRIA","-",null,1,"-",null,null,0,0,""]
["S",3,"S",0,3,7,2,0,0,0,0,"","Serviço","Serviço","-","AGETOP",80927,"REGISTRO DE GAVETA C/CANOPLA DIAMETRO 1\"","Un    ",1,1,1,null,null,0,0,""]
["S",3,"S",0,3,7,2,0,0,0,0,"","Serviço","Serviço","-","SINAPI",89402,"TUBO, PVC, SOLDÁVEL, DN 25MM, INSTALADO EM RAMAL DE DISTRIBUIÇÃO DE ÁGUA - FORNECIMENTO E INSTALAÇÃO. AF_12/2014","M",3,1,3,null,null,0,0,"Referência: AGETOP - 81003"]
["S",3,"S",0,3,7,2,0,0,0,0,"","Serviço","Serviço","-","SINAPI",89447,"TUBO, PVC, SOLDÁVEL, DN 32MM, INSTALADO EM PRUMADA DE ÁGUA - FORNECIMENTO E INSTALAÇÃO. AF_12/2014","M",6,1,6,null,null,0,0,""]
["S",3,"S",0,3,7,2,0,0,0,0,"","Serviço","Serviço","-","SINAPI",94709,"ADAPTADOR COM FLANGES LIVRES, PVC, SOLDÁVEL, DN 32 MM X 1 , INSTALADO EM RESERVAÇÃO DE ÁGUA DE EDIFICAÇÃO QUE POSSUA RESERVATÓRIO DE FIBRA/FIBROCIMENTO   FORNECIMENTO E INSTALAÇÃO. AF_06/2016","UN",2,1,2,null,null,0,0,"Referência: AGETOP - 81042"]
["S",3,"S",0,3,7,2,0,0,0,0,"","Serviço","Serviço","-","SINAPI",96662,"BUCHA DE REDUÇÃO, PPR, 32 X 25, CLASSE PN 25, INSTALADO EM RAMAL DE DISTRIBUIÇÃO DE ÁGUA \u0096 FORNECIMENTO E INSTALAÇÃO . AF_06/2015","UN",1,1,1,null,null,0,0,""]
["S",3,"S",0,3,7,2,0,0,{"$f":"IF(OR($C749=\"S\",$C749=0),0,MATCH(0,OFFSET($D749,1,$C749,ROW($C$830)-ROW($C749)),0))","v":0},{"$f":"IF(OR($C749=\"S\",$C749=0),0,MATCH(OFFSET($D749,0,$C749)+1,OFFSET($D749,1,$C749,ROW($C$830)-ROW($C749)),0))","v":0},"","Serviço","Serviço","-","SINAPI",89481,"JOELHO 90 GRAUS, PVC, SOLDÁVEL, DN 25MM, INSTALADO EM PRUMADA DE ÁGUA - FORNECIMENTO E INSTALAÇÃO. AF_12/2014","UN",1,1,1,null,null,0,0,""]
["S",3,"S",0,3,7,2,0,0,0,0,"","Serviço","Serviço","-","AGETOP",81341,"JOELHO 90 GRAUS ROSCAVEL 1/2\" (MARROM)","Un    ",3,1,3,null,null,0,0,""]
["S",3,"S",0,3,7,2,0,0,0,0,"","Serviço","Serviço","-","AGETOP",81342,"JOELHO 90 GRAUS ROSCAVEL DIAMETRO 3/4\"","Un    ",1,1,1,null,null,0,0,""]
["S",3,"S",0,3,7,2,0,0,0,0,"","Serviço","Serviço","-","AGETOP",81322,"JOELHO 90 GRAUS SOLDAVEL DIAMETRO 32 MM (1\")","Un    ",20,1,20,null,null,0,0,""]
["S",3,"S",0,3,7,2,0,0,0,0,"","Serviço","Serviço","-","AGETOP",81421,"TE REDUCAO 90 GRAUS SOLDAVEL 32 X 25 mm","Un    ",2,1,2,null,null,0,0,""]
["S",3,"S",0,3,7,2,0,0,0,0,"","Serviço","Serviço","-","SINAPI",89617,"TE, PVC, SOLDÁVEL, DN 25MM, INSTALADO EM PRUMADA DE ÁGUA - FORNECIMENTO E INSTALAÇÃO. AF_12/2014","UN",1,1,1,null,null,0,0,""]
[{"$f":"CHOOSE(1+LOG(1+2*(ORÇAMENTO.Nivel=\"Nível 1\")+4*(ORÇAMENTO.Nivel=\"Nível 2\")+8*(ORÇAMENTO.Nivel=\"Nível 3\")+16*(ORÇAMENTO.Nivel=\"Nível 4\")+32*(ORÇAMENTO.Nivel=\"Serviço\"),2),0,1,2,3,4,\"S\")","v":3},3,3,8,3,7,3,0,{"$f":"IF(AND($C755<=4,$C755<>0),0,IF(AND($C755=\"S\",$Y755>0),OFFSET(I755,-1,0)+1,OFFSET(I755,-1,0)))","v":0},8,{"$error":"#N/A"},"","Nível 3","Nível 3","-",null,null,"ESGOTO SANITÁRIO","-",null,1,"-",null,null,0,0,""]
["S",3,"S",0,3,7,3,0,0,0,0,"","Serviço","Serviço","-","AGETOP",81663,"CORPO CX. SIFONADA DIAM. 150 X 150 X 50","Un    ",1,1,1,null,null,0,0,""]
["S",3,"S",0,3,7,3,0,0,0,0,"","Serviço","Serviço","-","AGETOP",81752,"GRELHA QUADRADA ACO INOX ROTATIVO DIAM.150 MM","Un    ",1,1,1,null,null,0,0,""]
["S",3,"S",0,{"$f":"IF($C758=1,OFFSET(E758,-1,0)+1,OFFSET(E758,-1,0))","v":3},{"$f":"IF($C758=1,0,IF($C758=2,OFFSET(F758,-1,0)+1,OFFSET(F758,-1,0)))","v":7},{"$f":"IF(AND($C758<=2,$C758<>0),0,IF($C758=3,OFFSET(G758,-1,0)+1,OFFSET(G758,-1,0)))","v":3},{"$f":"IF(AND($C758<=3,$C758<>0),0,IF($C758=4,OFFSET(H758,-1,0)+1,OFFSET(H758,-1,0)))","v":0},0,0,0,"","Serviço","Serviço","-","SINAPI",89726,"JOELHO 45 GRAUS, PVC, SERIE NORMAL, ESGOTO PREDIAL, DN 40 MM, JUNTA SOLDÁVEL, FORNECIDO E INSTALADO EM RAMAL DE DESCARGA OU RAMAL DE ESGOTO SANITÁRIO. AF_12/2014","UN",2,1,2,null,null,0,0,""]
["S",3,"S",0,3,7,3,0,0,0,0,"","Serviço","Serviço","-","SINAPI",89724,"JOELHO 90 GRAUS, PVC, SERIE NORMAL, ESGOTO PREDIAL, DN 40 MM, JUNTA SOLDÁVEL, FORNECIDO E INSTALADO EM RAMAL DE DESCARGA OU RAMAL DE ESGOTO SANITÁRIO. AF_12/2014","UN",3,1,3,null,null,0,0,""]
["S",3,"S",0,3,7,3,0,0,0,0,"","Serviço","Serviço","-","AGETOP",81927,"JOELHO 90 GRAUS C/ANEL 40 mm ","Un    ",3,1,3,null,null,0,0,""]
["S",3,"S",0,3,7,3,0,0,0,0,"","Serviço","Serviço","-","SINAPI",89711,"TUBO PVC, SERIE NORMAL, ESGOTO PREDIAL, DN 40 MM, FORNECIDO E INSTALADO EM RAMAL DE DESCARGA OU RAMAL DE ESGOTO SANITÁRIO. AF_12/2014","M",6,1,6,null,null,0,0,"Referência: AGETOP - 82301"]
["S",3,"S",0,3,7,3,0,0,0,0,"","Serviço","Serviço","-","SINAPI",89798,"TUBO PVC, SERIE NORMAL, ESGOTO PREDIAL, DN 50 MM, FORNECIDO E INSTALADO EM PRUMADA DE ESGOTO SANITÁRIO OU VENTILAÇÃO. AF_12/2014","M",3,1,3,null,null,0,0,""]
[2,2,2,4,3,8,0,0,0,31,4,"","Nível 2","Nível 2","-","SINAPI",null,"ALVENARIAS E DIVISÓRIAS","-",null,1,"-",null,null,0,0,""]
["S",{"$f":"IF(OR(C764=\"s\",C764=0),OFFSET(B764,-1,0),C764)","v":2},{"$f":"IF(OFFSET(C764,-1,0)=\"L\",1,IF(OFFSET(C764,-1,0)=1,2,IF(OR(A764=\"s\",A764=0),\"S\",IF(AND(OFFSET(C764,-1,0)=2,A764=4),3,IF(AND(OR(OFFSET(C764,-1,0)=\"s\",OFFSET(C764,-1,0)=0),A764<>\"s\",A764>OFFSET(B764,-1,0)),OFFSET(B764,-1,0),A764)))))","v":"S"},{"$f":"IF(OR(C764=\"S\",C764=0),0,IF(ISERROR(K764),J764,SMALL(J764:K764,1)))","v":0},3,8,0,0,0,0,0,"","Serviço","Serviço","-","SINAPI",87471,"ALVENARIA DE VEDAÇÃO DE BLOCOS CERÂMICOS FURADOS NA VERTICAL DE 9X19X39CM (ESPESSURA 9CM) DE PAREDES COM ÁREA LÍQUIDA MENOR QUE 6M² SEM VÃOS E ARGAMASSA DE ASSENTAMENTO COM PREPARO EM BETONEIRA. AF_06/2014","M2",56.3,1,56.3,null,null,0,0,""]
["S",2,"S",0,3,8,0,0,0,0,0,"","Serviço","Serviço","-","SINAPI",93202,"FIXAÇÃO (ENCUNHAMENTO) DE ALVENARIA DE VEDAÇÃO COM TIJOLO MACIÇO. AF_03/2016","M",5.6,1,5.6,null,null,0,0,"Referência: AGETOP - 100204"]
["S",2,"S",0,3,8,0,0,0,0,0,"","Serviço","Serviço","-","SINAPI",95465,"COBOGO CERAMICO (ELEMENTO VAZADO), 9X20X20CM, ASSENTADO COM ARGAMASSA TRACO 1:4 DE CIMENTO E AREIA","M2",35.909999999999997,1,35.909999999999997,null,null,0,0,""]
[2,2,2,2,3,9,0,0,0,27,2,"","Nível 2","Nível 2","-","SINAPI",null,"IMPERMEABILIZAÇÃO","-",null,1,"-",null,null,0,0,""]
["S",2,"S",0,3,9,0,0,0,0,0,"","Serviço","Serviço","-","SINAPI",98562,"IMPERMEABILIZAÇÃO DE FLOREIRA OU VIGA BALDRAME COM ARGAMASSA DE CIMENTO E AREIA, COM ADITIVO IMPERMEABILIZANTE, E = 2 CM. AF_06/2018","M2",40.35,1,40.35,null,null,0,0,"Referência: AGETOP - 120902"]
[2,2,2,2,3,10,0,0,0,25,2,"","Nível 2","Nível 2","-",null,null,"ESTRUTURAS METÁLICAS","-",null,1,"-",null,null,0,0,""]
["S",2,"S",0,3,10,0,0,0,0,0,"","Serviço","Serviço","-","AGETOP",150103,"ESTRUTURA METÁLICA CONVENCIONAL EM AÇO DO TIPO USI SAC-300 COM FUNDO ANTICORROSIVO","Kg    ",2414.2600000000002,1,2414.2600000000002,null,null,0,0,""]
[2,2,2,4,3,11,0,0,0,23,4,"","Nível 2","Nível 2","-",null,null,"COBERTURAS","-",null,1,"-",null,null,0,0,""]
["S",2,"S",0,3,11,0,0,0,0,0,"","Serviço","Serviço","-","SINAPI",94445,"TELHAMENTO COM TELHA CERÂMICA CAPA-CANAL, TIPO PLAN, COM ATÉ 2 ÁGUAS, INCLUSO TRANSPORTE VERTICAL. AF_07/2019","M2",179.17,1,179.17,null,null,0,0,"Referência: AGETOP - 160401"]
["S",2,"S",0,3,11,0,0,0,0,0,"","Serviço","Serviço","-","SINAPI",94221,"CUMEEIRA PARA TELHA CERÂMICA EMBOÇADA COM ARGAMASSA TRAÇO 1:2:9 (CIMENTO, CAL E AREIA) PARA TELHADOS COM ATÉ 2 ÁGUAS, INCLUSO TRANSPORTE VERTICAL. AF_07/2019","M",21.85,1,21.85,null,null,0,0,""]
["S",2,"S",0,3,11,0,0,0,0,0,"","Serviço","Serviço","-","SINAPI",94224,"EMBOÇAMENTO COM ARGAMASSA TRAÇO 1:2:9 (CIMENTO, CAL E AREIA). AF_07/2019","M",60.5,1,60.5,null,null,0,0,"Referência: AGETOP - 160403"]
[2,2,2,5,3,12,0,0,0,19,5,"","Nível 2","Nível 2","-",null,null,"REVESTIMENTO DE PAREDE","-",null,1,"-",null,null,0,0,""]
["S",2,"S",0,3,12,0,0,0,0,0,"","Serviço","Serviço","-","SINAPI",87879,"CHAPISCO APLICADO EM ALVENARIAS E ESTRUTURAS DE CONCRETO INTERNAS, COM COLHER DE PEDREIRO.  ARGAMASSA TRAÇO 1:3 COM PREPARO EM BETONEIRA 400L. AF_06/2014","M2",98.18,1,98.18,null,null,0,0,""]
["S",2,"S",0,3,12,0,0,0,0,0,"","Serviço","Serviço","-","SINAPI",87286,"ARGAMASSA TRAÇO 1:1:6 (EM VOLUME DE CIMENTO, CAL E AREIA MÉDIA ÚMIDA) PARA EMBOÇO/MASSA ÚNICA/ASSENTAMENTO DE ALVENARIA DE VEDAÇÃO, PREPARO MECÂNICO COM BETONEIRA 400 L. AF_08/2019","M3",3.15,1,3.15,null,null,0,0,""]
["S",2,"S",0,3,12,0,0,0,0,0,"","Serviço","Serviço","-","SINAPI",87336,"ARGAMASSA TRAÇO 1:2:8 (EM VOLUME DE CIMENTO, CAL E AREIA MÉDIA ÚMIDA) PARA EMBOÇO/MASSA ÚNICA/ASSENTAMENTO DE ALVENARIA DE VEDAÇÃO, PREPARO MECÂNICO COM MISTURADOR DE EIXO HORIZONTAL DE 600 KG. AF_08/2019","M3",2.94,1,2.94,null,null,0,0,""]
["S",2,"S",0,3,12,0,0,0,0,0,"","Serviço","Serviço","-","SINAPI",87274,"REVESTIMENTO CERÂMICO PARA PAREDES INTERNAS COM PLACAS TIPO ESMALTADA EXTRA DE DIMENSÕES 33X45 CM APLICADAS EM AMBIENTES DE ÁREA MENOR QUE 5 M² A MEIA ALTURA DAS PAREDES. AF_06/2014","M2",3.15,1,3.15,null,null,0,0,"Referência: AGETOP - 201302"]
[2,2,2,6,3,13,0,0,0,14,6,"","Nível 2","Nível 2","-","SINAPI",null,"REVESTIMENTO DE PISO","-",null,1,"-",null,null,0,0,""]
["S",2,"S",0,3,13,0,0,0,0,0,"","Serviço","Serviço","-","SINAPI",95241,"LASTRO DE CONCRETO MAGRO, APLICADO EM PISOS OU RADIERS, ESPESSURA DE 5 CM. AF_07/2016","M2",133.97999999999999,1,133.97999999999999,null,null,0,0,""]
["S",2,"S",0,3,13,0,0,0,0,0,"","Serviço","Serviço","-","SINAPI",84191,"PISO EM GRANILITE, MARMORITE OU GRANITINA ESPESSURA 8 MM, INCLUSO JUNTAS DE DILATACAO PLASTICAS","M2",133.97999999999999,1,133.97999999999999,null,null,0,0,"Referência: AGETOP - 221101"]
["S",2,"S",0,3,13,0,0,0,0,0,"","Serviço","Serviço","-","SINAPI","73850/1","RODAPE EM MARMORITE, ALTURA 10CM","M",24.5,1,24.5,null,null,0,0,""]
["S",2,"S",0,3,13,0,0,0,0,0,"","Serviço","Serviço","-","AGETOP",221104,"RASPAGEM E APLICAÇÃO RESINA ACRÍLICA DUAS DEMÃOS","m2    ",136.43,1,136.43,null,null,0,0,""]
["S",2,"S",0,3,13,0,0,0,0,0,"","Serviço","Serviço","-","SINAPI",94992,"EXECUÇÃO DE PASSEIO (CALÇADA) OU PISO DE CONCRETO COM CONCRETO MOLDADO IN LOCO, FEITO EM OBRA, ACABAMENTO CONVENCIONAL, ESPESSURA 6 CM, ARMADO. AF_07/2016","M2",33.72,1,33.72,null,null,0,0,""]
[2,2,2,4,3,14,0,0,0,8,4,"","Nível 2","Nível 2","-",null,null,"PINTURA","-",null,1,"-",null,null,0,0,""]
["S",2,"S",0,3,14,0,0,0,0,0,"","Serviço","Serviço","-","SINAPI","74133/1","EMASSAMENTO COM MASSA A OLEO, UMA DEMAO","M2",21.35,1,21.35,null,null,0,0,""]
["S",2,"S",0,3,14,0,0,0,0,0,"","Serviço","Serviço","-","SINAPI",88489,"APLICAÇÃO MANUAL DE PINTURA COM TINTA LÁTEX ACRÍLICA EM PAREDES, DUAS DEMÃOS. AF_06/2014","M2",53.7,1,53.7,null,null,0,0,"Referência: AGETOP - 261001"]
["S",2,"S",0,3,14,0,0,0,0,0,"","Serviço","Serviço","-","SINAPI",79464,"PINTURA A OLEO, 2 DEMAOS","M2",21.35,1,21.35,null,null,0,0,""]
[2,2,2,4,3,15,0,0,0,4,{"$error":"#N/A"},"","Nível 2","Nível 2","-",null,null,"DIVERSOS","-",null,1,"-",null,null,0,0,""]
["S",2,"S",0,3,15,0,0,0,0,0,"","Serviço","Serviço","-","AGETOP",270501,"LIMPEZA FINAL DE OBRA - (OBRAS CIVIS)","m2    ",133.97999999999999,1,133.97999999999999,null,null,0,0,""]
["S",2,"S",0,3,15,0,0,0,0,0,"","Serviço","Serviço","-","AGETOP",271608,"BANCADA DE GRANITO C/ESPELHO","m2    ",1,1,1,null,null,0,0,""]
["S",2,"S",0,3,15,0,0,0,0,0,"","Serviço","Serviço","-","AGETOP",271303,"BANCO DE CONCRETO POLIDO BASE EM ALVENARIA REBOCADA E PINTADA - PADRÃO GOINFRA ","m     ",15.75,1,15.75,null,null,0,0,""]
[1,1,1,36,4,0,0,0,0,36,{"$error":"#N/A"},"F","Nível 1","Nível 1","4.","SINAPI",null,"PASSARELA MODELO 01 - PADRÃO SÉC. XXI 2015","UN",2,2,2,null,null,0,0,""]
[2,2,2,2,4,1,0,0,0,35,2,"","Nível 2","Nível 2","-","SINAPI",null,"SERVIÇOS PRELIMINARES","-",null,2,"-",null,null,0,0,""]
["S",2,"S",0,4,1,0,0,0,0,0,"","Serviço","Serviço","-","AGETOP",20701,"LOCAÇÃO DA OBRA, EXECUÇÃO DE GABARITO SEM REAPROVEITAMENTO, INCLUSO PINTURA (FACE INTERNA DO RIPÃO 15CM) E PIQUETE COM TESTEMUNHA","m2    ",10.08,2,20.16,null,null,0,0,""]
[2,2,2,3,4,2,0,0,0,33,3,"","Nível 2","Nível 2","-","AGETOP",null,"TRANSPORTES","-",null,2,"-",null,null,0,0,""]
["S",2,"S",0,4,2,0,0,0,0,0,"","Serviço","Serviço","-","SINAPI",72900,"TRANSPORTE DE ENTULHO COM CAMINHAO BASCULANTE 6 M3, RODOVIA PAVIMENTADA, DMT 0,5 A 1,0 KM","M3",3,2,6,null,null,0,0,""]
["S",2,"S",0,4,2,0,0,0,0,0,"","Serviço","Serviço","-","SINAPI",72897,"CARGA MANUAL DE ENTULHO EM CAMINHAO BASCULANTE 6 M3","M3",3,2,6,null,null,0,0,""]
[2,2,2,9,4,3,0,0,0,30,9,"","Nível 2","Nível 2","-","AGETOP",null,"FUNDAÇÕES E SONDAGENS","-",null,2,"-",null,null,0,0,""]
["S",2,"S",0,4,3,0,0,0,0,0,"","Serviço","Serviço","-","SINAPI",96534,"FABRICAÇÃO, MONTAGEM E DESMONTAGEM DE FÔRMA PARA BLOCO DE COROAMENTO, EM MADEIRA SERRADA, E=25 MM, 4 UTILIZAÇÕES. AF_06/2017","M2",5.28,2,10.56,null,null,0,0,"Referência: AGETOP - 51009"]
["S",2,"S",0,4,3,0,0,0,0,0,"","Serviço","Serviço","-","SINAPI",96523,"ESCAVAÇÃO MANUAL PARA BLOCO DE COROAMENTO OU SAPATA, COM PREVISÃO DE FÔRMA. AF_06/2017","M3",1.02,2,2.04,null,null,0,0,"Referência: AGETOP - 50901"]
["S",2,"S",0,4,3,0,0,0,0,0,"","Serviço","Serviço","-","AGETOP",50902,"APILOAMENTO (BLOCOS/SAPATAS)","m2    ",1,2,2,null,null,0,0,""]
["S",2,"S",0,4,3,0,0,0,0,0,"","Serviço","Serviço","-","SINAPI",96995,"REATERRO MANUAL APILOADO COM SOQUETE. AF_10/2017","M3",0.44000000000000006,2,0.88000000000000012,null,null,0,0,"Referência: AGETOP - 40902"]
["S",2,"S",0,4,3,0,0,0,0,0,"","Serviço","Serviço","-","SINAPI",94964,"CONCRETO FCK = 20MPA, TRAÇO 1:2,7:3 (CIMENTO/ AREIA MÉDIA/ BRITA 1)  - PREPARO MECÂNICO COM BETONEIRA 400 L. AF_07/2016","M3",0.57999999999999996,2,1.1599999999999999,null,null,0,0,""]
["S",2,"S",0,4,3,0,0,0,0,0,"","Serviço","Serviço","-","SINAPI","74157/4","LANCAMENTO/APLICACAO MANUAL DE CONCRETO EM FUNDACOES","M3",0.57999999999999996,2,1.1599999999999999,null,null,0,0,"Referência: AGETOP - 51026"]
["S",2,"S",0,4,3,0,0,0,0,0,"","Serviço","Serviço","-","SINAPI",96547,"ARMAÇÃO DE BLOCO, VIGA BALDRAME OU SAPATA UTILIZANDO AÇO CA-50 DE 12,5 MM - MONTAGEM. AF_06/2017","KG",13.18,2,26.36,null,null,0,0,""]
["S",2,"S",0,4,3,0,0,0,0,0,"","Serviço","Serviço","-","SINAPI",96543,"ARMAÇÃO DE BLOCO, VIGA BALDRAME E SAPATA UTILIZANDO AÇO CA-60 DE 5 MM - MONTAGEM. AF_06/2017","KG",8.7200000000000006,2,17.440000000000001,null,null,0,0,"Referência: AGETOP - 52014"]
[2,2,2,6,4,4,0,0,0,21,6,"","Nível 2","Nível 2","-","AGETOP",null,"ESTRUTURA","-",null,2,"-",null,null,0,0,""]
["S",2,"S",0,4,4,0,0,0,0,0,"","Serviço","Serviço","-","SINAPI",92426,"MONTAGEM E DESMONTAGEM DE FÔRMA DE PILARES RETANGULARES E ESTRUTURAS SIMILARES COM ÁREA MÉDIA DAS SEÇÕES MENOR OU IGUAL A 0,25 M², PÉ-DIREITO SIMPLES, EM CHAPA DE MADEIRA COMPENSADA RESINADA, 8 UTILIZAÇÕES. AF_12/2015","M2",1.29,2,2.58,null,null,0,0,""]
["S",2,"S",0,4,4,0,0,0,0,0,"","Serviço","Serviço","-","SINAPI",94964,"CONCRETO FCK = 20MPA, TRAÇO 1:2,7:3 (CIMENTO/ AREIA MÉDIA/ BRITA 1)  - PREPARO MECÂNICO COM BETONEIRA 400 L. AF_07/2016","M3",0.11,2,0.22,null,null,0,0,""]
["S",2,"S",0,4,4,0,0,0,0,0,"","Serviço","Serviço","-","SINAPI",92873,"LANÇAMENTO COM USO DE BALDES, ADENSAMENTO E ACABAMENTO DE CONCRETO EM ESTRUTURAS. AF_12/2015","M3",0.11,2,0.22,null,null,0,0,"Referência: AGETOP - 60801"]
["S",2,"S",0,4,4,0,0,0,{"$f":"IF(OR($C813=\"S\",$C813=0),0,MATCH(0,OFFSET($D813,1,$C813,ROW($C$830)-ROW($C813)),0))","v":0},{"$f":"IF(OR($C813=\"S\",$C813=0),0,MATCH(OFFSET($D813,0,$C813)+1,OFFSET($D813,1,$C813,ROW($C$830)-ROW($C813)),0))","v":0},"","Serviço","Serviço","-","SINAPI",92779,"ARMAÇÃO DE PILAR OU VIGA DE UMA ESTRUTURA CONVENCIONAL DE CONCRETO ARMADO EM UMA EDIFICAÇÃO TÉRREA OU SOBRADO UTILIZANDO AÇO CA-50 DE 12,5 MM - MONTAGEM. AF_12/2015","KG",2.81,2,5.62,null,null,0,0,""]
["S",2,"S",0,4,4,0,0,0,0,0,"","Serviço","Serviço","-","SINAPI",92775,"ARMAÇÃO DE PILAR OU VIGA DE UMA ESTRUTURA CONVENCIONAL DE CONCRETO ARMADO EM UMA EDIFICAÇÃO TÉRREA OU SOBRADO UTILIZANDO AÇO CA-60 DE 5,0 MM - MONTAGEM. AF_12/2015","KG",1.45,2,2.9,null,null,0,0,"Referência: AGETOP - 60314"]
[2,2,2,2,4,5,0,0,0,15,2,"","Nível 2","Nível 2","-",null,null,"IMPERMEABILIZAÇÃO","-",null,2,"-",null,null,0,0,""]
["S",2,"S",0,4,5,0,0,0,0,0,"","Serviço","Serviço","-","SINAPI",98562,"IMPERMEABILIZAÇÃO DE FLOREIRA OU VIGA BALDRAME COM ARGAMASSA DE CIMENTO E AREIA, COM ADITIVO IMPERMEABILIZANTE, E = 2 CM. AF_06/2018","M2",3.6,2,7.2,null,null,0,0,"Referência: AGETOP - 120902"]
[2,2,2,2,4,6,0,0,0,13,2,"","Nível 2","Nível 2","-",null,null,"ESTRUTURAS METÁLICAS","-",null,2,"-",null,null,0,0,""]
["S",2,"S",0,4,6,0,0,0,0,0,"","Serviço","Serviço","-","AGETOP",150103,"ESTRUTURA METÁLICA CONVENCIONAL EM AÇO DO TIPO USI SAC-300 COM FUNDO ANTICORROSIVO","Kg    ",161.91,2,323.82,null,null,0,0,""]
[{"$f":"CHOOSE(1+LOG(1+2*(ORÇAMENTO.Nivel=\"Nível 1\")+4*(ORÇAMENTO.Nivel=\"Nível 2\")+8*(ORÇAMENTO.Nivel=\"Nível 3\")+16*(ORÇAMENTO.Nivel=\"Nível 4\")+32*(ORÇAMENTO.Nivel=\"Serviço\"),2),0,1,2,3,4,\"S\")","v":2},2,2,3,4,7,0,0,{"$f":"IF(AND($C819<=4,$C819<>0),0,IF(AND($C819=\"S\",$Y819>0),OFFSET(I819,-1,0)+1,OFFSET(I819,-1,0)))","v":0},11,3,"","Nível 2","Nível 2","-",null,null,"COBERTURAS","-",null,2,"-",null,null,0,0,""]
["S",2,"S",0,4,7,0,0,0,0,0,"","Serviço","Serviço","-","SINAPI",94213,"TELHAMENTO COM TELHA DE AÇO/ALUMÍNIO E = 0,5 MM, COM ATÉ 2 ÁGUAS, INCLUSO IÇAMENTO. AF_07/2019","M2",12.96,2,25.92,null,null,0,0,"Referência: AGETOP - 160905"]
["S",2,"S",0,4,7,0,0,0,0,0,"","Serviço","Serviço","-","SINAPI",94228,"CALHA EM CHAPA DE AÇO GALVANIZADO NÚMERO 24, DESENVOLVIMENTO DE 50 CM, INCLUSO TRANSPORTE VERTICAL. AF_07/2019","M",3.6,2,7.2,null,null,0,0,"Referência: AGETOP - 160601"]
[2,2,2,4,{"$f":"IF($C822=1,OFFSET(E822,-1,0)+1,OFFSET(E822,-1,0))","v":4},{"$f":"IF($C822=1,0,IF($C822=2,OFFSET(F822,-1,0)+1,OFFSET(F822,-1,0)))","v":8},{"$f":"IF(AND($C822<=2,$C822<>0),0,IF($C822=3,OFFSET(G822,-1,0)+1,OFFSET(G822,-1,0)))","v":0},{"$f":"IF(AND($C822<=3,$C822<>0),0,IF($C822=4,OFFSET(H822,-1,0)+1,OFFSET(H822,-1,0)))","v":0},0,8,4,"","Nível 2","Nível 2","-",null,null,"REVESTIMENTO DE PISO","-",null,2,"-",null,null,0,0,""]
["S",2,"S",0,4,8,0,0,0,0,0,"","Serviço","Serviço","-","SINAPI",95241,"LASTRO DE CONCRETO MAGRO, APLICADO EM PISOS OU RADIERS, ESPESSURA DE 5 CM. AF_07/2016","M2",10.08,2,20.16,null,null,0,0,""]
["S",2,"S",0,4,8,0,0,0,0,0,"","Serviço","Serviço","-","SINAPI",84191,"PISO EM GRANILITE, MARMORITE OU GRANITINA ESPESSURA 8 MM, INCLUSO JUNTAS DE DILATACAO PLASTICAS","M2",10.64,2,21.28,null,null,0,0,"Referência: AGETOP - 221101"]
["S",2,"S",0,4,8,0,0,0,0,0,"","Serviço","Serviço","-","AGETOP",221104,"RASPAGEM E APLICAÇÃO RESINA ACRÍLICA DUAS DEMÃOS","m2    ",10.64,2,21.28,null,null,0,0,""]
[2,2,2,2,4,9,0,0,0,4,2,"","Nível 2","Nível 2","-",null,null,"PINTURA","-",null,2,"-",null,null,0,0,""]
["S",2,"S",0,4,9,0,0,0,0,0,"","Serviço","Serviço","-","SINAPI","74145/1","PINTURA ESMALTE FOSCO, DUAS DEMAOS, SOBRE SUPERFICIE METALICA, INCLUSO UMA DEMAO DE FUNDO ANTICORROSIVO. UTILIZACAO DE REVOLVER ( AR-COMPRIMIDO).","M2",25.92,2,51.84,null,null,0,0,"Referência: AGETOP - 261602"]
[2,{"$f":"IF(OR(C828=\"s\",C828=0),OFFSET(B828,-1,0),C828)","v":2},{"$f":"IF(OFFSET(C828,-1,0)=\"L\",1,IF(OFFSET(C828,-1,0)=1,2,IF(OR(A828=\"s\",A828=0),\"S\",IF(AND(OFFSET(C828,-1,0)=2,A828=4),3,IF(AND(OR(OFFSET(C828,-1,0)=\"s\",OFFSET(C828,-1,0)=0),A828<>\"s\",A828>OFFSET(B828,-1,0)),OFFSET(B828,-1,0),A828)))))","v":2},{"$f":"IF(OR(C828=\"S\",C828=0),0,IF(ISERROR(K828),J828,SMALL(J828:K828,1)))","v":2},4,10,0,0,0,2,{"$error":"#N/A"},"","Nível 2","Nível 2","-","SINAPI",null,"DIVERSOS","-",null,2,"-",null,null,0,0,""]
["S",2,"S",0,4,10,0,0,0,0,0,"","Serviço","Serviço","-","AGETOP",270501,"LIMPEZA FINAL DE OBRA - (OBRAS CIVIS)","m2    ",10.08,2,20.16,null,null,0,0,""]
[-1,null,-1,null,0,0,0,0,0,null,null,"F"]
[null,null,null,null,null,null,null,null,null,null,null,"F",null,null,null,null,null,"OBS: OS QUANTITATIVOS DE MATERIAIS  DAS INSTALAÇÕES HIDROSSANITÁRIAS, ELÉTRICAS E ESPECIAIS SÃO FORNECIDOS PELOS PROFISSIONAIS RESPONSÁVEIS PELOS RESPECTIVOS PROJETOS.",null,null,null,null,null,"VALOR TOTAL",null,0]
[null,null,null,null,null,null,null,null,null,null,null,"F",null,null,null,null,null,null,null,null,null,null,null,"VALOR BDI (27,95%)",null,0]
[null,null,null,null,null,null,null,null,null,null,null,"F",null,null,null,null,null,null,null,null,null,null,null,"TOTAL ORÇAMENTO",null,0]
[null,null,null,null,null,null,null,null,null,null,null,"F"]
[null,null,null,null,null,null,null,null,null,null,null,"F",null,null,null,null,null,null,null,null,null,null,null,"CUSTO POR M2 ³",null,0]
[null,null,null,null,null,null,null,null,null,null,null,"F",null,null,null,null,null,null,null,null,null,null,null,"MATERIAL S/ BDI",null,0]
[null,null,null,null,null,null,null,null,null,null,null,"F",null,null,null,null,null,null,null,null,null,null,null,"MÃO DE OBRA S/ BDI",null,0]
[null,null,null,null,null,null,null,null,null,null,null,"F"]
[null,null,null,null,null,null,null,null,null,null,null,"F",null,null,null,null,"(1) Conforme previsto pelo DECRETO Nº 7.983, DE 8 DE ABRIL DE 2013, os preços adotados são aqueles constantes dos sistemas de referência indicados. Justifica-se o uso dos preços destas composições de custos unitários devido ao seu valor ser menor à mediana de seus correspondentes na tabela SINAPI;"]
[null,null,null,null,null,null,null,null,null,null,null,"F",null,null,null,null,"(2) Optou-se pelo uso das composições de custos da AGETOP para itens não presentes na SINAPI;"]
[null,null,null,null,null,null,null,null,null,null,null,"F",null,null,null,null,"(3) Para itens da AGETOP, os vidros não estão inclusos nas esquadrias e já foram considerados os custos de contramarco para as esquadrias de alumínio;"]
[null,null,null,null,null,null,null,null,null,null,null,"F",null,null,null,null,"(4) Nos casos em que houver execução de granitina e omissão do item AGETOP 221102, considerou-se que o quantitativo para o rodapé, de altura igual a 7cm, foi incorporado na área de piso;"]
[null,null,null,null,null,null,null,null,null,null,null,"F",null,null,null,null,"(5) O custo unitário aproximado por metro quadrado é calculado dividindo-se o valor total do orçamento pela área total de construção."]
[null,null,null,null,null,null,null,null,null,null,null,"F"]
[null,null,null,null,null,null,null,null,null,null,null,"F"]
[]
[null,null,null,null,null,null,null,null,null,null,null,null,null,null,"SOMATÓRIO DE SERVIÇOS"]
[null,null,null,null,null,null,null,null,null,null,null,null,null,null,"ITEM","DESCRIÇÃO DOS SERVIÇOS",null,null,"PREÇO SEM BDI",null,null,null,null,"PREÇO COM BDI",null,null,"PARTICIPAÇÃO ( % )"]
[null,null,null,null,null,null,null,null,null,null,null,null,null,null,"a.","SERVIÇOS PRELIMINARES",null,null,{"$f":"SUMIF($R$19:$R$830,$P849,$Z$19:$Z$830)","v":0},null,null,null,null,{"$f":"ROUND(S849*(1+BDI.Taxa),2)","v":0},null,null,{"$f":"IFERROR(ROUND($X849*100/$Z$833,2),0)","v":0}]
[null,null,null,null,null,null,null,null,null,null,null,null,null,null,"b.","TRANSPORTES",null,null,0,null,null,null,null,0,null,null,0]
[null,null,null,null,null,null,null,null,null,null,null,null,null,null,"c.","SERVIÇO EM TERRA",null,null,0,null,null,null,null,0,null,null,0]
[null,null,null,null,null,null,null,null,null,null,null,null,null,null,"d.","FUNDAÇÕES E SONDAGENS",null,null,0,null,null,null,null,0,null,null,0]
[null,null,null,null,null,null,null,null,null,null,null,null,null,null,"e.","ESTRUTURA",null,null,0,null,null,null,null,0,null,null,0]
[null,null,null,null,null,null,null,null,null,null,null,null,null,null,"f.","INSTALAÇÕES ELÉTRICAS",null,null,0,null,null,null,null,0,null,null,0]
[null,null,null,null,null,null,null,null,null,null,null,null,null,null,"g.","INSTALAÇÕES HIDROSSANITÁRIAS",null,null,0,null,null,null,null,0,null,null,0]
[null,null,null,null,null,null,null,null,null,null,null,null,null,null,"h","INSTALAÇÕES ESPECIAIS",null,null,0,null,null,null,null,0,null,null,0]
[null,null,null,null,null,null,null,null,null,null,null,null,null,null,"i.","ALVENARIAS E DIVISÓRIAS",null,null,0,null,null,null,null,0,null,null,0]
[null,null,null,null,null,null,null,null,null,null,null,null,null,null,"j.","ALVENARIA AUTO-PORTANTE",null,null,0,null,null,null,null,0,null,null,0]
[null,null,null,null,null,null,null,null,null,null,null,null,null,null,"k.","IMPERMEABILIZAÇÃO",null,null,0,null,null,null,null,0,null,null,0]
[null,null,null,null,null,null,null,null,null,null,null,null,null,null,"l.","ISOLAMENTO TÉRMICO E ACÚSTICO",null,null,0,null,null,null,null,0,null,null,0]
[null,null,null,null,null,null,null,null,null,null,null,null,null,null,"m.","ESTRUTURA DE MADEIRA",null,null,0,null,null,null,null,0,null,null,0]
[null,null,null,null,null,null,null,null,null,null,null,null,null,null,"n.","ESTRUTURAS METÁLICAS",null,null,0,null,null,null,null,0,null,null,0]
[null,null,null,null,null,null,null,null,null,null,null,null,null,null,"o.","COBERTURAS",null,null,0,null,null,null,null,0,null,null,0]
[null,null,null,null,null,null,null,null,null,null,null,null,null,null,"p.","ESQUADRIAS DE MADEIRA",null,null,0,null,null,null,null,0,null,null,0]
[null,null,null,null,null,null,null,null,null,null,null,null,null,null,"q.","ESQUADRIAS METÁLICAS",null,null,0,null,null,null,null,{"$f":"ROUND(S865*(1+BDI.Taxa),2)","v":0},null,null,0]
[null,null,null,null,null,null,null,null,null,null,null,null,null,null,"r.","VIDROS",null,null,0,null,null,null,null,0,null,null,0]
[null,null,null,null,null,null,null,null,null,null,null,null,null,null,"s.","REVESTIMENTO DE PAREDE",null,null,0,null,null,null,null,0,null,null,0]
[null,null,null,null,null,null,null,null,null,null,null,null,null,null,"t.","FORROS",null,null,0,null,null,null,null,0,null,null,0]
[null,null,null,null,null,null,null,null,null,null,null,null,null,null,"u.","REVESTIMENTO DE PISO",null,null,0,null,null,null,null,0,null,null,0]
[null,null,null,null,null,null,null,null,null,null,null,null,null,null,"v.","FERRAGENS",null,null,0,null,null,null,null,0,null,null,0]
[null,null,null,null,null,null,null,null,null,null,null,null,null,null,"w.","MARCENARIA",null,null,0,null,null,null,null,0,null,null,0]
[null,null,null,null,null,null,null,null,null,null,null,null,null,null,"x.","ADMINISTRAÇÃO",null,null,0,null,null,null,null,0,null,null,0]
[null,null,null,null,null,null,null,null,null,null,null,null,null,null,"y.","PINTURA",null,null,0,null,null,null,null,{"$f":"ROUND(S873*(1+BDI.Taxa),2)","v":0},null,null,0]
[null,null,null,null,null,null,null,null,null,null,null,null,null,null,"z.","DIVERSOS",null,null,0,null,null,null,null,{"$f":"IF(S874>0,IF((SUM(X849:Y873)+ROUND(S874*(1+BDI.Taxa),2))<>X876,X876-SUM(X849:Y873),ROUND(S874*(1+BDI.Taxa),2)),0)","v":0},null,null,{"$f":"IF(S874>0,IF((SUM(AA849:AA873)+IFERROR(ROUND($X874*100/$Z$833,2),0))<>AA876,AA876-SUM(AA849:AA873),IFERROR(ROUND($X874*100/$Z$833,2),0)),0)","v":0}]
[null,null,null,null,null,null,null,null,null,null,null,null,null,null,"TOTAL GERAL DO ORÇAMENTO (R$)",null,null,null,{"$f":"SUM(S849:W874)","v":0},null,null,null,null,{"$f":"SUM(X849:Y874)","v":0},null,null,{"$f":"SUM(AA849:AA874)","v":0}]
[null,null,null,null,null,null,null,null,null,null,null,null,null,null,null,null,null,null,{"$f":"$Z$831","v":0},null,null,null,null,{"$f":"$Z$833","v":0},null,null,100]
[null,null,null,null,null,null,null,null,null,null,null,null,null,null,null,null,null,null,"(TOTAL SEM BDI)",null,null,null,null,"(TOTAL COM BDI)",null,null,"(ARRED porcentagem)"]
[null,null,null,null,null,null,null,null,null,null,null,null,null,null,null,null,null,null,{"$f":"IF(AND(S875=S876,S875>0),\"OK\",\"ERRO\")","v":"ERRO"},null,null,null,null,{"$f":"IF(AND(X875=X876,X875>0),\"OK\",\"ERRO\")","v":"ERRO"},null,null,{"$f":"IF(AA875=100,\"OK\",\"ERRO\")","v":"ERRO"}]
[]
[]
[null,null,null,null,null,null,null,null,null,null,null,null,null,null,"RESUMO GERAL DO ORÇAMENTO"]
[null,null,null,null,null,null,null,null,null,null,null,null,null,null,"ITEM","DESCRIÇÃO DOS SERVIÇOS",null,null,"PREÇO SEM BDI",null,null,null,null,"PREÇO COM BDI",null,null,"PARTICIPAÇÃO ( % )"]
[null,null,null,null,null,null,null,null,null,null,null,null,null,null,"1.",{"$f":"IFERROR(VLOOKUP(O883,$O$19:$Y$830,4,FALSE),\"\")","v":"AMPLIAÇÃO E REFORMA"},null,null,{"$f":"IF(P884=\"\",$S$904-SUM(OFFSET($S$882:S882,0,0,COUNTA($S$882:S882),1)),SUMIF($R$19:$R$830,$P883,$Z$19:$Z$830))","v":0},null,null,null,null,{"$f":"IF(P884=\"\",$X$904-SUM(OFFSET($X$882:X882,0,0,COUNTA($X$882:X882),1)),ROUND(S883*(1+BDI.Taxa),2))","v":0},null,null,{"$f":"IF(P884=\"\",$AA$904-SUM(OFFSET($AA$882:AA882,0,0,COUNTA($AA$882:AA882),1)),ROUND(X883*100/ORÇAMENTO.TotalOrçamento,2))","v":{"$error":"#DIV/0!"}}]
[null,null,null,null,null,null,null,null,null,null,null,null,null,null,"2.","BLOCO VESTIÁRIO (BLOCO G)",null,null,{"$f":"IF(P885=\"\",$S$904-SUM(OFFSET($S$882:S883,0,0,COUNTA($S$882:S883),1)),SUMIF($R$19:$R$830,$P884,$Z$19:$Z$830))","v":0},null,null,null,null,{"$f":"IF(P885=\"\",$X$904-SUM(OFFSET($X$882:X883,0,0,COUNTA($X$882:X883),1)),ROUND(S884*(1+BDI.Taxa),2))","v":0},null,null,{"$f":"IF(P885=\"\",$AA$904-SUM(OFFSET($AA$882:AA883,0,0,COUNTA($AA$882:AA883),1)),ROUND(X884*100/ORÇAMENTO.TotalOrçamento,2))","v":{"$error":"#DIV/0!"}}]
[null,null,null,null,null,null,null,null,null,null,null,null,null,null,"3.","PÁTIO MULTIUSO - PADRÃO SEDUC - OPÇÃO 03",null,null,{"$f":"IF(P886=\"\",$S$904-SUM(OFFSET($S$882:S884,0,0,COUNTA($S$882:S884),1)),SUMIF($R$19:$R$830,$P885,$Z$19:$Z$830))","v":0},null,null,null,null,{"$f":"IF(P886=\"\",$X$904-SUM(OFFSET($X$882:X884,0,0,COUNTA($X$882:X884),1)),ROUND(S885*(1+BDI.Taxa),2))","v":0},null,null,{"$f":"IF(P886=\"\",$AA$904-SUM(OFFSET($AA$882:AA884,0,0,COUNTA($AA$882:AA884),1)),ROUND(X885*100/ORÇAMENTO.TotalOrçamento,2))","v":{"$error":"#DIV/0!"}}]
[null,null,null,null,null,null,null,null,null,null,null,null,null,null,"4.","PASSARELA MODELO 01 - PADRÃO SÉC. XXI 2015",null,null,{"$f":"IF(P887=\"\",$S$904-SUM(OFFSET($S$882:S885,0,0,COUNTA($S$882:S885),1)),SUMIF($R$19:$R$830,$P886,$Z$19:$Z$830))","v":0},null,null,null,null,{"$f":"IF(P887=\"\",$X$904-SUM(OFFSET($X$882:X885,0,0,COUNTA($X$882:X885),1)),ROUND(S886*(1+BDI.Taxa),2))","v":0},null,null,{"$f":"IF(P887=\"\",$AA$904-SUM(OFFSET($AA$882:AA885,0,0,COUNTA($AA$882:AA885),1)),ROUND(X886*100/ORÇAMENTO.TotalOrçamento,2))","v":{"$error":"#DIV/0!"}}]
[null,null,null,null,null,null,null,null,null,null,null,null,null,null,"5.","",null,null,{"$f":"IF(P888=\"\",$S$904-SUM(OFFSET($S$882:S886,0,0,COUNTA($S$882:S886),1)),SUMIF($R$19:$R$830,$P887,$Z$19:$Z$830))","v":0},null,null,null,null,{"$f":"IF(P888=\"\",$X$904-SUM(OFFSET($X$882:X886,0,0,COUNTA($X$882:X886),1)),ROUND(S887*(1+BDI.Taxa),2))","v":0},null,null,{"$f":"IF(P888=\"\",$AA$904-SUM(OFFSET($AA$882:AA886,0,0,COUNTA($AA$882:AA886),1)),ROUND(X887*100/ORÇAMENTO.TotalOrçamento,2))","v":{"$error":"#DIV/0!"}}]
[null,null,null,null,null,null,null,null,null,null,null,null,null,null,"6.","",null,null,{"$f":"IF(P889=\"\",$S$904-SUM(OFFSET($S$882:S887,0,0,COUNTA($S$882:S887),1)),SUMIF($R$19:$R$830,$P888,$Z$19:$Z$830))","v":0},null,null,null,null,{"$f":"IF(P889=\"\",$X$904-SUM(OFFSET($X$882:X887,0,0,COUNTA($X$882:X887),1)),ROUND(S888*(1+BDI.Taxa),2))","v":0},null,null,{"$f":"IF(P889=\"\",$AA$904-SUM(OFFSET($AA$882:AA887,0,0,COUNTA($AA$882:AA887),1)),ROUND(X888*100/ORÇAMENTO.TotalOrçamento,2))","v":{"$error":"#DIV/0!"}}]
[null,null,null,null,null,null,null,null,null,null,null,null,null,null,"7.","",null,null,{"$f":"IF(P890=\"\",$S$904-SUM(OFFSET($S$882:S888,0,0,COUNTA($S$882:S888),1)),SUMIF($R$19:$R$830,$P889,$Z$19:$Z$830))","v":0},null,null,null,null,{"$f":"IF(P890=\"\",$X$904-SUM(OFFSET($X$882:X888,0,0,COUNTA($X$882:X888),1)),ROUND(S889*(1+BDI.Taxa),2))","v":0},null,null,{"$f":"IF(P890=\"\",$AA$904-SUM(OFFSET($AA$882:AA888,0,0,COUNTA($AA$882:AA888),1)),ROUND(X889*100/ORÇAMENTO.TotalOrçamento,2))","v":{"$error":"#DIV/0!"}}]
[null,null,null,null,null,null,null,null,null,null,null,null,null,null,"8.","",null,null,{"$f":"IF(P891=\"\",$S$904-SUM(OFFSET($S$882:S889,0,0,COUNTA($S$882:S889),1)),SUMIF($R$19:$R$830,$P890,$Z$19:$Z$830))","v":0},null,null,null,null,{"$f":"IF(P891=\"\",$X$904-SUM(OFFSET($X$882:X889,0,0,COUNTA($X$882:X889),1)),ROUND(S890*(1+BDI.Taxa),2))","v":0},null,null,{"$f":"IF(P891=\"\",$AA$904-SUM(OFFSET($AA$882:AA889,0,0,COUNTA($AA$882:AA889),1)),ROUND(X890*100/ORÇAMENTO.TotalOrçamento,2))","v":{"$error":"#DIV/0!"}}]
[null,null,null,null,null,null,null,null,null,null,null,null,null,null,"9.","",null,null,{"$f":"IF(P892=\"\",$S$904-SUM(OFFSET($S$882:S890,0,0,COUNTA($S$882:S890),1)),SUMIF($R$19:$R$830,$P891,$Z$19:$Z$830))","v":0},null,null,null,null,{"$f":"IF(P892=\"\",$X$904-SUM(OFFSET($X$882:X890,0,0,COUNTA($X$882:X890),1)),ROUND(S891*(1+BDI.Taxa),2))","v":0},null,null,{"$f":"IF(P892=\"\",$AA$904-SUM(OFFSET($AA$882:AA890,0,0,COUNTA($AA$882:AA890),1)),ROUND(X891*100/ORÇAMENTO.TotalOrçamento,2))","v":{"$error":"#DIV/0!"}}]
[null,null,null,null,null,null,null,null,null,null,null,null,null,null,"10.","",null,null,{"$f":"IF(P893=\"\",$S$904-SUM(OFFSET($S$882:S891,0,0,COUNTA($S$882:S891),1)),SUMIF($R$19:$R$830,$P892,$Z$19:$Z$830))","v":0},null,null,null,null,{"$f":"IF(P893=\"\",$X$904-SUM(OFFSET($X$882:X891,0,0,COUNTA($X$882:X891),1)),ROUND(S892*(1+BDI.Taxa),2))","v":0},null,null,{"$f":"IF(P893=\"\",$AA$904-SUM(OFFSET($AA$882:AA891,0,0,COUNTA($AA$882:AA891),1)),ROUND(X892*100/ORÇAMENTO.TotalOrçamento,2))","v":{"$error":"#DIV/0!"}}]
[null,null,null,null,null,null,null,null,null,null,null,null,null,null,"11.","",null,null,{"$f":"IF(P894=\"\",$S$904-SUM(OFFSET($S$882:S892,0,0,COUNTA($S$882:S892),1)),SUMIF($R$19:$R$830,$P893,$Z$19:$Z$830))","v":0},null,null,null,null,{"$f":"IF(P894=\"\",$X$904-SUM(OFFSET($X$882:X892,0,0,COUNTA($X$882:X892),1)),ROUND(S893*(1+BDI.Taxa),2))","v":0},null,null,{"$f":"IF(P894=\"\",$AA$904-SUM(OFFSET($AA$882:AA892,0,0,COUNTA($AA$882:AA892),1)),ROUND(X893*100/ORÇAMENTO.TotalOrçamento,2))","v":{"$error":"#DIV/0!"}}]
[null,null,null,null,null,null,null,null,null,null,null,null,null,null,"12.","",null,null,{"$f":"IF(P895=\"\",$S$904-SUM(OFFSET($S$882:S893,0,0,COUNTA($S$882:S893),1)),SUMIF($R$19:$R$830,$P894,$Z$19:$Z$830))","v":0},null,null,null,null,{"$f":"IF(P895=\"\",$X$904-SUM(OFFSET($X$882:X893,0,0,COUNTA($X$882:X893),1)),ROUND(S894*(1+BDI.Taxa),2))","v":0},null,null,{"$f":"IF(P895=\"\",$AA$904-SUM(OFFSET($AA$882:AA893,0,0,COUNTA($AA$882:AA893),1)),ROUND(X894*100/ORÇAMENTO.TotalOrçamento,2))","v":{"$error":"#DIV/0!"}}]
[null,null,null,null,null,null,null,null,null,null,null,null,null,null,"13.","",null,null,{"$f":"IF(P896=\"\",$S$904-SUM(OFFSET($S$882:S894,0,0,COUNTA($S$882:S894),1)),SUMIF($R$19:$R$830,$P895,$Z$19:$Z$830))","v":0},null,null,null,null,{"$f":"IF(P896=\"\",$X$904-SUM(OFFSET($X$882:X894,0,0,COUNTA($X$882:X894),1)),ROUND(S895*(1+BDI.Taxa),2))","v":0},null,null,{"$f":"IF(P896=\"\",$AA$904-SUM(OFFSET($AA$882:AA894,0,0,COUNTA($AA$882:AA894),1)),ROUND(X895*100/ORÇAMENTO.TotalOrçamento,2))","v":{"$error":"#DIV/0!"}}]
[null,null,null,null,null,null,null,null,null,null,null,null,null,null,"14.","",null,null,{"$f":"IF(P897=\"\",$S$904-SUM(OFFSET($S$882:S895,0,0,COUNTA($S$882:S895),1)),SUMIF($R$19:$R$830,$P896,$Z$19:$Z$830))","v":0},null,null,null,null,{"$f":"IF(P897=\"\",$X$904-SUM(OFFSET($X$882:X895,0,0,COUNTA($X$882:X895),1)),ROUND(S896*(1+BDI.Taxa),2))","v":0},null,null,{"$f":"IF(P897=\"\",$AA$904-SUM(OFFSET($AA$882:AA895,0,0,COUNTA($AA$882:AA895),1)),ROUND(X896*100/ORÇAMENTO.TotalOrçamento,2))","v":{"$error":"#DIV/0!"}}]
[null,null,null,null,null,null,null,null,null,null,null,null,null,null,"15.","",null,null,{"$f":"IF(P898=\"\",$S$904-SUM(OFFSET($S$882:S896,0,0,COUNTA($S$882:S896),1)),SUMIF($R$19:$R$830,$P897,$Z$19:$Z$830))","v":0},null,null,null,null,{"$f":"IF(P898=\"\",$X$904-SUM(OFFSET($X$882:X896,0,0,COUNTA($X$882:X896),1)),ROUND(S897*(1+BDI.Taxa),2))","v":0},null,null,{"$f":"IF(P898=\"\",$AA$904-SUM(OFFSET($AA$882:AA896,0,0,COUNTA($AA$882:AA896),1)),ROUND(X897*100/ORÇAMENTO.TotalOrçamento,2))","v":{"$error":"#DIV/0!"}}]
[null,null,null,null,null,null,null,null,null,null,null,null,null,null,"16.","",null,null,{"$f":"IF(P899=\"\",$S$904-SUM(OFFSET($S$882:S897,0,0,COUNTA($S$882:S897),1)),SUMIF($R$19:$R$830,$P898,$Z$19:$Z$830))","v":0},null,null,null,null,{"$f":"IF(P899=\"\",$X$904-SUM(OFFSET($X$882:X897,0,0,COUNTA($X$882:X897),1)),ROUND(S898*(1+BDI.Taxa),2))","v":0},null,null,{"$f":"IF(P899=\"\",$AA$904-SUM(OFFSET($AA$882:AA897,0,0,COUNTA($AA$882:AA897),1)),ROUND(X898*100/ORÇAMENTO.TotalOrçamento,2))","v":{"$error":"#DIV/0!"}}]
[null,null,null,null,null,null,null,null,null,null,null,null,null,null,"17.","",null,null,{"$f":"IF(P900=\"\",$S$904-SUM(OFFSET($S$882:S898,0,0,COUNTA($S$882:S898),1)),SUMIF($R$19:$R$830,$P899,$Z$19:$Z$830))","v":0},null,null,null,null,{"$f":"IF(P900=\"\",$X$904-SUM(OFFSET($X$882:X898,0,0,COUNTA($X$882:X898),1)),ROUND(S899*(1+BDI.Taxa),2))","v":0},null,null,{"$f":"IF(P900=\"\",$AA$904-SUM(OFFSET($AA$882:AA898,0,0,COUNTA($AA$882:AA898),1)),ROUND(X899*100/ORÇAMENTO.TotalOrçamento,2))","v":{"$error":"#DIV/0!"}}]
[null,null,null,null,null,null,null,null,null,null,null,null,null,null,"18.","",null,null,{"$f":"IF(P901=\"\",$S$904-SUM(OFFSET($S$882:S899,0,0,COUNTA($S$882:S899),1)),SUMIF($R$19:$R$830,$P900,$Z$19:$Z$830))","v":0},null,null,null,null,{"$f":"IF(P901=\"\",$X$904-SUM(OFFSET($X$882:X899,0,0,COUNTA($X$882:X899),1)),ROUND(S900*(1+BDI.Taxa),2))","v":0},null,null,{"$f":"IF(P901=\"\",$AA$904-SUM(OFFSET($AA$882:AA899,0,0,COUNTA($AA$882:AA899),1)),ROUND(X900*100/ORÇAMENTO.TotalOrçamento,2))","v":{"$error":"#DIV/0!"}}]
[null,null,null,null,null,null,null,null,null,null,null,null,null,null,"19.","",null,null,{"$f":"IF(P902=\"\",$S$904-SUM(OFFSET($S$882:S900,0,0,COUNTA($S$882:S900),1)),SUMIF($R$19:$R$830,$P901,$Z$19:$Z$830))","v":0},null,null,null,null,{"$f":"IF(P902=\"\",$X$904-SUM(OFFSET($X$882:X900,0,0,COUNTA($X$882:X900),1)),ROUND(S901*(1+BDI.Taxa),2))","v":0},null,null,{"$f":"IF(P902=\"\",$AA$904-SUM(OFFSET($AA$882:AA900,0,0,COUNTA($AA$882:AA900),1)),ROUND(X901*100/ORÇAMENTO.TotalOrçamento,2))","v":{"$error":"#DIV/0!"}}]
[null,null,null,null,null,null,null,null,null,null,null,null,null,null,"20.","",null,null,{"$f":"IF(P903=\"\",$S$904-SUM(OFFSET($S$882:S901,0,0,COUNTA($S$882:S901),1)),SUMIF($R$19:$R$830,$P902,$Z$19:$Z$830))","v":0},null,null,null,null,{"$f":"IF(P903=\"\",$X$904-SUM(OFFSET($X$882:X901,0,0,COUNTA($X$882:X901),1)),ROUND(S902*(1+BDI.Taxa),2))","v":0},null,null,{"$f":"IF(P903=\"\",$AA$904-SUM(OFFSET($AA$882:AA901,0,0,COUNTA($AA$882:AA901),1)),ROUND(X902*100/ORÇAMENTO.TotalOrçamento,2))","v":{"$error":"#DIV/0!"}}]
[null,null,null,null,null,null,null,null,null,null,null,null,null,null,"TOTAL GERAL DO ORÇAMENTO (R$)",null,null,null,{"$f":"SUM(S883:W902)","v":0},null,null,null,null,{"$f":"SUM(X883:Y902)","v":0},null,null,{"$f":"SUM(AA883:AA902)","v":{"$error":"#DIV/0!"}}]
[null,null,null,null,null,null,null,null,null,null,null,null,null,null,null,null,null,null,{"$f":"$Z$831","v":0},null,null,null,null,{"$f":"$Z$833","v":0},null,null,100]
[null,null,null,null,null,null,null,null,null,null,null,null,null,null,null,null,null,null,"(TOTAL SEM BDI)",null,null,null,null,"(TOTAL COM BDI)",null,null,"(ARRED porcentagem)"]
[null,null,null,null,null,null,null,null,null,null,null,null,null,null,null,null,null,null,{"$f":"IF(AND(S903=S904,S903>0),\"OK\",\"ERRO\")","v":"ERRO"},null,null,null,null,{"$f":"IF(AND(X903=X904,X903>0),\"OK\",\"ERRO\")","v":"ERRO"},null,null,{"$f":"IF(AND(AA903=100,S883<>0),\"OK\",\"ERRO\")","v":{"$error":"#DIV/0!"}}]

{"sheet":"Resumo ","index":1,"n_rows":39,"n_cols":9,"rows_kept":39,"cut":false,"hidden":false,"merged":[[13,0,14,0],[15,2,15,5],[16,2,16,5],[17,2,17,5],[18,2,18,5],[14,1,14,8],[0,1,0,8],[36,1,36,5],[2,1,2,5],[3,1,3,5],[5,1,5,5],[6,1,6,5],[8,1,8,5],[9,1,9,5],[11,3,11,5],[12,3,12,5],[10,1,10,8],[11,6,11,8],[12,6,12,8],[19,2,19,5],[20,2,20,5],[21,2,21,5],[31,2,31,5],[1,1,1,8],[2,6,2,8],[3,6,3,8],[4,1,4,8],[5,6,5,8],[6,6,6,8],[7,1,7,8],[8,6,8,8],[9,6,9,8],[13,1,13,8],[11,1,11,2],[12,1,12,2],[42,3,42,7],[41,3,41,7],[38,1,38,8],[22,2,22,5],[23,2,23,5],[24,2,24,5],[25,2,25,5],[26,2,26,5],[32,2,32,5],[33,2,33,5],[34,2,34,5],[35,2,35,5],[27,2,27,5],[28,2,28,5],[29,2,29,5],[30,2,30,5]]}
[]
[]
[null,"UNIDADE ESCOLAR",null,null,null,null,"CÓDIGO INEP"]
[null,{"$f":"Orçamento!$O$4","v":"CENTRO DE ENSINO EM PERÍODO INTEGRAL GARAVELO PARK"},null,null,null,null,{"$f":"Orçamento!X4","v":52030660}]
[]
[null,"OBRA",null,null,null,null,"CIDADE"]
[null,{"$f":"Orçamento!$O$7","v":"AMPLIAÇÃO E REFORMA"},null,null,null,null,{"$f":"Orçamento!$X$7","v":"APARECIDA DE GOIÂNIA"}]
[]
[null,"ENDEREÇO",null,null,null,null,"CRE"]
[null,{"$f":"Orçamento!$R$10","v":"RUA 43-E QD.84 ESQ.C/ 44-E S/N QD.84, SETOR GARAVELO PARK, CEP:74932-640"},null,null,null,null,{"$f":"Orçamento!$O$10","v":"APARECIDA"}]
[]
[null,"REFERÊNCIA",null,"DATA",null,null,"ÁREA TOTAL CONSTRUÍDA (M²)"]
[null,{"$f":"CONCATENATE(\"AGETOP E SINAPI - \",Orçamento!$T$10)","v":"AGETOP E SINAPI - DESONERADA"},null,{"$f":"Orçamento!$S$7","v":"2020-03-25"},null,null,{"$f":"Orçamento!$X$13","v":2186.3000000000002}]
["FILTRO"]
[null,"RESUMO GERAL DO ORÇAMENTO"]
["↓","ITEM","DESCRIÇÃO DOS SERVIÇOS",null,null,null,"PREÇO SEM BDI","PREÇO COM BDI","PARTICIP. (%)"]
[{"$f":"IF(G17>0,\"F\",\"\")","v":""},"1.",{"$f":"Orçamento!$P883","v":"AMPLIAÇÃO E REFORMA"},null,null,null,{"$f":"IFERROR(Orçamento!S883,\"-\")","v":0},{"$f":"IFERROR(Orçamento!X883,\"\")","v":0},{"$f":"Orçamento!AA883","v":{"$error":"#DIV/0!"}}]
[{"$f":"IF(G18>0,\"F\",\"\")","v":""},"2.",{"$f":"Orçamento!$P884","v":"BLOCO VESTIÁRIO (BLOCO G)"},null,null,null,{"$f":"IFERROR(Orçamento!S884,\"-\")","v":0},{"$f":"IFERROR(Orçamento!X884,\"\")","v":0},{"$f":"Orçamento!AA884","v":{"$error":"#DIV/0!"}}]
["","3.",{"$f":"Orçamento!$P885","v":"PÁTIO MULTIUSO - PADRÃO SEDUC - OPÇÃO 03"},null,null,null,{"$f":"IFERROR(Orçamento!S885,\"-\")","v":0},{"$f":"IFERROR(Orçamento!X885,\"\")","v":0},{"$f":"Orçamento!AA885","v":{"$error":"#DIV/0!"}}]
["","4.",{"$f":"Orçamento!$P886","v":"PASSARELA MODELO 01 - PADRÃO SÉC. XXI 2015"},null,null,null,{"$f":"IFERROR(Orçamento!S886,\"-\")","v":0},{"$f":"IFERROR(Orçamento!X886,\"\")","v":0},{"$f":"Orçamento!AA886","v":{"$error":"#DIV/0!"}}]
["","5.",{"$f":"Orçamento!$P887","v":""},null,null,null,{"$f":"IFERROR(Orçamento!S887,\"-\")","v":0},{"$f":"IFERROR(Orçamento!X887,\"\")","v":0},{"$f":"Orçamento!AA887","v":{"$error":"#DIV/0!"}}]
["","6.",{"$f":"Orçamento!$P888","v":""},null,null,null,{"$f":"IFERROR(Orçamento!S888,\"-\")","v":0},{"$f":"IFERROR(Orçamento!X888,\"\")","v":0},{"$f":"Orçamento!AA888","v":{"$error":"#DIV/0!"}}]
["","7.",{"$f":"Orçamento!$P889","v":""},null,null,null,{"$f":"IFERROR(Orçamento!S889,\"-\")","v":0},{"$f":"IFERROR(Orçamento!X889,\"\")","v":0},{"$f":"Orçamento!AA889","v":{"$error":"#DIV/0!"}}]
["","8.",{"$f":"Orçamento!$P890","v":""},null,null,null,{"$f":"IFERROR(Orçamento!S890,\"-\")","v":0},{"$f":"IFERROR(Orçamento!X890,\"\")","v":0},{"$f":"Orçamento!AA890","v":{"$error":"#DIV/0!"}}]
["","9.",{"$f":"Orçamento!$P891","v":""},null,null,null,{"$f":"IFERROR(Orçamento!S891,\"-\")","v":0},{"$f":"IFERROR(Orçamento!X891,\"\")","v":0},{"$f":"Orçamento!AA891","v":{"$error":"#DIV/0!"}}]
["","10.",{"$f":"Orçamento!$P892","v":""},null,null,null,{"$f":"IFERROR(Orçamento!S892,\"-\")","v":0},{"$f":"IFERROR(Orçamento!X892,\"\")","v":0},{"$f":"Orçamento!AA892","v":{"$error":"#DIV/0!"}}]
["","11.",{"$f":"Orçamento!$P893","v":""},null,null,null,{"$f":"IFERROR(Orçamento!S893,\"-\")","v":0},{"$f":"IFERROR(Orçamento!X893,\"\")","v":0},{"$f":"Orçamento!AA893","v":{"$error":"#DIV/0!"}}]
["","12.",{"$f":"Orçamento!$P894","v":""},null,null,null,{"$f":"IFERROR(Orçamento!S894,\"-\")","v":0},{"$f":"IFERROR(Orçamento!X894,\"\")","v":0},{"$f":"Orçamento!AA894","v":{"$error":"#DIV/0!"}}]
["","13.",{"$f":"Orçamento!$P895","v":""},null,null,null,{"$f":"IFERROR(Orçamento!S895,\"-\")","v":0},{"$f":"IFERROR(Orçamento!X895,\"\")","v":0},{"$f":"Orçamento!AA895","v":{"$error":"#DIV/0!"}}]
["","14.",{"$f":"Orçamento!$P896","v":""},null,null,null,{"$f":"IFERROR(Orçamento!S896,\"-\")","v":0},{"$f":"IFERROR(Orçamento!X896,\"\")","v":0},{"$f":"Orçamento!AA896","v":{"$error":"#DIV/0!"}}]
["","15.",{"$f":"Orçamento!$P897","v":""},null,null,null,{"$f":"IFERROR(Orçamento!S897,\"-\")","v":0},{"$f":"IFERROR(Orçamento!X897,\"\")","v":0},{"$f":"Orçamento!AA897","v":{"$error":"#DIV/0!"}}]
["","16.",{"$f":"Orçamento!$P898","v":""},null,null,null,{"$f":"IFERROR(Orçamento!S898,\"-\")","v":0},{"$f":"IFERROR(Orçamento!X898,\"\")","v":0},{"$f":"Orçamento!AA898","v":{"$error":"#DIV/0!"}}]
["","17.",{"$f":"Orçamento!$P899","v":""},null,null,null,{"$f":"IFERROR(Orçamento!S899,\"-\")","v":0},{"$f":"IFERROR(Orçamento!X899,\"\")","v":0},{"$f":"Orçamento!AA899","v":{"$error":"#DIV/0!"}}]
["","18.",{"$f":"Orçamento!$P900","v":""},null,null,null,{"$f":"IFERROR(Orçamento!S900,\"-\")","v":0},{"$f":"IFERROR(Orçamento!X900,\"\")","v":0},{"$f":"Orçamento!AA900","v":{"$error":"#DIV/0!"}}]
["","19.",{"$f":"Orçamento!$P901","v":""},null,null,null,{"$f":"IFERROR(Orçamento!S901,\"-\")","v":0},{"$f":"IFERROR(Orçamento!X901,\"\")","v":0},{"$f":"Orçamento!AA901","v":{"$error":"#DIV/0!"}}]
["","20.",{"$f":"Orçamento!$P902","v":""},null,null,null,{"$f":"IFERROR(Orçamento!S902,\"-\")","v":0},{"$f":"IFERROR(Orçamento!X902,\"\")","v":0},{"$f":"Orçamento!AA902","v":{"$error":"#DIV/0!"}}]
["F","TOTAL GERAL DO ORÇAMENTO (R$)",null,null,null,null,{"$f":"SUM(G17:G36)","v":0},0,{"$f":"SUM(I17:I36)","v":{"$error":"#DIV/0!"}}]
["F"]
["F"]

{"sheet":"Somatório","index":2,"n_rows":45,"n_cols":6,"rows_kept":45,"cut":false,"hidden":false,"merged":[[13,0,14,0],[42,1,42,2],[44,1,44,5],[47,3,47,5],[48,3,48,5],[13,1,13,5],[9,1,9,3],[9,4,9,5],[11,1,11,2],[11,4,11,5],[12,1,12,2],[12,4,12,5],[0,1,0,5],[14,1,14,5],[2,1,2,3],[2,4,2,5],[3,1,3,3],[3,4,3,5],[5,1,5,3],[5,4,5,5],[6,1,6,3],[6,4,6,5],[8,1,8,3],[8,4,8,5],[1,1,1,5],[4,1,4,5],[7,1,7,5],[10,1,10,5]]}
[]
[]
[null,"UNIDADE ESCOLAR",null,null,"CÓDIGO INEP"]
[null,{"$f":"Orçamento!$O$4","v":"CENTRO DE ENSINO EM PERÍODO INTEGRAL GARAVELO PARK"},null,null,{"$f":"Orçamento!X4","v":52030660}]
[]
[null,"OBRA",null,null,"CIDADE"]
[null,{"$f":"Orçamento!$O$7","v":"AMPLIAÇÃO E REFORMA"},null,null,{"$f":"Orçamento!$X$7","v":"APARECIDA DE GOIÂNIA"}]
[]
[null,"ENDEREÇO",null,null,"CRE"]
[null,{"$f":"Orçamento!$R$10","v":"RUA 43-E QD.84 ESQ.C/ 44-E S/N QD.84, SETOR GARAVELO PARK, CEP:74932-640"},null,null,{"$f":"Orçamento!$O$10","v":"APARECIDA"}]
[]
[null,"REFERÊNCIA",null,"DATA","ÁREA TOTAL CONSTRUÍDA (M²)"]
[null,{"$f":"CONCATENATE(\"AGETOP E SINAPI - \",Orçamento!$T$10)","v":"AGETOP E SINAPI - DESONERADA"},null,{"$f":"Orçamento!$S$7","v":"2020-03-25"},{"$f":"Orçamento!$X$13","v":2186.3000000000002}]
["FILTRO"]
[null,"SOMATÓRIO DE SERVIÇOS"]
["↓","ITEM","DESCRIÇÃO DOS SERVIÇOS","PREÇO SEM BDI (R$)","PREÇO COM BDI (R$)","PARTIC.  ( % )"]
[{"$f":"IF(D17>0,\"F\",\"\")","v":""},"a.",{"$f":"Orçamento!P849","v":"SERVIÇOS PRELIMINARES"},{"$f":"Orçamento!S849","v":0},{"$f":"Orçamento!X849","v":0},{"$f":"Orçamento!AA849","v":0}]
[{"$f":"IF(D18>0,\"F\",\"\")","v":""},"b.",{"$f":"Orçamento!P850","v":"TRANSPORTES"},{"$f":"Orçamento!S850","v":0},{"$f":"Orçamento!X850","v":0},{"$f":"Orçamento!AA850","v":0}]
["","c.",{"$f":"Orçamento!P851","v":"SERVIÇO EM TERRA"},{"$f":"Orçamento!S851","v":0},{"$f":"Orçamento!X851","v":0},{"$f":"Orçamento!AA851","v":0}]
["","d.",{"$f":"Orçamento!P852","v":"FUNDAÇÕES E SONDAGENS"},{"$f":"Orçamento!S852","v":0},{"$f":"Orçamento!X852","v":0},{"$f":"Orçamento!AA852","v":0}]
["","e.",{"$f":"Orçamento!P853","v":"ESTRUTURA"},{"$f":"Orçamento!S853","v":0},{"$f":"Orçamento!X853","v":0},{"$f":"Orçamento!AA853","v":0}]
["","f.",{"$f":"Orçamento!P854","v":"INSTALAÇÕES ELÉTRICAS"},{"$f":"Orçamento!S854","v":0},{"$f":"Orçamento!X854","v":0},{"$f":"Orçamento!AA854","v":0}]
["","g.",{"$f":"Orçamento!P855","v":"INSTALAÇÕES HIDROSSANITÁRIAS"},{"$f":"Orçamento!S855","v":0},{"$f":"Orçamento!X855","v":0},{"$f":"Orçamento!AA855","v":0}]
["","h",{"$f":"Orçamento!P856","v":"INSTALAÇÕES ESPECIAIS"},{"$f":"Orçamento!S856","v":0},{"$f":"Orçamento!X856","v":0},{"$f":"Orçamento!AA856","v":0}]
["","i.",{"$f":"Orçamento!P857","v":"ALVENARIAS E DIVISÓRIAS"},{"$f":"Orçamento!S857","v":0},{"$f":"Orçamento!X857","v":0},{"$f":"Orçamento!AA857","v":0}]
["","j.",{"$f":"Orçamento!P858","v":"ALVENARIA AUTO-PORTANTE"},{"$f":"Orçamento!S858","v":0},{"$f":"Orçamento!X858","v":0},{"$f":"Orçamento!AA858","v":0}]
["","k.",{"$f":"Orçamento!P859","v":"IMPERMEABILIZAÇÃO"},{"$f":"Orçamento!S859","v":0},{"$f":"Orçamento!X859","v":0},{"$f":"Orçamento!AA859","v":0}]
["","l.",{"$f":"Orçamento!P860","v":"ISOLAMENTO TÉRMICO E ACÚSTICO"},{"$f":"Orçamento!S860","v":0},{"$f":"Orçamento!X860","v":0},{"$f":"Orçamento!AA860","v":0}]
["","m.",{"$f":"Orçamento!P861","v":"ESTRUTURA DE MADEIRA"},{"$f":"Orçamento!S861","v":0},{"$f":"Orçamento!X861","v":0},{"$f":"Orçamento!AA861","v":0}]
["","n.",{"$f":"Orçamento!P862","v":"ESTRUTURAS METÁLICAS"},{"$f":"Orçamento!S862","v":0},{"$f":"Orçamento!X862","v":0},{"$f":"Orçamento!AA862","v":0}]
["","o.",{"$f":"Orçamento!P863","v":"COBERTURAS"},{"$f":"Orçamento!S863","v":0},{"$f":"Orçamento!X863","v":0},{"$f":"Orçamento!AA863","v":0}]
["","p.",{"$f":"Orçamento!P864","v":"ESQUADRIAS DE MADEIRA"},{"$f":"Orçamento!S864","v":0},{"$f":"Orçamento!X864","v":0},{"$f":"Orçamento!AA864","v":0}]
["","q.",{"$f":"Orçamento!P865","v":"ESQUADRIAS METÁLICAS"},{"$f":"Orçamento!S865","v":0},{"$f":"Orçamento!X865","v":0},{"$f":"Orçamento!AA865","v":0}]
["","r.",{"$f":"Orçamento!P866","v":"VIDROS"},{"$f":"Orçamento!S866","v":0},{"$f":"Orçamento!X866","v":0},{"$f":"Orçamento!AA866","v":0}]
["","s.",{"$f":"Orçamento!P867","v":"REVESTIMENTO DE PAREDE"},{"$f":"Orçamento!S867","v":0},{"$f":"Orçamento!X867","v":0},{"$f":"Orçamento!AA867","v":0}]
["","t.",{"$f":"Orçamento!P868","v":"FORROS"},{"$f":"Orçamento!S868","v":0},{"$f":"Orçamento!X868","v":0},{"$f":"Orçamento!AA868","v":0}]
["","u.",{"$f":"Orçamento!P869","v":"REVESTIMENTO DE PISO"},{"$f":"Orçamento!S869","v":0},{"$f":"Orçamento!X869","v":0},{"$f":"Orçamento!AA869","v":0}]
["","v.",{"$f":"Orçamento!P870","v":"FERRAGENS"},{"$f":"Orçamento!S870","v":0},{"$f":"Orçamento!X870","v":0},{"$f":"Orçamento!AA870","v":0}]
["","w.",{"$f":"Orçamento!P871","v":"MARCENARIA"},{"$f":"Orçamento!S871","v":0},{"$f":"Orçamento!X871","v":0},{"$f":"Orçamento!AA871","v":0}]
["","x.",{"$f":"Orçamento!P872","v":"ADMINISTRAÇÃO"},{"$f":"Orçamento!S872","v":0},{"$f":"Orçamento!X872","v":0},{"$f":"Orçamento!AA872","v":0}]
["","y.",{"$f":"Orçamento!P873","v":"PINTURA"},{"$f":"Orçamento!S873","v":0},{"$f":"Orçamento!X873","v":0},{"$f":"Orçamento!AA873","v":0}]
["","z.",{"$f":"Orçamento!P874","v":"DIVERSOS"},{"$f":"Orçamento!S874","v":0},{"$f":"Orçamento!X874","v":0},{"$f":"Orçamento!AA874","v":0}]
["F","TOTAL GERAL DO ORÇAMENTO",null,{"$f":"SUM(D17:D42)","v":0},{"$f":"SUM(E17:E42)","v":0},{"$f":"SUM(F17:F42)","v":0}]
[]
[null,"(*) Para itens da AGETOP, os vidros não estão inclusos nas esquadrias e já foram considerados os custos de contramarco para as esquadrias de alumínio;"]

{"sheet":"Cronog_120_Dias","index":3,"n_rows":99,"n_cols":24,"rows_kept":99,"cut":false,"hidden":false,"merged":[[0,1,0,21],[1,1,1,21],[2,1,2,7],[2,8,2,21],[3,1,3,7],[3,8,3,21],[8,1,8,7],[8,8,8,21],[9,0,11,0],[9,1,9,7],[9,8,9,21],[10,1,10,21],[11,1,11,21],[4,1,4,21],[5,1,5,7],[5,8,5,21],[6,1,6,7],[6,8,6,21],[7,1,7,21],[12,21,13,21],[13,1,13,2],[13,5,13,8],[13,9,13,12],[13,13,13,16],[13,17,13,20],[12,0,13,0],[12,3,13,3],[12,5,12,8],[12,9,12,12],[12,13,12,16],[12,17,12,20],[17,1,19,2],[17,3,19,3],[17,4,19,4],[17,5,17,8],[17,9,17,12],[14,1,16,2],[14,3,16,3],[14,4,16,4],[14,5,14,8],[14,9,14,12],[17,13,17,16],[17,17,17,20],[19,5,19,8],[19,9,19,12],[19,13,19,16],[19,17,19,20],[14,17,14,20],[16,5,16,8],[16,9,16,12],[16,13,16,16],[16,17,16,20],[14,13,14,16],[23,1,25,2],[23,3,25,3],[23,4,25,4],[23,5,23,8],[23,9,23,12],[20,1,22,2],[20,3,22,3],[20,4,22,4],[20,5,20,8],[20,9,20,12],[23,13,23,16],[23,17,23,20],[25,5,25,8],[25,9,25,12],[25,13,25,16],[25,17,25,20],[20,17,20,20],[22,5,22,8],[22,9,22,12],[22,13,22,16],[22,17,22,20],[20,13,20,16],[29,1,31,2],[29,3,31,3],[29,4,31,4],[29,5,29,8],[29,9,29,12],[26,1,28,2],[26,3,28,3],[26,4,28,4],[26,5,26,8],[26,9,26,12],[29,13,29,16],[29,17,29,20],[31,5,31,8],[31,9,31,12],[31,13,31,16],[31,17,31,20],[26,17,26,20],[28,5,28,8],[28,9,28,12],[28,13,28,16],[28,17,28,20],[26,13,26,16],[35,1,37,2],[35,3,37,3],[35,4,37,4],[35,5,35,8],[35,9,35,12],[32,1,34,2],[32,3,34,3],[32,4,34,4],[32,5,32,8],[32,9,32,12],[35,13,35,16],[35,17,35,20],[37,5,37,8],[37,9,37,12],[37,13,37,16],[37,17,37,20],[32,17,32,20],[34,5,34,8],[34,9,34,12],[34,13,34,16],[34,17,34,20],[32,13,32,16],[41,1,43,2],[41,3,43,3],[41,4,43,4],[41,5,41,8],[41,9,41,12],[38,1,40,2],[38,3,40,3],[38,4,40,4],[38,5,38,8],[38,9,38,12],[41,13,41,16],[41,17,41,20],[43,5,43,8],[43,9,43,12],[43,13,43,16],[43,17,43,20],[38,17,38,20],[40,5,40,8],[40,9,40,12],[40,13,40,16],[40,17,40,20],[38,13,38,16],[47,1,49,2],[47,3,49,3],[47,4,49,4],[47,5,47,8],[47,9,47,12],[44,1,46,2],[44,3,46,3],[44,4,46,4],[44,5,44,8],[44,9,44,12],[47,13,47,16],[47,17,47,20],[49,5,49,8],[49,9,49,12],[49,13,49,16],[49,17,49,20],[44,17,44,20],[46,5,46,8],[46,9,46,12],[46,13,46,16],[46,17,46,20],[44,13,44,16],[53,1,55,2],[53,3,55,3],[53,4,55,4],[53,5,53,8],[53,9,53,12],[50,1,52,2],[50,3,52,3],[50,4,52,4],[50,5,50,8],[50,9,50,12],[53,13,53,16],[53,17,53,20],[55,5,55,8],[55,9,55,12],[55,13,55,16],[55,17,55,20],[50,17,50,20],[52,5,52,8],[52,9,52,12],[52,13,52,16],[52,17,52,20],[50,13,50,16],[59,1,61,2],[59,3,61,3],[59,4,61,4],[59,5,59,8],[59,9,59,12],[56,1,58,2],[56,3,58,3],[56,4,58,4],[56,5,56,8],[56,9,56,12],[59,13,59,16],[59,17,59,20],[61,5,61,8],[61,9,61,12],[61,13,61,16],[61,17,61,20],[56,17,56,20],[58,5,58,8],[58,9,58,12],[58,13,58,16],[58,17,58,20],[56,13,56,16],[65,1,67,2],[65,3,67,3],[65,4,67,4],[65,5,65,8],[65,9,65,12],[62,1,64,2],[62,3,64,3],[62,4,64,4],[62,5,62,8],[62,9,62,12],[65,13,65,16],[65,17,65,20],[67,5,67,8],[67,9,67,12],[67,13,67,16],[67,17,67,20],[62,17,62,20],[64,5,64,8],[64,9,64,12],[64,13,64,16],[64,17,64,20],[62,13,62,16],[71,1,73,2],[71,3,73,3],[71,4,73,4],[71,5,71,8],[71,9,71,12],[68,1,70,2],[68,3,70,3],[68,4,70,4],[68,5,68,8],[68,9,68,12],[71,13,71,16],[71,17,71,20],[73,5,73,8],[73,9,73,12],[73,13,73,16],[73,17,73,20],[68,17,68,20],[70,5,70,8],[70,9,70,12],[70,13,70,16],[70,17,70,20],[68,13,68,16],[77,1,79,2],[77,3,79,3],[77,4,79,4],[77,5,77,8],[77,9,77,12],[74,1,76,2],[74,3,76,3],[74,4,76,4],[74,5,74,8],[74,9,74,12],[77,13,77,16],[77,17,77,20],[79,5,79,8],[79,9,79,12],[79,13,79,16],[79,17,79,20],[74,17,74,20],[76,5,76,8],[76,9,76,12],[76,13,76,16],[76,17,76,20],[74,13,74,16],[83,1,85,2],[83,3,85,3],[83,4,85,4],[83,5,83,8],[83,9,83,12],[80,1,82,2],[80,3,82,3],[80,4,82,4],[80,5,80,8],[80,9,80,12],[83,13,83,16],[83,17,83,20],[85,5,85,8],[85,9,85,12],[85,13,85,16],[85,17,85,20],[80,17,80,20],[82,5,82,8],[82,9,82,12],[82,13,82,16],[82,17,82,20],[80,13,80,16],[89,1,91,2],[89,3,91,3],[89,4,91,4],[89,5,89,8],[89,9,89,12],[86,1,88,2],[86,3,88,3],[86,4,88,4],[86,5,86,8],[86,9,86,12],[89,13,89,16],[89,17,89,20],[91,5,91,8],[91,9,91,12],[91,13,91,16],[91,17,91,20],[86,17,86,20],[88,5,88,8],[88,9,88,12],[88,13,88,16],[88,17,88,20],[86,13,86,16],[92,1,92,2],[92,5,92,8],[92,9,92,12],[92,13,92,16],[92,17,92,20],[93,1,93,2],[93,5,93,8],[93,9,93,12],[93,13,93,16],[93,17,93,20],[97,1,97,4],[98,1,98,21],[94,1,94,2],[94,5,94,8],[94,9,94,12],[94,13,94,16],[94,17,94,20],[95,1,95,2],[95,5,95,8],[95,9,95,12],[95,13,95,16],[95,17,95,20]]}
[]
[]
[null,"UNIDADE ESCOLAR",null,null,null,null,null,null,"PRAZO"]
[null,{"$f":"Orçamento!O4","v":"CENTRO DE ENSINO EM PERÍODO INTEGRAL GARAVELO PARK"},null,null,null,null,null,null,"120 DIAS CORRIDOS"]
[]
[null,"OBRA",null,null,null,null,null,null,"DATA"]
[null,{"$f":"Orçamento!O7","v":"AMPLIAÇÃO E REFORMA"},null,null,null,null,null,null,{"$f":"Orçamento!S7","v":"2020-03-25"}]
[]
[null,"LOCAL",null,null,null,null,null,null,"ÁREA TOTAL CONSTRUÍDA (M²)"]
["FILTRO",{"$f":"Orçamento!X7","v":"APARECIDA DE GOIÂNIA"},null,null,null,null,null,null,{"$f":"Orçamento!X13","v":2186.3000000000002}]
[]
[null,"CRONOGRAMA - FÍSICO FINANCEIRO"]
["↓","CUSTO TOTAL:",{"$f":"D93","v":0},"VALOR","Dias:",30,null,null,null,60,null,null,null,90,null,null,null,120,null,null,null,"TOTAL"]
[null,"DESCRIÇÃO DOS SERVIÇOS",null,null,"%","1ª PARCELA",null,null,null,"2ª PARCELA",null,null,null,"3ª PARCELA",null,null,null,"4ª PARCELA"]
[{"$f":"IF(D15>0,\"F\",\"\")","v":""},"SERVIÇOS PRELIMINARES",null,{"$f":"Orçamento!X849","v":0},{"$f":"Orçamento!AA849","v":0},{"$f":"ROUND(F17*$D$15,2)","v":0},null,null,null,{"$f":"ROUND(J17*$D$15,2)","v":0},null,null,null,{"$f":"ROUND(N17*$D$15,2)","v":0},null,null,null,{"$f":"ROUND(R17*$D$15,2)","v":0},null,null,null,{"$f":"SUM(F15:U15)","v":0},null,{"$f":"IF(D15=V15,\"OK\",\"ERRO\")","v":"OK"}]
[{"$f":"IF(A15=\"F\",A15,\"\")","v":""}]
[{"$f":"IF(A16=\"F\",A16,\"\")","v":""},null,null,null,null,1,null,null,null,0,null,null,null,0,null,null,null,{"$f":"100%-(SUM(F17:Q17))","v":0},null,null,null,{"$f":"IFERROR(E15/100,\"\")","v":0},null,{"$f":"IF(E15=V17*100,\"OK\",\"ERRO\")","v":"OK"}]
[{"$f":"IF(D18>0,\"F\",\"\")","v":""},"TRANSPORTES",null,{"$f":"Orçamento!X850","v":0},{"$f":"Orçamento!AA850","v":0},{"$f":"ROUND(F20*$D$18,2)","v":0},null,null,null,{"$f":"ROUND(J20*$D$18,2)","v":0},null,null,null,{"$f":"ROUND(N20*$D$18,2)","v":0},null,null,null,{"$f":"ROUND(R20*$D$18,2)","v":0},null,null,null,{"$f":"SUM(F18:U18)","v":0},null,{"$f":"IF(D18=V18,\"OK\",\"ERRO\")","v":"OK"}]
[{"$f":"IF(A18=\"F\",A18,\"\")","v":""}]
[{"$f":"IF(A19=\"F\",A19,\"\")","v":""},null,null,null,null,0.27,null,null,null,0.24,null,null,null,0.26,null,null,null,{"$f":"100%-(SUM(F20:Q20))","v":0.22999999999999998},null,null,null,{"$f":"IFERROR(E18/100,\"\")","v":0},null,{"$f":"IF(E18=V20*100,\"OK\",\"ERRO\")","v":"OK"}]
[{"$f":"IF(D21>0,\"F\",\"\")","v":""},"SERVIÇO EM TERRA",null,{"$f":"Orçamento!X851","v":0},{"$f":"Orçamento!AA851","v":0},{"$f":"ROUND(F23*$D$21,2)","v":0},null,null,null,{"$f":"ROUND(J23*$D$21,2)","v":0},null,null,null,{"$f":"ROUND(N23*$D$21,2)","v":0},null,null,null,{"$f":"ROUND(R23*$D$21,2)","v":0},null,null,null,{"$f":"SUM(F21:U21)","v":0},null,{"$f":"IF(D21=V21,\"OK\",\"ERRO\")","v":"OK"}]
[{"$f":"IF(A21=\"F\",A21,\"\")","v":""}]
[{"$f":"IF(A22=\"F\",A22,\"\")","v":""},null,null,null,null,1,null,null,null,0,null,null,null,0,null,null,null,{"$f":"100%-(SUM(F23:Q23))","v":0},null,null,null,{"$f":"IFERROR(E21/100,\"\")","v":0},null,{"$f":"IF(E21=V23*100,\"OK\",\"ERRO\")","v":"OK"}]
[{"$f":"IF(D24>0,\"F\",\"\")","v":""},"FUNDAÇÕES E SONDAGENS",null,{"$f":"Orçamento!X852","v":0},{"$f":"Orçamento!AA852","v":0},{"$f":"ROUND(F26*$D$24,2)","v":0},null,null,null,{"$f":"ROUND(J26*$D$24,2)","v":0},null,null,null,{"$f":"ROUND(N26*$D$24,2)","v":0},null,null,null,{"$f":"ROUND(R26*$D$24,2)","v":0},null,null,null,{"$f":"SUM(F24:U24)","v":0},null,{"$f":"IF(D24=V24,\"OK\",\"ERRO\")","v":"OK"}]
[{"$f":"IF(A24=\"F\",A24,\"\")","v":""}]
[{"$f":"IF(A25=\"F\",A25,\"\")","v":""},null,null,null,null,1,null,null,null,0,null,null,null,null,null,null,null,{"$f":"100%-(SUM(F26:Q26))","v":0},null,null,null,{"$f":"IFERROR(E24/100,\"\")","v":0},null,{"$f":"IF(E24=V26*100,\"OK\",\"ERRO\")","v":"OK"}]
[{"$f":"IF(D27>0,\"F\",\"\")","v":""},"ESTRUTURA",null,{"$f":"Orçamento!X853","v":0},{"$f":"Orçamento!AA853","v":0},{"$f":"ROUND(F29*$D$27,2)","v":0},null,null,null,{"$f":"ROUND(J29*$D$27,2)","v":0},null,null,null,{"$f":"ROUND(N29*$D$27,2)","v":0},null,null,null,{"$f":"ROUND(R29*$D$27,2)","v":0},null,null,null,{"$f":"SUM(F27:U27)","v":0},null,{"$f":"IF(D27=V27,\"OK\",\"ERRO\")","v":"OK"}]
[{"$f":"IF(A27=\"F\",A27,\"\")","v":""}]
[{"$f":"IF(A28=\"F\",A28,\"\")","v":""},null,null,null,null,0.495,null,null,null,0.505,null,null,null,0,null,null,null,{"$f":"100%-(SUM(F29:Q29))","v":0},null,null,null,{"$f":"IFERROR(E27/100,\"\")","v":0},null,{"$f":"IF(E27=V29*100,\"OK\",\"ERRO\")","v":"OK"}]
[{"$f":"IF(D30>0,\"F\",\"\")","v":""},"INST.ELET/TELEFÔNICA/CABEAMENTO ESTRUTURADO",null,{"$f":"Orçamento!X854","v":0},{"$f":"Orçamento!AA854","v":0},{"$f":"ROUND(F32*$D$30,2)","v":0},null,null,null,{"$f":"ROUND(J32*$D$30,2)","v":0},null,null,null,{"$f":"ROUND(N32*$D$30,2)","v":0},null,null,null,{"$f":"ROUND(R32*$D$30,2)","v":0},null,null,null,{"$f":"SUM(F30:U30)","v":0},null,{"$f":"IF(D30=V30,\"OK\",\"ERRO\")","v":"OK"}]
[{"$f":"IF(A30=\"F\",A30,\"\")","v":""}]
[{"$f":"IF(A31=\"F\",A31,\"\")","v":""},null,null,null,null,0.2,null,null,null,0.55000000000000004,null,null,null,0.25,null,null,null,{"$f":"100%-(SUM(F32:Q32))","v":0},null,null,null,{"$f":"IFERROR(E30/100,\"\")","v":0},null,{"$f":"IF(E30=V32*100,\"OK\",\"ERRO\")","v":"OK"}]
[{"$f":"IF(D33>0,\"F\",\"\")","v":""},"INSTALAÇÕES HIDROSSANITÁRIAS",null,{"$f":"Orçamento!X855","v":0},{"$f":"Orçamento!AA855","v":0},{"$f":"ROUND(F35*$D$33,2)","v":0},null,null,null,{"$f":"ROUND(J35*$D$33,2)","v":0},null,null,null,{"$f":"ROUND(N35*$D$33,2)","v":0},null,null,null,{"$f":"ROUND(R35*$D$33,2)","v":0},null,null,null,{"$f":"SUM(F33:U33)","v":0},null,{"$f":"IF(D33=V33,\"OK\",\"ERRO\")","v":"OK"}]
[{"$f":"IF(A33=\"F\",A33,\"\")","v":""}]
[{"$f":"IF(A34=\"F\",A34,\"\")","v":""},null,null,null,null,0.2,null,null,null,0.55000000000000004,null,null,null,0.25,null,null,null,{"$f":"100%-(SUM(F35:Q35))","v":0},null,null,null,{"$f":"IFERROR(E33/100,\"\")","v":0},null,{"$f":"IF(E33=V35*100,\"OK\",\"ERRO\")","v":"OK"}]
[{"$f":"IF(D36>0,\"F\",\"\")","v":""},"INSTALAÇÕES ESPECIAIS",null,{"$f":"Orçamento!X856","v":0},{"$f":"Orçamento!AA856","v":0},{"$f":"ROUND(F38*$D$36,2)","v":0},null,null,null,{"$f":"ROUND(J38*$D$36,2)","v":0},null,null,null,{"$f":"ROUND(N38*$D$36,2)","v":0},null,null,null,{"$f":"ROUND(R38*$D$36,2)","v":0},null,null,null,{"$f":"SUM(F36:U36)","v":0},null,{"$f":"IF(D36=V36,\"OK\",\"ERRO\")","v":"OK"}]
[{"$f":"IF(A36=\"F\",A36,\"\")","v":""}]
[{"$f":"IF(A37=\"F\",A37,\"\")","v":""},null,null,null,null,0.22,null,null,null,0.44,null,null,null,0.34,null,null,null,{"$f":"100%-(SUM(F38:Q38))","v":0},null,null,null,{"$f":"IFERROR(E36/100,\"\")","v":0},null,{"$f":"IF(E36=V38*100,\"OK\",\"ERRO\")","v":"OK"}]
[{"$f":"IF(D39>0,\"F\",\"\")","v":""},"ALVENARIA E DIVISÓRIAS",null,{"$f":"Orçamento!X857","v":0},{"$f":"Orçamento!AA857","v":0},{"$f":"ROUND(F41*$D$39,2)","v":0},null,null,null,{"$f":"ROUND(J41*$D$39,2)","v":0},null,null,null,{"$f":"ROUND(N41*$D$39,2)","v":0},null,null,null,{"$f":"ROUND(R41*$D$39,2)","v":0},null,null,null,{"$f":"SUM(F39:U39)","v":0},null,{"$f":"IF(D39=V39,\"OK\",\"ERRO\")","v":"OK"}]
[{"$f":"IF(A39=\"F\",A39,\"\")","v":""}]
[{"$f":"IF(A40=\"F\",A40,\"\")","v":""},null,null,null,null,null,null,null,null,0.63,null,null,null,0.37,null,null,null,{"$f":"100%-(SUM(F41:Q41))","v":0},null,null,null,{"$f":"IFERROR(E39/100,\"\")","v":0},null,{"$f":"IF(E39=V41*100,\"OK\",\"ERRO\")","v":"OK"}]
[{"$f":"IF(D42>0,\"F\",\"\")","v":""},"ALVENARIA AUTO-PORTANTE",null,{"$f":"Orçamento!X858","v":0},{"$f":"Orçamento!AA858","v":0},{"$f":"ROUND(F44*$D$42,2)","v":0},null,null,null,{"$f":"ROUND(J44*$D$42,2)","v":0},null,null,null,{"$f":"ROUND(N44*$D$42,2)","v":0},null,null,null,{"$f":"ROUND(R44*$D$42,2)","v":0},null,null,null,{"$f":"SUM(F42:U42)","v":0},null,{"$f":"IF(D42=V42,\"OK\",\"ERRO\")","v":"OK"}]
[{"$f":"IF(A42=\"F\",A42,\"\")","v":""}]
[{"$f":"IF(A43=\"F\",A43,\"\")","v":""},null,null,null,null,null,null,null,null,0.63,null,null,null,0.37,null,null,null,{"$f":"100%-(SUM(F44:Q44))","v":0},null,null,null,{"$f":"IFERROR(E42/100,\"\")","v":0},null,{"$f":"IF(E42=V44*100,\"OK\",\"ERRO\")","v":"OK"}]
[{"$f":"IF(D45>0,\"F\",\"\")","v":""},"IMPERMEABILIZAÇÃO",null,{"$f":"Orçamento!X859","v":0},{"$f":"Orçamento!AA859","v":0},{"$f":"ROUND(F47*$D$45,2)","v":0},null,null,null,{"$f":"ROUND(J47*$D$45,2)","v":0},null,null,null,{"$f":"ROUND(N47*$D$45,2)","v":0},null,null,null,{"$f":"ROUND(R47*$D$45,2)","v":0},null,null,null,{"$f":"SUM(F45:U45)","v":0},null,{"$f":"IF(D45=V45,\"OK\",\"ERRO\")","v":"OK"}]
[{"$f":"IF(A45=\"F\",A45,\"\")","v":""}]
[{"$f":"IF(A46=\"F\",A46,\"\")","v":""},null,null,null,null,0.5,null,null,null,0.25,null,null,null,0.25,null,null,null,{"$f":"100%-(SUM(F47:Q47))","v":0},null,null,null,{"$f":"IFERROR(E45/100,\"\")","v":0},null,{"$f":"IF(E45=V47*100,\"OK\",\"ERRO\")","v":"OK"}]
[{"$f":"IF(D48>0,\"F\",\"\")","v":""},"ISOLAMENTO TÉRMICO E ACÚSTICO",null,{"$f":"Orçamento!X860","v":0},{"$f":"Orçamento!AA860","v":0},{"$f":"ROUND(F50*$D$48,2)","v":0},null,null,null,{"$f":"ROUND(J50*$D$48,2)","v":0},null,null,null,{"$f":"ROUND(N50*$D$48,2)","v":0},null,null,null,{"$f":"ROUND(R50*$D$48,2)","v":0},null,null,null,{"$f":"SUM(F48:U48)","v":0},null,{"$f":"IF(D48=V48,\"OK\",\"ERRO\")","v":"OK"}]
[{"$f":"IF(A48=\"F\",A48,\"\")","v":""}]
[{"$f":"IF(A49=\"F\",A49,\"\")","v":""},null,null,null,null,null,null,null,null,0.55000000000000004,null,null,null,0.4,null,null,null,{"$f":"100%-(SUM(F50:Q50))","v":4.9999999999999933E-2},null,null,null,{"$f":"IFERROR(E48/100,\"\")","v":0},null,{"$f":"IF(E48=V50*100,\"OK\",\"ERRO\")","v":"OK"}]
[{"$f":"IF(D51>0,\"F\",\"\")","v":""},"ESTRUTURA DE MADEIRA",null,{"$f":"Orçamento!X861","v":0},{"$f":"Orçamento!AA861","v":0},{"$f":"ROUND(F53*$D$51,2)","v":0},null,null,null,{"$f":"ROUND(J53*$D$51,2)","v":0},null,null,null,{"$f":"ROUND(N53*$D$51,2)","v":0},null,null,null,{"$f":"ROUND(R53*$D$51,2)","v":0},null,null,null,{"$f":"SUM(F51:U51)","v":0},null,{"$f":"IF(D51=V51,\"OK\",\"ERRO\")","v":"OK"}]
[{"$f":"IF(A51=\"F\",A51,\"\")","v":""}]
[{"$f":"IF(A52=\"F\",A52,\"\")","v":""},null,null,null,null,null,null,null,null,0.35,null,null,null,0.65,null,null,null,{"$f":"100%-(SUM(F53:Q53))","v":0},null,null,null,{"$f":"IFERROR(E51/100,\"\")","v":0},null,{"$f":"IF(E51=V53*100,\"OK\",\"ERRO\")","v":"OK"}]
[{"$f":"IF(D54>0,\"F\",\"\")","v":""},"ESTRUTURA METÁLICA",null,{"$f":"Orçamento!X862","v":0},{"$f":"Orçamento!AA862","v":0},{"$f":"ROUND(F56*$D$54,2)","v":0},null,null,null,{"$f":"ROUND(J56*$D$54,2)","v":0},null,null,null,{"$f":"ROUND(N56*$D$54,2)","v":0},null,null,null,{"$f":"ROUND(R56*$D$54,2)","v":0},null,null,null,{"$f":"SUM(F54:U54)","v":0},null,{"$f":"IF(D54=V54,\"OK\",\"ERRO\")","v":"OK"}]
[{"$f":"IF(A54=\"F\",A54,\"\")","v":""}]
[{"$f":"IF(A55=\"F\",A55,\"\")","v":""},null,null,null,null,null,null,null,null,0.35,null,null,null,0.65,null,null,null,{"$f":"100%-(SUM(F56:Q56))","v":0},null,null,null,{"$f":"IFERROR(E54/100,\"\")","v":0},null,{"$f":"IF(E54=V56*100,\"OK\",\"ERRO\")","v":"OK"}]
[{"$f":"IF(D57>0,\"F\",\"\")","v":""},"COBERTURAS",null,{"$f":"Orçamento!X863","v":0},{"$f":"Orçamento!AA863","v":0},{"$f":"ROUND(F59*$D$57,2)","v":0},null,null,null,{"$f":"ROUND(J59*$D$57,2)","v":0},null,null,null,{"$f":"ROUND(N59*$D$57,2)","v":0},null,null,null,{"$f":"ROUND(R59*$D$57,2)","v":0},null,null,null,{"$f":"SUM(F57:U57)","v":0},null,{"$f":"IF(D57=V57,\"OK\",\"ERRO\")","v":"OK"}]
[{"$f":"IF(A57=\"F\",A57,\"\")","v":""}]
[{"$f":"IF(A58=\"F\",A58,\"\")","v":""},null,null,null,null,null,null,null,null,null,null,null,null,0.55000000000000004,null,null,null,{"$f":"100%-(SUM(F59:Q59))","v":0.44999999999999996},null,null,null,{"$f":"IFERROR(E57/100,\"\")","v":0},null,{"$f":"IF(E57=V59*100,\"OK\",\"ERRO\")","v":"OK"}]
[{"$f":"IF(D60>0,\"F\",\"\")","v":""},"ESQUADRIAS DE MADEIRA",null,{"$f":"Orçamento!X864","v":0},{"$f":"Orçamento!AA864","v":0},{"$f":"ROUND(F62*$D$60,2)","v":0},null,null,null,{"$f":"ROUND(J62*$D$60,2)","v":0},null,null,null,{"$f":"ROUND(N62*$D$60,2)","v":0},null,null,null,{"$f":"ROUND(R62*$D$60,2)","v":0},null,null,null,{"$f":"SUM(F60:U60)","v":0},null,{"$f":"IF(D60=V60,\"OK\",\"ERRO\")","v":"OK"}]
[{"$f":"IF(A60=\"F\",A60,\"\")","v":""}]
[{"$f":"IF(A61=\"F\",A61,\"\")","v":""},null,null,null,null,null,null,null,null,null,null,null,null,0.55000000000000004,null,null,null,{"$f":"100%-(SUM(F62:Q62))","v":0.44999999999999996},null,null,null,{"$f":"IFERROR(E60/100,\"\")","v":0},null,{"$f":"IF(E60=V62*100,\"OK\",\"ERRO\")","v":"OK"}]
[{"$f":"IF(D63>0,\"F\",\"\")","v":""},"ESQUADRIAS METÁLICAS",null,{"$f":"Orçamento!X865","v":0},{"$f":"Orçamento!AA865","v":0},{"$f":"ROUND(F65*$D$63,2)","v":0},null,null,null,{"$f":"ROUND(J65*$D$63,2)","v":0},null,null,null,{"$f":"ROUND(N65*$D$63,2)","v":0},null,null,null,{"$f":"ROUND(R65*$D$63,2)","v":0},null,null,null,{"$f":"SUM(F63:U63)","v":0},null,{"$f":"IF(D63=V63,\"OK\",\"ERRO\")","v":"OK"}]
[{"$f":"IF(A63=\"F\",A63,\"\")","v":""}]
[{"$f":"IF(A64=\"F\",A64,\"\")","v":""},null,null,null,null,null,null,null,null,null,null,null,null,0.55000000000000004,null,null,null,{"$f":"100%-(SUM(F65:Q65))","v":0.44999999999999996},null,null,null,{"$f":"IFERROR(E63/100,\"\")","v":0},null,{"$f":"IF(E63=V65*100,\"OK\",\"ERRO\")","v":"OK"}]
[{"$f":"IF(D66>0,\"F\",\"\")","v":""},"VIDROS",null,{"$f":"Orçamento!X866","v":0},{"$f":"Orçamento!AA866","v":0},{"$f":"ROUND(F68*$D$66,2)","v":0},null,null,null,{"$f":"ROUND(J68*$D$66,2)","v":0},null,null,null,{"$f":"ROUND(N68*$D$66,2)","v":0},null,null,null,{"$f":"ROUND(R68*$D$66,2)","v":0},null,null,null,{"$f":"SUM(F66:U66)","v":0},null,{"$f":"IF(D66=V66,\"OK\",\"ERRO\")","v":"OK"}]
[{"$f":"IF(A66=\"F\",A66,\"\")","v":""}]
[{"$f":"IF(A67=\"F\",A67,\"\")","v":""},null,null,null,null,null,null,null,null,null,null,null,null,0,null,null,null,1,null,null,null,{"$f":"IFERROR(E66/100,\"\")","v":0},null,{"$f":"IF(E66=V68*100,\"OK\",\"ERRO\")","v":"OK"}]
[{"$f":"IF(D69>0,\"F\",\"\")","v":""},"REVESTIMENTO DE PAREDE",null,{"$f":"Orçamento!X867","v":0},{"$f":"Orçamento!AA867","v":0},{"$f":"ROUND(F71*$D$69,2)","v":0},null,null,null,{"$f":"ROUND(J71*$D$69,2)","v":0},null,null,null,{"$f":"ROUND(N71*$D$69,2)","v":0},null,null,null,{"$f":"ROUND(R71*$D$69,2)","v":0},null,null,null,{"$f":"SUM(F69:U69)","v":0},null,{"$f":"IF(D69=V69,\"OK\",\"ERRO\")","v":"OK"}]
[{"$f":"IF(A69=\"F\",A69,\"\")","v":""}]
[{"$f":"IF(A70=\"F\",A70,\"\")","v":""},null,null,null,null,null,null,null,null,null,null,null,null,1,null,null,null,{"$f":"100%-(SUM(F71:Q71))","v":0},null,null,null,{"$f":"IFERROR(E69/100,\"\")","v":0},null,{"$f":"IF(E69=V71*100,\"OK\",\"ERRO\")","v":"OK"}]
[{"$f":"IF(D72>0,\"F\",\"\")","v":""},"FORROS",null,{"$f":"Orçamento!X868","v":0},{"$f":"Orçamento!AA868","v":0},{"$f":"ROUND(F74*$D$72,2)","v":0},null,null,null,{"$f":"ROUND(J74*$D$72,2)","v":0},null,null,null,{"$f":"ROUND(N74*$D$72,2)","v":0},null,null,null,{"$f":"ROUND(R74*$D$72,2)","v":0},null,null,null,{"$f":"SUM(F72:U72)","v":0},null,{"$f":"IF(D72=V72,\"OK\",\"ERRO\")","v":"OK"}]
[{"$f":"IF(A72=\"F\",A72,\"\")","v":""}]
[{"$f":"IF(A73=\"F\",A73,\"\")","v":""},null,null,null,null,null,null,null,null,null,null,null,null,0.4,null,null,null,{"$f":"100%-(SUM(F74:Q74))","v":0.6},null,null,null,{"$f":"IFERROR(E72/100,\"\")","v":0},null,{"$f":"IF(E72=V74*100,\"OK\",\"ERRO\")","v":"OK"}]
[{"$f":"IF(D75>0,\"F\",\"\")","v":""},"REVESTIMENTO DE PISO",null,{"$f":"Orçamento!X869","v":0},{"$f":"Orçamento!AA869","v":0},{"$f":"ROUND(F77*$D$75,2)","v":0},null,null,null,{"$f":"ROUND(J77*$D$75,2)","v":0},null,null,null,{"$f":"ROUND(N77*$D$75,2)","v":0},null,null,null,{"$f":"ROUND(R77*$D$75,2)","v":0},null,null,null,{"$f":"SUM(F75:U75)","v":0},null,{"$f":"IF(D75=V75,\"OK\",\"ERRO\")","v":"OK"}]
[{"$f":"IF(A75=\"F\",A75,\"\")","v":""}]
[{"$f":"IF(A76=\"F\",A76,\"\")","v":""},null,null,null,null,null,null,null,null,null,null,null,null,0.4,null,null,null,{"$f":"100%-(SUM(F77:Q77))","v":0.6},null,null,null,{"$f":"IFERROR(E75/100,\"\")","v":0},null,{"$f":"IF(E75=V77*100,\"OK\",\"ERRO\")","v":"OK"}]
[{"$f":"IF(D78>0,\"F\",\"\")","v":""},"FERRAGENS",null,{"$f":"Orçamento!X870","v":0},{"$f":"Orçamento!AA870","v":0},{"$f":"ROUND(F80*$D$78,2)","v":0},null,null,null,{"$f":"ROUND(J80*$D$78,2)","v":0},null,null,null,{"$f":"ROUND(N80*$D$78,2)","v":0},null,null,null,{"$f":"ROUND(R80*$D$78,2)","v":0},null,null,null,{"$f":"SUM(F78:U78)","v":0},null,{"$f":"IF(D78=V78,\"OK\",\"ERRO\")","v":"OK"}]
[{"$f":"IF(A78=\"F\",A78,\"\")","v":""}]
[{"$f":"IF(A79=\"F\",A79,\"\")","v":""},null,null,null,null,null,null,null,null,null,null,null,null,null,null,null,null,{"$f":"100%-(SUM(F80:Q80))","v":1},null,null,null,{"$f":"IFERROR(E78/100,\"\")","v":0},null,{"$f":"IF(E78=V80*100,\"OK\",\"ERRO\")","v":"OK"}]
[{"$f":"IF(D81>0,\"F\",\"\")","v":""},"MARCENARIA",null,{"$f":"Orçamento!X871","v":0},{"$f":"Orçamento!AA871","v":0},{"$f":"ROUND(F83*$D$81,2)","v":0},null,null,null,{"$f":"ROUND(J83*$D$81,2)","v":0},null,null,null,{"$f":"ROUND(N83*$D$81,2)","v":0},null,null,null,{"$f":"ROUND(R83*$D$81,2)","v":0},null,null,null,{"$f":"SUM(F81:U81)","v":0},null,{"$f":"IF(D81=V81,\"OK\",\"ERRO\")","v":"OK"}]
[{"$f":"IF(A81=\"F\",A81,\"\")","v":""}]
[{"$f":"IF(A82=\"F\",A82,\"\")","v":""},null,null,null,null,null,null,null,null,null,null,null,null,null,null,null,null,{"$f":"100%-(SUM(F83:Q83))","v":1},null,null,null,{"$f":"IFERROR(E81/100,\"\")","v":0},null,{"$f":"IF(E81=V83*100,\"OK\",\"ERRO\")","v":"OK"}]
[{"$f":"IF(D84>0,\"F\",\"\")","v":""},"ADMINISTRAÇÃO - MENSALISTAS",null,{"$f":"Orçamento!X872","v":0},{"$f":"Orçamento!AA872","v":0},{"$f":"ROUND(F86*$D$84,2)","v":0},null,null,null,{"$f":"ROUND(J86*$D$84,2)","v":0},null,null,null,{"$f":"ROUND(N86*$D$84,2)","v":0},null,null,null,{"$f":"ROUND(R86*$D$84,2)","v":0},null,null,null,{"$f":"SUM(F84:U84)","v":0},null,{"$f":"IF(D84=V84,\"OK\",\"ERRO\")","v":"OK"}]
[{"$f":"IF(A84=\"F\",A84,\"\")","v":""}]
[{"$f":"IF(A85=\"F\",A85,\"\")","v":""},null,null,null,null,0.27,null,null,null,0.22,null,null,null,0.25,null,null,null,{"$f":"100%-(SUM(F86:Q86))","v":0.26},null,null,null,{"$f":"IFERROR(E84/100,\"\")","v":0},null,{"$f":"IF(E84=V86*100,\"OK\",\"ERRO\")","v":"OK"}]
[{"$f":"IF(D87>0,\"F\",\"\")","v":""},"PINTURA",null,{"$f":"Orçamento!X873","v":0},{"$f":"Orçamento!AA873","v":0},{"$f":"ROUND(F89*$D$87,2)","v":0},null,null,null,{"$f":"ROUND(J89*$D$87,2)","v":0},null,null,null,{"$f":"ROUND(N89*$D$87,2)","v":0},null,null,null,{"$f":"ROUND(R89*$D$87,2)","v":0},null,null,null,{"$f":"SUM(F87:U87)","v":0},null,{"$f":"IF(D87=V87,\"OK\",\"ERRO\")","v":"OK"}]
[{"$f":"IF(A87=\"F\",A87,\"\")","v":""}]
[{"$f":"IF(A88=\"F\",A88,\"\")","v":""},null,null,null,null,null,null,null,null,null,null,null,null,0.36,null,null,null,{"$f":"100%-(SUM(F89:Q89))","v":0.64},null,null,null,{"$f":"IFERROR(E87/100,\"\")","v":0},null,{"$f":"IF(E87=V89*100,\"OK\",\"ERRO\")","v":"OK"}]
[{"$f":"IF(D90>0,\"F\",\"\")","v":""},"DIVERSOS",null,{"$f":"Orçamento!X874","v":0},{"$f":"Orçamento!AA874","v":0},{"$f":"ROUND(F92*$D$90,2)","v":0},null,null,null,{"$f":"ROUND(J92*$D$90,2)","v":0},null,null,null,{"$f":"ROUND(N92*$D$90,2)","v":0},null,null,null,{"$f":"ROUND(R92*$D$90,2)","v":0},null,null,null,{"$f":"SUM(F90:U90)","v":0},null,{"$f":"IF(D90=V90,\"OK\",\"ERRO\")","v":"OK"}]
[{"$f":"IF(A90=\"F\",A90,\"\")","v":""}]
[{"$f":"IF(A91=\"F\",A91,\"\")","v":""},null,null,null,null,0.27500000000000002,null,null,null,0.245,null,null,null,0.24,null,null,null,{"$f":"100%-(SUM(F92:Q92))","v":0.24},null,null,null,{"$f":"IFERROR(E90/100,\"\")","v":0},null,{"$f":"IF(E90=V92*100,\"OK\",\"ERRO\")","v":"OK"}]
["F","CUSTO DO ORÇAMENTO",null,{"$f":"SUM(D15:D92)","v":0},{"$f":"SUM(E15:E92)","v":0},{"$f":"F15+F18+F21+F24+F27+F30+F33+F36+F39+F42+F45+F48+F51+F54+F57+F60+F63+F66+F69+F72+F75+F78+F81+F84+F87+F90","v":0},null,null,null,{"$f":"J15+J18+J21+J24+J27+J30+J33+J36+J39+J42+J45+J48+J51+J54+J57+J60+J63+J66+J69+J72+J75+J78+J81+J84+J87+J90","v":0},null,null,null,{"$f":"N15+N18+N21+N24+N27+N30+N33+N36+N39+N42+N45+N48+N51+N54+N57+N60+N63+N66+N69+N72+N75+N78+N81+N84+N87+N90","v":0},null,null,null,{"$f":"R15+R18+R21+R24+R27+R30+R33+R36+R39+R42+R45+R48+R51+R54+R57+R60+R63+R66+R69+R72+R75+R78+R81+R84+R87+R90","v":0},null,null,null,{"$f":"V15+V18+V21+V24+V27+V30+V33+V36+V39+V42+V45+V48+V51+V54+V57+V60+V63+V66+V69+V72+V75+V78+V81+V84+V87+V90","v":0}]
["F","PERCENTUAIS:",null,null,null,{"$f":"IFERROR(F93/$D$93,\"\")","v":""},null,null,null,{"$f":"IFERROR(J93/$D$93,\"\")","v":""},null,null,null,{"$f":"IFERROR(N93/$D$93,\"\")","v":""},null,null,null,{"$f":"IFERROR(R93/$D$93,\"\")","v":""},null,null,null,{"$f":"SUM(F94:U94)","v":0}]
["F","TOTAIS ACUMULADOS:",null,null,null,{"$f":"F93","v":0},null,null,null,{"$f":"J93+F95","v":0},null,null,null,{"$f":"N93+J95","v":0},null,null,null,{"$f":"R93+N95","v":0}]
["F","PERCENTUAIS  ACUMULADOS:",null,null,null,{"$f":"F94","v":""},null,null,null,{"$f":"J94+F96","v":{"$error":"#VALUE!"}},null,null,null,{"$f":"N94+J96","v":{"$error":"#VALUE!"}},null,null,null,{"$f":"R94+N96","v":{"$error":"#VALUE!"}}]
["F"]
["F","OBSERVAÇÕES:"]
["F","Os pagamentos somente poderão ser efetuados mediante medição e atesto pelos técnicos da Secretaria da Educação. "]

{"sheet":"Composição BDI","index":4,"n_rows":45,"n_cols":9,"rows_kept":45,"cut":false,"hidden":false,"merged":[[18,5,18,8],[17,0,17,3],[16,0,16,3],[44,0,44,3],[42,0,42,3],[43,0,43,3],[18,0,18,3],[36,0,36,3],[39,0,39,3],[38,0,38,3],[40,0,40,3],[29,0,29,2],[32,0,32,3],[33,0,33,3],[34,0,34,3],[35,0,35,3],[0,0,0,3],[2,0,2,3],[3,0,3,3],[1,0,1,3],[5,0,5,3],[4,0,4,3],[12,0,12,3],[13,0,13,3],[14,0,14,3],[15,0,15,3],[6,0,6,3],[8,0,8,3],[7,0,7,3],[9,0,9,3],[11,0,11,3],[10,0,10,3]]}
[]
[]
["UNIDADE ESCOLAR"]
[{"$f":"Orçamento!$O$4","v":"CENTRO DE ENSINO EM PERÍODO INTEGRAL GARAVELO PARK"}]
[]
["OBRA"]
[{"$f":"Orçamento!$O$7","v":"AMPLIAÇÃO E REFORMA"}]
[]
["ENDEREÇO"]
[{"$f":"Orçamento!$R$10","v":"RUA 43-E QD.84 ESQ.C/ 44-E S/N QD.84, SETOR GARAVELO PARK, CEP:74932-640"}]
[]
["CIDADE"]
[{"$f":"Orçamento!$X$7","v":"APARECIDA DE GOIÂNIA"}]
[]
["CRE"]
[{"$f":"Orçamento!$O$10","v":"APARECIDA"}]
[]
["DETALHAMENTO DA COMPOSIÇÃO DE BDI"]
["COMPOSIÇÃO BDI PARA OBRAS CIVIS",null,null,null,null,"BDI CONSTRUÇÃO E REFORMA"]
["DESCRIÇÃO","COEF.","TAXA % (a.m)","% no preço de venda",null,"Situação","1º Quartil","Médio","3º Quartil"]
["1) COFINS",1,0.03,{"$f":"C21","v":0.03},null,{"$f":"IF(OR(C21<G21,C21>I21),\"FORA DO INTERVALO\",\"OK\")","v":"OK"},0.03,0.03,0.03]
["2) PIS",1,6.4999999999999997E-3,{"$f":"C22","v":6.4999999999999997E-3},null,{"$f":"IF(OR(C22<G22,C22>I22),\"FORA DO INTERVALO\",\"OK\")","v":"OK"},6.4999999999999997E-3,6.4999999999999997E-3,6.4999999999999997E-3]
["3) ISSQN",1,0.05,{"$f":"C23*B23","v":0.05},null,"OK",0.02,3.5000000000000003E-2,0.05]
["4) CPRB",1,4.4999999999999998E-2,{"$f":"C24","v":4.4999999999999998E-2},null,"OK",4.4999999999999998E-2,4.4999999999999998E-2,4.4999999999999998E-2]
["5) Administração Central",1,0.03,0.03,null,"OK",0.03,0.04,5.5E-2]
["6) Despesas Financeiras",1,5.5999999999999999E-3,5.5999999999999999E-3,null,"FORA DO INTERVALO",5.8999999999999999E-3,1.23E-2,1.3899999999999999E-2]
["7) Seguros + Garantias",1,1.1999999999999999E-3,1.1999999999999999E-3,null,"FORA DO INTERVALO",8.0000000000000002E-3,8.0000000000000002E-3,0.01]
["8) Risco",1,9.7000000000000003E-3,9.7000000000000003E-3,null,"OK",9.7000000000000003E-3,1.2699999999999999E-2,1.2699999999999999E-2]
["9) Lucro",1,6.1600000000000002E-2,6.1600000000000002E-2,null,"OK",6.1600000000000002E-2,7.3999999999999996E-2,8.9599999999999999E-2]
["BDI - FINAL",null,null,{"$f":"(((1+D25+D27+D28)*(1+D26)*(1+D29))/(1-(D21+D22+D23+D24))-1)","v":0.27945601481174465},null,"FORA DO INTERVALO",0.2034,0.22120000000000001,0.25]
[]
["Notas:"]
["(1) e (2) Alíquota definida por lei."]
["(3) Alíquota e base de cálculo definidas pela legislação municipal."]
["(4) Alíquota definida pelas leis 12.546/11, 12844/13 e 13.161/15 (CPRB – contribuição previdenciária sobre a receita bruta)."]
["(5) Valores definidos a partir dos limites no Acórdão nº 2.622/2013 - TCU – Plenário. Valores entre o 1º e 3º quartis."]
["(6) Valor calculado pela expressão matemática do acórdão 2.369/2011 – TCU – Plenário e disponibilizado pela AGETOP em dezembro de 2018. (Foi utilizado para o cálculo a média da Taxa SELIC no período de 11/2017 a 10/2018)"]
[]
["(7) Valores definidos pela AGETOP a partir dos limites no Acórdão nº 2.622/2013 - TCU – Plenário. Valores médios. \n\nObservação da AGETOP: (Seguros contra erros de execução, incêndio e explosão, danos da natureza (vendaval, destelhamento, alagamento, inundação, desmoronamento, geadas etc.), emprego de material defeituoso ou inadequado, roubo e/ou furto qualificado, quebra de equipamentos, desmoronamento de estrutura, nas modalidades de Obras Civis em Construção (OCC); Instalação e Montagem (IM); e Obras Civis em Construção e Instalação e Montagem (OCC/IM). Bem como coberturas adicionais para ampliação dessas coberturas básicas, como: cobertura de responsabilidade civil geral, cobertura de responsabilidade civil cruzada, cobertura de despesas extraordinárias, cobertura de tumultos, cobertura de desentulho do local, cobertura de riscos do fabricante, dentre outras, incluindo o seguro de vida em grupo regido pela convenção coletiva dos trabalhadores na indústria da construção civil). A partir de 24/02/2015 por intermédio da Portaria 449/2015 a Presidência da AGETOP, na pessoa do Senhor Jayme Eduardo Rincon, determinou a exclusão dos valores referentes aos Seguros de Risco de Engenharia e Responsabilidade Civil do Profissional na composição do cálculo do B.D.I.."]
["(8) Valores definidos a partir dos limites no Acórdão nº 2.622/2013 - TCU – Plenário. Valores entre 1º e 3° quartis."]
["(9) Valores definidos a partir dos limites definidos no Acórdão nº 2.622/2013 - TCU – Plenário. Valores adotados e praticados no mercado ( “ ex ante ” ) ou aqueles entre os 1º e 3º quartis."]
[]
["(*) A fórmula para estipulação da taxa de BDI estimado adotado é a mesma que foi aplicada para a obtenção das tabelas contidas no Acórdão n. 2.622/2013 – TCUPlenário"]
[]
["Obs.: Para obras com valores superiores a R$ 20.000.000,00 sugere-se recalcular o BDI, dimensionando as taxas de administração central e lucro para patamares inferiores ao estipulado acima."]

{"sheet":"Relatório CENTRAL","index":5,"n_rows":40,"n_cols":5,"rows_kept":40,"cut":false,"hidden":false,"merged":[[8,1,8,2],[8,3,8,4],[9,1,9,2],[10,1,10,4],[11,1,11,4],[39,1,39,2],[9,0,11,0],[0,1,0,4],[6,3,6,4],[9,3,9,4],[1,1,1,4],[2,1,2,2],[2,3,2,4],[3,1,3,2],[3,3,3,4],[4,1,4,4],[5,1,5,2],[5,3,5,4],[6,1,6,2],[7,1,7,4]]}
[]
[]
[null,"UNIDADE ESCOLAR",null,"CIDADE"]
[null,{"$f":"Orçamento!$O$4","v":"CENTRO DE ENSINO EM PERÍODO INTEGRAL GARAVELO PARK"},null,{"$f":"Orçamento!$X$7","v":"APARECIDA DE GOIÂNIA"}]
[]
[null,"OBRA",null,"CRE"]
[null,{"$f":"Orçamento!$O$7","v":"AMPLIAÇÃO E REFORMA"},null,{"$f":"Orçamento!$O$10","v":"APARECIDA"}]
[]
[null,"ENDEREÇO",null,"DATA"]
["FILTRO",{"$f":"Orçamento!$R$10","v":"RUA 43-E QD.84 ESQ.C/ 44-E S/N QD.84, SETOR GARAVELO PARK, CEP:74932-640"},null,{"$f":"Orçamento!$S$7","v":"2020-03-25"}]
[]
[null,"RELATÓRIO CENTRAL"]
["↓","CÓDIGO","ETAPA","PREÇO  (R$) C/ BDI","PARTIC  ( % )"]
[{"$f":"IF(D14>0,\"F\",\"\")","v":""},{"$f":"Orçamento!O849","v":"a."},{"$f":"Orçamento!P849","v":"SERVIÇOS PRELIMINARES"},{"$f":"Orçamento!X849","v":0},{"$f":"Orçamento!AA849","v":0}]
[{"$f":"IF(D15>0,\"F\",\"\")","v":""},{"$f":"Orçamento!O850","v":"b."},{"$f":"Orçamento!P850","v":"TRANSPORTES"},{"$f":"Orçamento!X850","v":0},{"$f":"Orçamento!AA850","v":0}]
["",{"$f":"Orçamento!O851","v":"c."},{"$f":"Orçamento!P851","v":"SERVIÇO EM TERRA"},{"$f":"Orçamento!X851","v":0},{"$f":"Orçamento!AA851","v":0}]
["",{"$f":"Orçamento!O852","v":"d."},{"$f":"Orçamento!P852","v":"FUNDAÇÕES E SONDAGENS"},{"$f":"Orçamento!X852","v":0},{"$f":"Orçamento!AA852","v":0}]
["",{"$f":"Orçamento!O853","v":"e."},{"$f":"Orçamento!P853","v":"ESTRUTURA"},{"$f":"Orçamento!X853","v":0},{"$f":"Orçamento!AA853","v":0}]
["",{"$f":"Orçamento!O854","v":"f."},{"$f":"Orçamento!P854","v":"INSTALAÇÕES ELÉTRICAS"},{"$f":"Orçamento!X854","v":0},{"$f":"Orçamento!AA854","v":0}]
["",{"$f":"Orçamento!O855","v":"g."},{"$f":"Orçamento!P855","v":"INSTALAÇÕES HIDROSSANITÁRIAS"},{"$f":"Orçamento!X855","v":0},{"$f":"Orçamento!AA855","v":0}]
["",{"$f":"Orçamento!O856","v":"h"},{"$f":"Orçamento!P856","v":"INSTALAÇÕES ESPECIAIS"},{"$f":"Orçamento!X856","v":0},{"$f":"Orçamento!AA856","v":0}]
["",{"$f":"Orçamento!O857","v":"i."},{"$f":"Orçamento!P857","v":"ALVENARIAS E DIVISÓRIAS"},{"$f":"Orçamento!X857","v":0},{"$f":"Orçamento!AA857","v":0}]
["",{"$f":"Orçamento!O858","v":"j."},{"$f":"Orçamento!P858","v":"ALVENARIA AUTO-PORTANTE"},{"$f":"Orçamento!X858","v":0},{"$f":"Orçamento!AA858","v":0}]
["",{"$f":"Orçamento!O859","v":"k."},{"$f":"Orçamento!P859","v":"IMPERMEABILIZAÇÃO"},{"$f":"Orçamento!X859","v":0},{"$f":"Orçamento!AA859","v":0}]
["",{"$f":"Orçamento!O860","v":"l."},{"$f":"Orçamento!P860","v":"ISOLAMENTO TÉRMICO E ACÚSTICO"},{"$f":"Orçamento!X860","v":0},{"$f":"Orçamento!AA860","v":0}]
["",{"$f":"Orçamento!O861","v":"m."},{"$f":"Orçamento!P861","v":"ESTRUTURA DE MADEIRA"},{"$f":"Orçamento!X861","v":0},{"$f":"Orçamento!AA861","v":0}]
["",{"$f":"Orçamento!O862","v":"n."},{"$f":"Orçamento!P862","v":"ESTRUTURAS METÁLICAS"},{"$f":"Orçamento!X862","v":0},{"$f":"Orçamento!AA862","v":0}]
["",{"$f":"Orçamento!O863","v":"o."},{"$f":"Orçamento!P863","v":"COBERTURAS"},{"$f":"Orçamento!X863","v":0},{"$f":"Orçamento!AA863","v":0}]
["",{"$f":"Orçamento!O864","v":"p."},{"$f":"Orçamento!P864","v":"ESQUADRIAS DE MADEIRA"},{"$f":"Orçamento!X864","v":0},{"$f":"Orçamento!AA864","v":0}]
["",{"$f":"Orçamento!O865","v":"q."},{"$f":"Orçamento!P865","v":"ESQUADRIAS METÁLICAS"},{"$f":"Orçamento!X865","v":0},{"$f":"Orçamento!AA865","v":0}]
["",{"$f":"Orçamento!O866","v":"r."},{"$f":"Orçamento!P866","v":"VIDROS"},{"$f":"Orçamento!X866","v":0},{"$f":"Orçamento!AA866","v":0}]
["",{"$f":"Orçamento!O867","v":"s."},{"$f":"Orçamento!P867","v":"REVESTIMENTO DE PAREDE"},{"$f":"Orçamento!X867","v":0},{"$f":"Orçamento!AA867","v":0}]
["",{"$f":"Orçamento!O868","v":"t."},{"$f":"Orçamento!P868","v":"FORROS"},{"$f":"Orçamento!X868","v":0},{"$f":"Orçamento!AA868","v":0}]
["",{"$f":"Orçamento!O869","v":"u."},{"$f":"Orçamento!P869","v":"REVESTIMENTO DE PISO"},{"$f":"Orçamento!X869","v":0},{"$f":"Orçamento!AA869","v":0}]
["",{"$f":"Orçamento!O870","v":"v."},{"$f":"Orçamento!P870","v":"FERRAGENS"},{"$f":"Orçamento!X870","v":0},{"$f":"Orçamento!AA870","v":0}]
["",{"$f":"Orçamento!O871","v":"w."},{"$f":"Orçamento!P871","v":"MARCENARIA"},{"$f":"Orçamento!X871","v":0},{"$f":"Orçamento!AA871","v":0}]
["",{"$f":"Orçamento!O872","v":"x."},{"$f":"Orçamento!P872","v":"ADMINISTRAÇÃO"},{"$f":"Orçamento!X872","v":0},{"$f":"Orçamento!AA872","v":0}]
["",{"$f":"Orçamento!O873","v":"y."},{"$f":"Orçamento!P873","v":"PINTURA"},{"$f":"Orçamento!X873","v":0},{"$f":"Orçamento!AA873","v":0}]
["",{"$f":"Orçamento!O874","v":"z."},{"$f":"Orçamento!P874","v":"DIVERSOS"},{"$f":"Orçamento!X874","v":0},{"$f":"Orçamento!AA874","v":0}]
["F","TOTAL GERAL DO ORÇAMENTO (R$) C/BDI",null,{"$f":"SUM(D14:D39)","v":0},{"$f":"SUM(E14:E39)","v":0}]

{"sheet":"Parc Maior Relev","index":6,"n_rows":32,"n_cols":7,"rows_kept":32,"cut":false,"hidden":false,"merged":[[0,1,0,6],[11,1,11,6],[1,1,1,6],[2,1,2,3],[2,4,2,6],[3,1,3,3],[3,4,3,6],[4,1,4,6],[5,1,5,3],[5,4,5,6],[9,1,9,3],[9,4,9,6],[10,1,10,6],[6,1,6,3],[6,4,6,6],[7,1,7,6],[10,0,12,0],[8,1,8,3],[8,4,8,6],[32,3,32,7],[30,1,30,6]]}
[]
[]
[null,"UNIDADE ESCOLAR",null,null,"CÓDIGO INEP"]
[null,{"$f":"Orçamento!$O$4","v":"CENTRO DE ENSINO EM PERÍODO INTEGRAL GARAVELO PARK"},null,null,{"$f":"Orçamento!$X$4","v":52030660}]
[]
[null,"OBRA",null,null,"CIDADE"]
[null,{"$f":"Orçamento!$O$7","v":"AMPLIAÇÃO E REFORMA"},null,null,{"$f":"Orçamento!$X$7","v":"APARECIDA DE GOIÂNIA"}]
[]
[null,"CRE",null,null,"ÁREA TOTAL CONSTRUÍDA (M²)"]
[null,{"$f":"Orçamento!$O$10","v":"APARECIDA"},null,null,{"$f":"Orçamento!$X$13","v":2186.3000000000002}]
["FILTRO"]
[null,"PARCELA DE MAIOR RELEVÂNCIA"]
[null,"CÓDIGO","SERVIÇO","DESCRIÇÃO","UNID","QUANT","PARC. MAIOR RELEV (100%)"]
[{"$f":"IF(F14>0,\"F\",\"\")","v":"F"},70000,"INSTALAÇÕES ELÉTRICAS","SUBESTAÇÃO","KVA",150,{"$f":"F14","v":150}]
[null,"CÓDIGO","SERVIÇO","DESCRIÇÃO","UNID","QUANT","PARC. MAIOR RELEV (50%)"]
[null,70000,"INSTALAÇÕES ELÉTRICAS","INSTALAÇÕES ELÉTRICAS","KVA",{"$f":"SUMIF(Orçamento!$R$20:$R$830,'Parc Maior Relev'!D16,Orçamento!$T$20:$T$830)","v":0},{"$f":"F16*0.5","v":0}]
[null,160000,"COBERTURAS","TELHA CERÂMICA","M2",{"$f":"SUMIF(Orçamento!$R$20:$R$830,'Parc Maior Relev'!D17,Orçamento!$T$20:$T$830)","v":0},0]
[null,160000,"COBERTURAS","TELHA FIBROCIMENTO","M2",{"$f":"SUMIF(Orçamento!$R$20:$R$830,'Parc Maior Relev'!D18,Orçamento!$T$20:$T$830)","v":0},0]
[null,160000,"COBERTURAS","TELHA METÁLICA","M2",{"$f":"SUMIF(Orçamento!$R$20:$R$830,'Parc Maior Relev'!D19,Orçamento!$T$20:$T$830)","v":0},0]
[null,200000,"REVESTIMENTO DE PAREDE","REBOCO","M2",{"$f":"SUMIF(Orçamento!$R$20:$R$830,'Parc Maior Relev'!D20,Orçamento!$T$20:$T$830)","v":0},0]
[null,200000,"REVESTIMENTO DE PAREDE","REVESTIMENTO CERÂMICO","M2",{"$f":"SUMIF(Orçamento!$R$20:$R$830,'Parc Maior Relev'!D21,Orçamento!$T$20:$T$830)","v":0},0]
[null,210000,"FORROS","FORRO DE GESSO","M2",{"$f":"SUMIF(Orçamento!$R$20:$R$830,'Parc Maior Relev'!D22,Orçamento!$T$20:$T$830)","v":0},0]
[null,210000,"FORROS","FORRO PVC","M2",{"$f":"SUMIF(Orçamento!$R$20:$R$830,'Parc Maior Relev'!D23,Orçamento!$T$20:$T$830)","v":0},0]
[null,210000,"FORROS","FORRO ACARTONADO","M2",{"$f":"SUMIF(Orçamento!$R$20:$R$830,'Parc Maior Relev'!D24,Orçamento!$T$20:$T$830)","v":0},0]
[null,220000,"REVESTIMENTO DE PISO","PISO GRANITINA","M2",{"$f":"Orçamento!V782+Orçamento!V824","v":155.26},77.63]
[null,220000,"REVESTIMENTO DE PISO","PISO LAMINADO","M2",{"$f":"SUMIF(Orçamento!$R$20:$R$830,'Parc Maior Relev'!D26,Orçamento!$T$20:$T$830)","v":0},0]
[null,220000,"REVESTIMENTO DE PISO","PISO CONCRETO DESEMPENADO","M2",{"$f":"SUMIF(Orçamento!$R$20:$R$830,'Parc Maior Relev'!D27,Orçamento!$T$20:$T$830)","v":0},0]
[null,220000,"REVESTIMENTO DE PISO","PISO CERÂMICO","M2",{"$f":"SUMIF(Orçamento!$R$20:$R$830,'Parc Maior Relev'!D28,Orçamento!$T$20:$T$830)","v":0},0]
[null,260000,"PINTURA","PINTURA","M2",{"$f":"SUMIF(Orçamento!$R$20:$R$830,'Parc Maior Relev'!D29,Orçamento!$T$20:$T$830)","v":0},0]
["F"]
["F","(*) Para os fins do inciso I dp § 1º do Art. 30 da Lei Federal 8.666/93, são consideradas parcelas de maior relevância técnica as execuções apresentadas"]
["F"]

{"sheet":"Composições","index":7,"n_rows":369,"n_cols":10,"rows_kept":369,"cut":false,"hidden":false,"merged":[[15,0,15,9],[13,0,13,2],[13,3,13,6],[1,0,1,9],[3,7,3,9],[4,7,4,9],[6,7,6,9],[7,7,7,9],[6,0,6,6],[10,8,10,9],[13,8,13,9],[14,0,14,9],[8,0,8,9],[5,0,5,9],[2,0,2,9],[0,0,0,8],[10,0,10,2],[10,3,10,6],[11,0,11,9],[12,0,12,2],[12,3,12,6],[12,7,12,8],[7,0,7,6],[9,0,9,2],[9,3,9,6],[9,7,9,8],[3,0,3,6],[4,0,4,6],[16,5,17,5],[16,6,16,7],[16,8,16,9],[21,1,21,7],[23,1,23,7],[16,0,17,0],[16,1,17,1],[16,2,17,2],[16,3,17,3],[16,4,17,4],[25,5,26,5],[25,6,25,7],[25,8,25,9],[30,1,30,7],[32,1,32,7],[25,0,26,0],[25,1,26,1],[25,2,26,2],[25,3,26,3],[25,4,26,4],[34,5,35,5],[34,6,34,7],[34,8,34,9],[39,1,39,7],[41,1,41,7],[34,0,35,0],[34,1,35,1],[34,2,35,2],[34,3,35,3],[34,4,35,4],[43,5,44,5],[43,6,43,7],[43,8,43,9],[47,1,47,7],[49,1,49,7],[43,0,44,0],[43,1,44,1],[43,2,44,2],[43,3,44,3],[43,4,44,4],[51,5,52,5],[51,6,51,7],[51,8,51,9],[56,1,56,7],[58,1,58,7],[51,0,52,0],[51,1,52,1],[51,2,52,2],[51,3,52,3],[51,4,52,4],[60,5,61,5],[60,6,60,7],[60,8,60,9],[64,1,64,7],[66,1,66,7],[60,0,61,0],[60,1,61,1],[60,2,61,2],[60,3,61,3],[60,4,61,4],[68,5,69,5],[68,6,68,7],[68,8,68,9],[73,1,73,7],[75,1,75,7],[68,0,69,0],[68,1,69,1],[68,2,69,2],[68,3,69,3],[68,4,69,4],[77,5,78,5],[77,6,77,7],[77,8,77,9],[81,1,81,7],[83,1,83,7],[77,0,78,0],[77,1,78,1],[77,2,78,2],[77,3,78,3],[77,4,78,4],[85,5,86,5],[85,6,85,7],[85,8,85,9],[90,1,90,7],[93,1,93,7],[85,0,86,0],[85,1,86,1],[85,2,86,2],[85,3,86,3],[85,4,86,4],[95,5,96,5],[95,6,95,7],[95,8,95,9],[100,1,100,7],[103,1,103,7],[95,0,96,0],[95,1,96,1],[95,2,96,2],[95,3,96,3],[95,4,96,4],[105,5,106,5],[105,6,105,7],[105,8,105,9],[110,1,110,7],[113,1,113,7],[105,0,106,0],[105,1,106,1],[105,2,106,2],[105,3,106,3],[105,4,106,4],[115,5,116,5],[115,6,115,7],[115,8,115,9],[120,1,120,7],[123,1,123,7],[115,0,116,0],[115,1,116,1],[115,2,116,2],[115,3,116,3],[115,4,116,4],[125,5,126,5],[125,6,125,7],[125,8,125,9],[129,1,129,7],[131,1,131,7],[125,0,126,0],[125,1,126,1],[125,2,126,2],[125,3,126,3],[125,4,126,4],[133,5,134,5],[133,6,133,7],[133,8,133,9],[138,1,138,7],[140,1,140,7],[133,0,134,0],[133,1,134,1],[133,2,134,2],[133,3,134,3],[133,4,134,4],[142,5,143,5],[142,6,142,7],[142,8,142,9],[147,1,147,7],[149,1,149,7],[142,0,143,0],[142,1,143,1],[142,2,143,2],[142,3,143,3],[142,4,143,4],[151,5,152,5],[151,6,151,7],[151,8,151,9],[156,1,156,7],[158,1,158,7],[151,0,152,0],[151,1,152,1],[151,2,152,2],[151,3,152,3],[151,4,152,4],[160,5,161,5],[160,6,160,7],[160,8,160,9],[165,1,165,7],[167,1,167,7],[160,0,161,0],[160,1,161,1],[160,2,161,2],[160,3,161,3],[160,4,161,4],[169,5,170,5],[169,6,169,7],[169,8,169,9],[173,1,173,7],[177,1,177,7],[169,0,170,0],[169,1,170,1],[169,2,170,2],[169,3,170,3],[169,4,170,4],[179,5,180,5],[179,6,179,7],[179,8,179,9],[183,1,183,7],[187,1,187,7],[179,0,180,0],[179,1,180,1],[179,2,180,2],[179,3,180,3],[179,4,180,4],[189,5,190,5],[189,6,189,7],[189,8,189,9],[193,1,193,7],[200,1,200,7],[189,0,190,0],[189,1,190,1],[189,2,190,2],[189,3,190,3],[189,4,190,4],[202,5,203,5],[202,6,202,7],[202,8,202,9],[206,1,206,7],[210,1,210,7],[202,0,203,0],[202,1,203,1],[202,2,203,2],[202,3,203,3],[202,4,203,4],[212,5,213,5],[212,6,212,7],[212,8,212,9],[216,1,216,7],[220,1,220,7],[212,0,213,0],[212,1,213,1],[212,2,213,2],[212,3,213,3],[212,4,213,4],[222,5,223,5],[222,6,222,7],[222,8,222,9],[226,1,226,7],[230,1,230,7],[222,0,223,0],[222,1,223,1],[222,2,223,2],[222,3,223,3],[222,4,223,4],[232,5,233,5],[232,6,232,7],[232,8,232,9],[236,1,236,7],[240,1,240,7],[232,0,233,0],[232,1,233,1],[232,2,233,2],[232,3,233,3],[232,4,233,4],[242,5,243,5],[242,6,242,7],[242,8,242,9],[247,1,247,7],[250,1,250,7],[242,0,243,0],[242,1,243,1],[242,2,243,2],[242,3,243,3],[242,4,243,4],[252,5,253,5],[252,6,252,7],[252,8,252,9],[257,1,257,7],[260,1,260,7],[252,0,253,0],[252,1,253,1],[252,2,253,2],[252,3,253,3],[252,4,253,4],[262,5,263,5],[262,6,262,7],[262,8,262,9],[267,1,267,7],[269,1,269,7],[262,0,263,0],[262,1,263,1],[262,2,263,2],[262,3,263,3],[262,4,263,4],[271,5,272,5],[271,6,271,7],[271,8,271,9],[276,1,276,7],[278,1,278,7],[271,0,272,0],[271,1,272,1],[271,2,272,2],[271,3,272,3],[271,4,272,4],[280,5,281,5],[280,6,280,7],[280,8,280,9],[285,1,285,7],[287,1,287,7],[280,0,281,0],[280,1,281,1],[280,2,281,2],[280,3,281,3],[280,4,281,4],[289,5,290,5],[289,6,289,7],[289,8,289,9],[294,1,294,7],[296,1,296,7],[289,0,290,0],[289,1,290,1],[289,2,290,2],[289,3,290,3],[289,4,290,4],[298,5,299,5],[298,6,298,7],[298,8,298,9],[303,1,303,7],[305,1,305,7],[298,0,299,0],[298,1,299,1],[298,2,299,2],[298,3,299,3],[298,4,299,4],[307,5,308,5],[307,6,307,7],[307,8,307,9],[312,1,312,7],[315,1,315,7],[307,0,308,0],[307,1,308,1],[307,2,308,2],[307,3,308,3],[307,4,308,4],[317,5,318,5],[317,6,317,7],[317,8,317,9],[322,1,322,7],[325,1,325,7],[317,0,318,0],[317,1,318,1],[317,2,318,2],[317,3,318,3],[317,4,318,4],[327,5,328,5],[327,6,327,7],[327,8,327,9],[331,1,331,7],[335,1,335,7],[327,0,328,0],[327,1,328,1],[327,2,328,2],[327,3,328,3],[327,4,328,4],[337,5,338,5],[337,6,337,7],[337,8,337,9],[341,1,341,7],[345,1,345,7],[337,0,338,0],[337,1,338,1],[337,2,338,2],[337,3,338,3],[337,4,338,4],[347,5,348,5],[347,6,347,7],[347,8,347,9],[351,1,351,7],[352,1,352,7],[347,0,348,0],[347,1,348,1],[347,2,348,2],[347,3,348,3],[347,4,348,4],[354,5,355,5],[354,6,354,7],[354,8,354,9],[357,1,357,7],[359,1,359,7],[354,0,355,0],[354,1,355,1],[354,2,355,2],[354,3,355,3],[354,4,355,4],[361,5,362,5],[361,6,361,7],[361,8,361,9],[366,1,366,7],[368,1,368,7],[361,0,362,0],[361,1,362,1],[361,2,362,2],[361,3,362,3],[361,4,362,4]]}
[]
[]
[]
["UNIDADE ESCOLAR",null,null,null,null,null,null,"CÓDIGO INEP"]
[{"$f":"Orçamento!$O$4","v":"CENTRO DE ENSINO EM PERÍODO INTEGRAL GARAVELO PARK"},null,null,null,null,null,null,{"$f":"Orçamento!$X$4","v":52030660}]
[]
["OBRA",null,null,null,null,null,null,"CIDADE"]
[{"$f":"Orçamento!$O$7","v":"AMPLIAÇÃO E REFORMA"},null,null,null,null,null,null,{"$f":"Orçamento!$X$7","v":"APARECIDA DE GOIÂNIA"}]
[]
["CRE",null,null,"ENDEREÇO",null,null,null,"REFERÊNCIA AGETOP"]
[{"$f":"Orçamento!$O$10","v":"APARECIDA"},null,null,{"$f":"Orçamento!$R$10","v":"RUA 43-E QD.84 ESQ.C/ 44-E S/N QD.84, SETOR GARAVELO PARK, CEP:74932-640"},null,null,null,{"$f":"Orçamento!$S$10","v":"ABR/19"},{"$f":"Orçamento!$T$10","v":"DESONERADA"}]
[]
["DATA",null,null,"ÁREA TOTAL CONSTRUÍDA (M²)",null,null,null,"REFERÊNCIA SINAPI"]
[{"$f":"Orçamento!$S$7","v":"2020-03-25"},null,null,{"$f":"Orçamento!$X$13","v":2186.3000000000002},null,null,null,{"$f":"Orçamento!$X$10","v":"OUT/19"},{"$f":"Orçamento!$Y$10","v":"DESONERADA"}]
[]
["COMPOSIÇÕES DE CUSTOS UNITÁRIOS - SEE-GO"]
[46,"FONTE","CÓDIGO","DESCRIÇÃO","UNIDADE","COEFIC.","CUSTO UNITÁRIO",null,"CUSTO  TOTAL (A) + (B) + (C) + (D) + (E)"]
[null,null,null,null,null,null,"DESONERADO","NÃO DESONER.","DESONERADO","NÃO DESONER."]
[null,"COMPOSIÇÃO","COMP 046_SEE","CAPUZ PARA PROTEÇÃO DOS PARA RAIOS","UN ",null,null,null,16.100000000000001,16.150000000000002]
[null,"AGETOP_I",8,"AJUDANTE","h     ",3.3300000000000003E-2,8.75,10.14,0.28999999999999998,0.34]
[null,"AGETOP_I",12,"MATERIAL HIDRO-SANITÁRIO",0,3.3300000000000003E-2,0,0,0,0]
[null,"MÃO DE OBRA (B) - TOTAL",null,null,null,null,null,null,0.28999999999999998,0.34]
[null,"COTAÇÃO","COT 010_SEE","CAPUZ PARA PROTEÇÃO DOS PARA RAIOS","UN ",1,15.81,15.81,15.81,15.81]
[null,"MATERIAL (C) - TOTAL",null,null,null,null,null,null,15.81,15.81]
[]
[47,"FONTE","CÓDIGO","DESCRIÇÃO","UNIDADE","COEFIC.","CUSTO UNITÁRIO",null,"CUSTO  TOTAL (A) + (B) + (C) + (D) + (E)"]
[null,null,null,null,null,null,"DESONERADO","NÃO DESONER.","DESONERADO","NÃO DESONER."]
[null,"COMPOSIÇÃO","COMP 047_SEE","CAPUZ DE PROTEÇÃO PARA BUCHA DE TRANSFORMADOR","UN ",null,null,null,16.100000000000001,16.150000000000002]
[null,"AGETOP_I",8,"AJUDANTE","h     ",3.3300000000000003E-2,8.75,10.14,0.28999999999999998,0.34]
[null,"AGETOP_I",12,"MATERIAL HIDRO-SANITÁRIO",0,3.3300000000000003E-2,0,0,0,0]
[null,"MÃO DE OBRA (B) - TOTAL",null,null,null,null,null,null,0.28999999999999998,0.34]
[null,"COTAÇÃO","COT 011_SEE","CAPUZ DE PROTEÇÃO PARA BUCHA DE TRANSFORMADOR","UN ",1,15.81,15.81,15.81,15.81]
[null,"MATERIAL (C) - TOTAL",null,null,null,null,null,null,15.81,15.81]
[]
[48,"FONTE","CÓDIGO","DESCRIÇÃO","UNIDADE","COEFIC.","CUSTO UNITÁRIO",null,"CUSTO  TOTAL (A) + (B) + (C) + (D) + (E)"]
[null,null,null,null,null,null,"DESONERADO","NÃO DESONER.","DESONERADO","NÃO DESONER."]
[null,"COMPOSIÇÃO","COMP 048_SEE","HASTE ROSQUEADA \"TIRANTE\" 3/8\"","M",null,null,null,8.879999999999999,9.44]
[null,"AGETOP_I",8,"AJUDANTE","h     ",0.4,8.75,10.14,3.5,4.0599999999999996]
[null,"AGETOP_I",12,"MATERIAL HIDRO-SANITÁRIO",0,0.4,0,0,0,0]
[null,"MÃO DE OBRA (B) - TOTAL",null,null,null,null,null,null,3.5,4.0599999999999996]
[null,"COTAÇÃO","COT 012_SEE","HASTE ROSQUEADA \"TIRANTE\" 3/8\"","M",1,5.3833333333333329,5.3833333333333329,5.38,5.38]
[null,"MATERIAL (C) - TOTAL",null,null,null,null,null,null,5.38,5.38]
[]
[49,"FONTE","CÓDIGO","DESCRIÇÃO","UNIDADE","COEFIC.","CUSTO UNITÁRIO",null,"CUSTO  TOTAL (A) + (B) + (C) + (D) + (E)"]
[null,null,null,null,null,null,"DESONERADO","NÃO DESONER.","DESONERADO","NÃO DESONER."]
[null,"COMPOSIÇÃO","COMP 049_SEE","PORCA SEXTAVADA 3/8\"","UN ",null,null,null,0.21000000000000002,0.22]
[null,"AGETOP_I",8,"AJUDANTE","h     ",8.9999999999999993E-3,8.75,10.14,0.08,0.09]
[null,"MÃO DE OBRA (B) - TOTAL",null,null,null,null,null,null,0.08,0.09]
[null,"COTAÇÃO","COT 013_SEE","PORCA SEXTAVADA 3/8\"","UN ",1,0.13,0.13,0.13,0.13]
[null,"MATERIAL (C) - TOTAL",null,null,null,null,null,null,0.13,0.13]
[]
[40,"FONTE","CÓDIGO","DESCRIÇÃO","UNIDADE","COEFIC.","CUSTO UNITÁRIO",null,"CUSTO  TOTAL (A) + (B) + (C) + (D) + (E)"]
[null,null,null,null,null,null,"DESONERADO","NÃO DESONER.","DESONERADO","NÃO DESONER."]
[null,"COMPOSIÇÃO","COMP 040_SEE","CONJUNTO MOTOR-BOMBA ELÉTRICA TRIFÁSICO 380/220 V PARA VZ= 24,33 M³/H, HM= 46,24 M POTÊNCIA= 7,5 CV","UN ",null,null,null,3862.67,3873.79]
[null,"AGETOP_I",8,"AJUDANTE","h     ",8,8.75,10.14,70,81.12]
[null,"AGETOP_I",11,"MATERIAL ELÉTRICO",0,8,0,0,0,0]
[null,"MÃO DE OBRA (B) - TOTAL",null,null,null,null,null,null,70,81.12]
[null,"COTAÇÃO","COT 008_SEE","CONJUNTO MOTOR-BOMBA ELÉTRICA TRIFÁSICO 380/220 V PARA VZ= 24,33 M³/H, HM= 46,24 M POTÊNCIA= 7,5 CV","UN ",1,3792.6666666666665,3792.6666666666665,3792.67,3792.67]
[null,"MATERIAL (C) - TOTAL",null,null,null,null,null,null,3792.67,3792.67]
[]
[194,"FONTE","CÓDIGO","DESCRIÇÃO","UNIDADE","COEFIC.","CUSTO UNITÁRIO",null,"CUSTO  TOTAL (A) + (B) + (C) + (D) + (E)"]
[null,null,null,null,null,null,"DESONERADO","NÃO DESONER.","DESONERADO","NÃO DESONER."]
[null,"COMPOSIÇÃO","COMP 194_SEE","TAMPÃO CEGO COM CORRENTE 1.1/2\"","UN ",null,null,null,52.31,52.31]
[null,"AGETOP_I",11,"MATERIAL ELÉTRICO",0,0.15,0,0,0,0]
[null,"MÃO DE OBRA (B) - TOTAL",null,null,null,null,null,null,0,0]
[null,"SINAPI_I",20964,"TAMPAO COM CORRENTE, EM LATAO, ENGATE RAPIDO 1 1/2\", PARA INSTALACAO PREDIAL DE COMBATE A INCENDIO","UN    ",1,52.31,52.31,52.31,52.31]
[null,"MATERIAL (C) - TOTAL",null,null,null,null,null,null,52.31,52.31]
[]
[17,"FONTE","CÓDIGO","DESCRIÇÃO","UNIDADE","COEFIC.","CUSTO UNITÁRIO",null,"CUSTO  TOTAL (A) + (B) + (C) + (D) + (E)"]
[null,null,null,null,null,null,"DESONERADO","NÃO DESONER.","DESONERADO","NÃO DESONER."]
[null,"COMPOSIÇÃO","COMP 017_SEE","REDUCAO GIRATÓRIA TIPO STORZ LATAO P/ INST. PREDIAL COMBATE A INCENDIO ENGATE RAPIDO 2.1/2\" X 1.1/2\"","UN ",null,"-","-",97.09,97.31]
[null,"AGETOP_I",8,"AJUDANTE","h     ",0.16,8.75,10.14,1.4,1.62]
[null,"AGETOP_I",11,"MATERIAL ELÉTRICO",0,0.16,0,0,0,0]
[null,"MÃO DE OBRA (B) - TOTAL",null,null,null,null,null,null,1.4,1.62]
[null,"SINAPI_I",20972,"REDUCAO FIXA TIPO STORZ, ENGATE RAPIDO 2.1/2\" X 1.1/2\", EM LATAO, PARA INSTALACAO PREDIAL COMBATE A INCENDIO PREDIAL","UN    ",1,95.69,95.69,95.69,95.69]
[null,"MATERIAL (C) - TOTAL",null,null,null,null,null,null,95.69,95.69]
[]
[18,"FONTE","CÓDIGO","DESCRIÇÃO","UNIDADE","COEFIC.","CUSTO UNITÁRIO",null,"CUSTO  TOTAL (A) + (B) + (C) + (D) + (E)"]
[null,null,null,null,null,null,"DESONERADO","NÃO DESONER.","DESONERADO","NÃO DESONER."]
[null,"COMPOSIÇÃO","COMP 018_SEE","CHAVE DUPLA P/ CONEXÕES TIPO STORZ EM LATÃO ENGATE RÁPIDO 1 1/2\" X 2 1/2\"","UN ",null,"-","-",12.75,12.75]
[null,"AGETOP_I",11,"MATERIAL ELÉTRICO",0,0.15,0,0,0,0]
[null,"MÃO DE OBRA (B) - TOTAL",null,null,null,null,null,null,0,0]
[null,"SINAPI_I",20971,"CHAVE DUPLA PARA CONEXOES TIPO STORZ, ENGATE RAPIDO 1 1/2\" X 2 1/2\", EM LATAO, PARA INSTALACAO PREDIAL COMBATE A INCENDIO","UN    ",1,12.75,12.75,12.75,12.75]
[null,"MATERIAL (C) - TOTAL",null,null,null,null,null,null,12.75,12.75]
[]
[87,"FONTE","CÓDIGO","DESCRIÇÃO","UNIDADE","COEFIC.","CUSTO UNITÁRIO",null,"CUSTO  TOTAL (A) + (B) + (C) + (D) + (E)"]
[null,null,null,null,null,null,"DESONERADO","NÃO DESONER.","DESONERADO","NÃO DESONER."]
[null,"COMPOSIÇÃO","COMP 087_SEE","REGISTRO DE GAVETA COM HASTE ASCENDENTE DE BRONZE 2 1/2\"","UN ",null,null,null,241.73,243.32999999999998]
[null,"AGETOP_I",8,"AJUDANTE","h     ",1.1499999999999999,8.75,10.14,10.06,11.66]
[null,"AGETOP_I",11,"MATERIAL ELÉTRICO",0,1.1499999999999999,0,0,0,0]
[null,"MÃO DE OBRA (B) - TOTAL",null,null,null,null,null,null,10.06,11.66]
[null,"AGETOP_I","H689","","",2.82,0,0,0,0]
[null,"COTAÇÃO","COT 017_SEE","REGISTRO DE GAVETA COM HASTE ASCENDENTE DE BRONZE 2 1/2\"","UN ",1,231.66666666666666,231.66666666666666,231.67,231.67]
[null,"MATERIAL (C) - TOTAL",null,null,null,null,null,null,231.67,231.67]
[]
[30,"FONTE","CÓDIGO","DESCRIÇÃO","UNIDADE","COEFIC.","CUSTO UNITÁRIO",null,"CUSTO  TOTAL (A) + (B) + (C) + (D) + (E)"]
[null,null,null,null,null,null,"DESONERADO","NÃO DESONER.","DESONERADO","NÃO DESONER."]
[null,"COMPOSIÇÃO","COMP 030_SEE","COTOVELO DE FERRO GALV. 90° X 2 1/2\"","UN ",null,null,null,56.78,58.059999999999995]
[null,"AGETOP_I",8,"AJUDANTE","h     ",0.92,8.75,10.14,8.0500000000000007,9.33]
[null,"AGETOP_I",11,"MATERIAL ELÉTRICO",0,0.92,0,0,0,0]
[null,"MÃO DE OBRA (B) - TOTAL",null,null,null,null,null,null,8.0500000000000007,9.33]
[null,"SINAPI_I",3470,"COTOVELO 90 GRAUS DE FERRO GALVANIZADO, COM ROSCA BSP, DE 2 1/2\"","UN    ",1,48.73,48.73,48.73,48.73]
[null,"AGETOP_I","H689","","",2,0,0,0,0]
[null,"MATERIAL (C) - TOTAL",null,null,null,null,null,null,48.73,48.73]
[]
[77,"FONTE","CÓDIGO","DESCRIÇÃO","UNIDADE","COEFIC.","CUSTO UNITÁRIO",null,"CUSTO  TOTAL (A) + (B) + (C) + (D) + (E)"]
[null,null,null,null,null,null,"DESONERADO","NÃO DESONER.","DESONERADO","NÃO DESONER."]
[null,"COMPOSIÇÃO","COMP 077_SEE","UNIAO FERRO GALV C/ASSENTO CONICO BRONZE 2 1/2\"","UN ",null,null,null,142.49,143.05000000000001]
[null,"AGETOP_I",8,"AJUDANTE","h     ",0.4,8.75,10.14,3.5,4.0599999999999996]
[null,"AGETOP_I",11,"MATERIAL ELÉTRICO",0,0.4,0,0,0,0]
[null,"MÃO DE OBRA (B) - TOTAL",null,null,null,null,null,null,3.5,4.0599999999999996]
[null,"AGETOP_I","H689","","",2.4,0,0,0,0]
[null,"SINAPI_I",12427,"UNIAO COM ASSENTO CONICO DE BRONZE, DIAMETRO 2 1/2\"","UN    ",1,138.99,138.99,138.99,138.99]
[null,"MATERIAL (C) - TOTAL",null,null,null,null,null,null,138.99,138.99]
[]
[347,"FONTE","CÓDIGO","DESCRIÇÃO","UNIDADE","COEFIC.","CUSTO UNITÁRIO",null,"CUSTO  TOTAL (A) + (B) + (C) + (D) + (E)"]
[null,null,null,null,null,null,"DESONERADO","NÃO DESONER.","DESONERADO","NÃO DESONER."]
[null,"COMPOSIÇÃO","COMP 347_SEE","ADAPTADOR PVC SOLDAVEL, COM FLANGES LIVRES, 75 MM X 2 1/2\", PARA CAIXA D' AGUA","UN ",null,null,null,116.42,116.61]
[null,"AGETOP_I",11,"MATERIAL ELÉTRICO",0,0.14000000000000001,0,0,0,0]
[null,"AGETOP_I",8,"AJUDANTE","h     ",0.14000000000000001,8.75,10.14,1.23,1.42]
[null,"MÃO DE OBRA (B) - TOTAL",null,null,null,null,null,null,1.23,1.42]
[null,"SINAPI_I",83,"ADAPTADOR PVC SOLDAVEL, COM FLANGES LIVRES, 75 MM X 2  1/2\", PARA CAIXA D' AGUA","UN    ",1,115.19,115.19,115.19,115.19]
[null,"AGETOP_I","H689","","",1.88,0,0,0,0]
[null,"MATERIAL (C) - TOTAL",null,null,null,null,null,null,115.19,115.19]
[]
[22,"FONTE","CÓDIGO","DESCRIÇÃO","UNIDADE","COEFIC.","CUSTO UNITÁRIO",null,"CUSTO  TOTAL (A) + (B) + (C) + (D) + (E)"]
[null,null,null,null,null,null,"DESONERADO","NÃO DESONER.","DESONERADO","NÃO DESONER."]
[null,"COMPOSIÇÃO","COMP 022_SEE","TAMPÃO FOFO 40X50CM C/INSCRIÇÃO ","UN ",null,"-","-",197.82,197.82]
[null,"AGETOP_I",11,"MATERIAL ELÉTRICO",0,0.15,0,0,0,0]
[null,"MÃO DE OBRA (B) - TOTAL",null,null,null,null,null,null,0,0]
[null,"SINAPI_I",11293,"TAMPAO FOFO SIMPLES COM BASE, CLASSE A15 CARGA MAX 1,5 T, 400 X 500 MM, COM INSCRICAO INCENDIO","UN    ",1,197.82,197.82,197.82,197.82]
[null,"MATERIAL (C) - TOTAL",null,null,null,null,null,null,197.82,197.82]
[]
[546,"FONTE","CÓDIGO","DESCRIÇÃO","UNID ","COEFIC.","CUSTO UNITÁRIO",null,"CUSTO  TOTAL (A) + (B) + (C) + (D) + (E)"]
[null,null,null,null,null,null,"DESONERADO","NÃO DESONER.","DESONERADO","NÃO DESONER."]
[null,"COMPOSIÇÃO","COMP 546_SEE","BUJÃO DE REBORDO 2.1/2\"","UN ","-","-","-",15.61,15.71]
[null,"AGETOP_I",8,"AJUDANTE","h     ",7.0000000000000007E-2,8.75,10.14,0.61,0.71]
[null,"AGETOP_I",11,"MATERIAL ELÉTRICO",0,7.0000000000000007E-2,0,0,0,0]
[null,"MÃO DE OBRA (B) - TOTAL",null,null,null,null,null,null,0.61,0.71]
[null,"COTAÇÃO","COT 286_SEE","BUJÃO DE REBORDO 2.1/2\"","UN ",1,15,15,15,15]
[null,"MATERIAL (C) - TOTAL",null,null,null,null,null,null,15,15]
[]
[186,"FONTE","CÓDIGO","DESCRIÇÃO","UNIDADE","COEFIC.","CUSTO UNITÁRIO",null,"CUSTO  TOTAL (A) + (B) + (C) + (D) + (E)"]
[null,null,null,null,null,null,"DESONERADO","NÃO DESONER.","DESONERADO","NÃO DESONER."]
[null,"COMPOSIÇÃO","COMP 186_SEE","BOTOEIRA BOMBA DE INCÊNDIO C/ MARTELO CONVENCIONAL/ ANALÓGICA","UN ",null,null,null,72.25,73.64]
[null,"AGETOP_I",8,"AJUDANTE","h     ",1,8.75,10.14,8.75,10.14]
[null,"AGETOP_I",12,"MATERIAL HIDRO-SANITÁRIO",0,1,0,0,0,0]
[null,"MÃO DE OBRA (B) - TOTAL",null,null,null,null,null,null,8.75,10.14]
[null,"COTAÇÃO","COT 088_SEE","BOTOEIRA BOMBA DE INCÊNDIO C/ MARTELO CONVENCIONAL/ ANALÓGICA","UN",1,63.5,63.5,63.5,63.5]
[null,"MATERIAL (C) - TOTAL",null,null,null,null,null,null,63.5,63.5]
[]
[188,"FONTE","CÓDIGO","DESCRIÇÃO","UNIDADE","COEFIC.","CUSTO UNITÁRIO",null,"CUSTO  TOTAL (A) + (B) + (C) + (D) + (E)"]
[null,null,null,null,null,null,"DESONERADO","NÃO DESONER.","DESONERADO","NÃO DESONER."]
[null,"COMPOSIÇÃO","COMP 188_SEE","ACIONADOR MANUAL DE ALARME","UN ",null,null,null,90.33,91.44]
[null,"AGETOP_I",8,"AJUDANTE","h     ",0.8,8.75,10.14,7,8.11]
[null,"AGETOP_I",12,"MATERIAL HIDRO-SANITÁRIO",0,0.8,0,0,0,0]
[null,"MÃO DE OBRA (B) - TOTAL",null,null,null,null,null,null,7,8.11]
[null,"COTAÇÃO","COT 090_SEE","ACIONADOR MANUAL DE ALARME","UN",1,83.333333333333329,83.333333333333329,83.33,83.33]
[null,"MATERIAL (C) - TOTAL",null,null,null,null,null,null,83.33,83.33]
[]
[190,"FONTE","CÓDIGO","DESCRIÇÃO","UNIDADE","COEFIC.","CUSTO UNITÁRIO",null,"CUSTO  TOTAL (A) + (B) + (C) + (D) + (E)"]
[null,null,null,null,null,null,"DESONERADO","NÃO DESONER.","DESONERADO","NÃO DESONER."]
[null,"COMPOSIÇÃO","COMP 190_SEE","CENTRAL DE DETECÇÃO E ALARME DE 40 SETORES COM BATERIA","UN ",null,null,null,1033.33,1044.45]
[null,"AGETOP_I",8,"AJUDANTE","h     ",8,8.75,10.14,70,81.12]
[null,"AGETOP_I",12,"MATERIAL HIDRO-SANITÁRIO",0,8,0,0,0,0]
[null,"MÃO DE OBRA (B) - TOTAL",null,null,null,null,null,null,70,81.12]
[null,"COTAÇÃO","COT 092_SEE","CENTRAL DE DETECÇÃO E ALARME DE 40 SETORES COM BATERIA (PREÇO MÉDIO)","UN",1,963.33333333333337,963.33333333333337,963.33,963.33]
[null,"MATERIAL (C) - TOTAL",null,null,null,null,null,null,963.33,963.33]
[]
[24,"FONTE","CÓDIGO","DESCRIÇÃO","UNIDADE","COEFIC.","CUSTO UNITÁRIO",null,"CUSTO  TOTAL (A) + (B) + (C) + (D) + (E)"]
[null,null,null,null,null,null,"DESONERADO","NÃO DESONER.","DESONERADO","NÃO DESONER."]
[null,"COMPOSIÇÃO","COMP 024_SEE","SINALIZADOR FOTOLUMINESCENTE PARA EXTINTOR","UN ",null,"-","-",25.319999999999997,25.439999999999998]
[null,"AGETOP_I",5,"SERVENTE","h     ",0.09,8.75,10.14,0.79,0.91]
[null,"MÃO DE OBRA (B) - TOTAL",null,null,null,null,null,null,0.79,0.91]
[null,"AGETOP_I",3070,"BUCHA DE NYLON S-6","un",2,0.04,0.04,0.08,0.08]
[null,"AGETOP_I",3393,"PARAFUSO P/BUCHA S-6","un",2,0.08,0.08,0.16,0.16]
[null,"SINAPI_I",37556,"PLACA DE SINALIZACAO DE SEGURANCA CONTRA INCENDIO, FOTOLUMINESCENTE, QUADRADA, *20 X 20* CM, EM PVC *2* MM ANTI-CHAMAS (SIMBOLOS, CORES E PICTOGRAMAS CONFORME NBR 13434)","UN    ",1,24.29,24.29,24.29,24.29]
[null,"MATERIAL (C) - TOTAL",null,null,null,null,null,null,24.529999999999998,24.529999999999998]
[]
[25,"FONTE","CÓDIGO","DESCRIÇÃO","UNIDADE","COEFIC.","CUSTO UNITÁRIO",null,"CUSTO  TOTAL (A) + (B) + (C) + (D) + (E)"]
[null,null,null,null,null,null,"DESONERADO","NÃO DESONER.","DESONERADO","NÃO DESONER."]
[null,"COMPOSIÇÃO","COMP 025_SEE","SINALIZADOR FOTOLUMINESCENTE DE EMERGÊNCIA","UN ",null,"-","-",25.319999999999997,25.439999999999998]
[null,"AGETOP_I",5,"SERVENTE","h     ",0.09,8.75,10.14,0.79,0.91]
[null,"MÃO DE OBRA (B) - TOTAL",null,null,null,null,null,null,0.79,0.91]
[null,"AGETOP_I",3070,"BUCHA DE NYLON S-6","un",2,0.04,0.04,0.08,0.08]
[null,"AGETOP_I",3393,"PARAFUSO P/BUCHA S-6","un",2,0.08,0.08,0.16,0.16]
[null,"SINAPI_I",37556,"PLACA DE SINALIZACAO DE SEGURANCA CONTRA INCENDIO, FOTOLUMINESCENTE, QUADRADA, *20 X 20* CM, EM PVC *2* MM ANTI-CHAMAS (SIMBOLOS, CORES E PICTOGRAMAS CONFORME NBR 13434)","UN    ",1,24.29,24.29,24.29,24.29]
[null,"MATERIAL (C) - TOTAL",null,null,null,null,null,null,24.529999999999998,24.529999999999998]
[]
[277,"FONTE","CÓDIGO","DESCRIÇÃO","UNIDADE","COEFIC.","CUSTO UNITÁRIO",null,"CUSTO  TOTAL (A) + (B) + (C) + (D) + (E)"]
[null,null,null,null,null,null,"DESONERADO","NÃO DESONER.","DESONERADO","NÃO DESONER."]
[null,"COMPOSIÇÃO","COMP 277_SEE","MARCAÇÃO NO PISO - 1X1 M PARA EXTINTOR","M2",null,null,null,29.54,29.619999999999997]
[null,"AGETOP_I",5,"SERVENTE","h     ",3.3300000000000003E-2,8.75,10.14,0.28999999999999998,0.34]
[null,"MÃO DE OBRA (B) - TOTAL",null,null,null,null,null,null,0.28999999999999998,0.34]
[null,"SINAPI_I",5318,"SOLVENTE DILUENTE A BASE DE AGUARRAS","L     ",0.13,11,11,1.43,1.43]
[null,"SINAPI",5824,"CAMINHÃO TOCO, PBT 16.000 KG, CARGA ÚTIL MÁX. 10.685 KG, DIST. ENTRE EIXOS 4,8 M, POTÊNCIA 189 CV, INCLUSIVE CARROCERIA FIXA ABERTA DE MADEIRA P/ TRANSPORTE GERAL DE CARGA SECA, DIMEN. APROX. 2,5 X 7,00 X 0,50 M - CHP DIURNO. AF_06/2014","CHP",3.3E-3,122.72,125.93,0.4,0.42]
[null,"SINAPI_I",7343,"TINTA A BASE DE RESINA ACRILICA, PARA SINALIZACAO HORIZONTAL VIARIA (NBR 11862)","L     ",0.6,12.55,12.55,7.53,7.53]
[null,"SINAPI_I",7348,"TINTA ACRILICA PREMIUM PARA PISO","L     ",0.03,13,13,0.39,0.39]
[null,"SINAPI_I",25972,"MICROESFERAS DE VIDRO PARA SINALIZACAO HORIZONTAL VIARIA, TIPO I-B (PREMIX) - NBR 16184","KG    ",2.14,8.94,8.94,19.13,19.13]
[null,"SINAPI",95133,"MÁQUINA DEMARCADORA DE FAIXA DE TRÁFEGO À FRIO, AUTOPROPELIDA, POTÊNCIA 38 HP - CHP DIURNO. AF_07/2016","CHP",3.3E-3,111.93,115.51,0.37,0.38]
[null,"MATERIAL (C) - TOTAL",null,null,null,null,null,null,29.25,29.279999999999998]
[]
[235,"FONTE","CÓDIGO","DESCRIÇÃO","UNIDADE","COEFIC.","CUSTO UNITÁRIO",null,"CUSTO  TOTAL (A) + (B) + (C) + (D) + (E)"]
[null,null,null,null,null,null,"DESONERADO","NÃO DESONER.","DESONERADO","NÃO DESONER."]
[null,"COMPOSIÇÃO","COMP 235_SEE","PLACA DE SINALIZAÇÃO EM PVC COD 01 - (300X300) PROIBIDO FUMAR","UN ",null,null,null,25.319999999999997,25.439999999999998]
[null,"AGETOP_I",5,"SERVENTE","h     ",0.09,8.75,10.14,0.79,0.91]
[null,"MÃO DE OBRA (B) - TOTAL",null,null,null,null,null,null,0.79,0.91]
[null,"AGETOP_I",3070,"BUCHA DE NYLON S-6","un",2,0.04,0.04,0.08,0.08]
[null,"AGETOP_I",3393,"PARAFUSO P/BUCHA S-6","un",2,0.08,0.08,0.16,0.16]
[null,"SINAPI_I",37556,"PLACA DE SINALIZACAO DE SEGURANCA CONTRA INCENDIO, FOTOLUMINESCENTE, QUADRADA, *20 X 20* CM, EM PVC *2* MM ANTI-CHAMAS (SIMBOLOS, CORES E PICTOGRAMAS CONFORME NBR 13434)","UN    ",1,24.29,24.29,24.29,24.29]
[null,"MATERIAL (C) - TOTAL",null,null,null,null,null,null,24.529999999999998,24.529999999999998]
[]
[236,"FONTE","CÓDIGO","DESCRIÇÃO","UNIDADE","COEFIC.","CUSTO UNITÁRIO",null,"CUSTO  TOTAL (A) + (B) + (C) + (D) + (E)"]
[null,null,null,null,null,null,"DESONERADO","NÃO DESONER.","DESONERADO","NÃO DESONER."]
[null,"COMPOSIÇÃO","COMP 236_SEE","PLACA DE SINALIZAÇÃO EM PVC COD 06 - (300X300) PERIGO INFLAMÁVEL","UN ",null,null,null,25.319999999999997,25.439999999999998]
[null,"AGETOP_I",5,"SERVENTE","h     ",0.09,8.75,10.14,0.79,0.91]
[null,"MÃO DE OBRA (B) - TOTAL",null,null,null,null,null,null,0.79,0.91]
[null,"AGETOP_I",3070,"BUCHA DE NYLON S-6","un",2,0.04,0.04,0.08,0.08]
[null,"AGETOP_I",3393,"PARAFUSO P/BUCHA S-6","un",2,0.08,0.08,0.16,0.16]
[null,"SINAPI_I",37556,"PLACA DE SINALIZACAO DE SEGURANCA CONTRA INCENDIO, FOTOLUMINESCENTE, QUADRADA, *20 X 20* CM, EM PVC *2* MM ANTI-CHAMAS (SIMBOLOS, CORES E PICTOGRAMAS CONFORME NBR 13434)","UN    ",1,24.29,24.29,24.29,24.29]
[null,"MATERIAL (C) - TOTAL",null,null,null,null,null,null,24.529999999999998,24.529999999999998]
[]
[411,"FONTE","CÓDIGO","DESCRIÇÃO","UNIDADE","COEFIC.","CUSTO UNITÁRIO",null,"CUSTO  TOTAL (A) + (B) + (C) + (D) + (E)"]
[null,null,null,null,null,null,"DESONERADO","NÃO DESONER.","DESONERADO","NÃO DESONER."]
[null,"COMPOSIÇÃO","COMP 411_SEE","PLACA DE SINALIZAÇÃO EM PVC COD 13 - (316X158) SAÍDA DE EMERGÊNCIA","UN ",null,null,null,30.819999999999997,30.939999999999998]
[null,"AGETOP_I",5,"SERVENTE","h     ",0.09,8.75,10.14,0.79,0.91]
[null,"MÃO DE OBRA (B) - TOTAL",null,null,null,null,null,null,0.79,0.91]
[null,"AGETOP_I",3070,"BUCHA DE NYLON S-6","un",2,0.04,0.04,0.08,0.08]
[null,"AGETOP_I",3393,"PARAFUSO P/BUCHA S-6","un",2,0.08,0.08,0.16,0.16]
[null,"SINAPI_I",37559,"PLACA DE SINALIZACAO DE SEGURANCA CONTRA INCENDIO, FOTOLUMINESCENTE, RETANGULAR, *12 X 40* CM, EM PVC *2* MM ANTI-CHAMAS (SIMBOLOS, CORES E PICTOGRAMAS CONFORME NBR 13434)","UN    ",1,29.79,29.79,29.79,29.79]
[null,"MATERIAL (C) - TOTAL",null,null,null,null,null,null,30.029999999999998,30.029999999999998]
[]
[412,"FONTE","CÓDIGO","DESCRIÇÃO","UNIDADE","COEFIC.","CUSTO UNITÁRIO",null,"CUSTO  TOTAL (A) + (B) + (C) + (D) + (E)"]
[null,null,null,null,null,null,"DESONERADO","NÃO DESONER.","DESONERADO","NÃO DESONER."]
[null,"COMPOSIÇÃO","COMP 412_SEE","PLACA DE SINALIZAÇÃO EM PVC COD 17 - (316X158) MENSAGEM \"SAÍDA\"","UN ",null,null,null,30.819999999999997,30.939999999999998]
[null,"AGETOP_I",5,"SERVENTE","h     ",0.09,8.75,10.14,0.79,0.91]
[null,"MÃO DE OBRA (B) - TOTAL",null,null,null,null,null,null,0.79,0.91]
[null,"AGETOP_I",3070,"BUCHA DE NYLON S-6","un",2,0.04,0.04,0.08,0.08]
[null,"AGETOP_I",3393,"PARAFUSO P/BUCHA S-6","un",2,0.08,0.08,0.16,0.16]
[null,"SINAPI_I",37559,"PLACA DE SINALIZACAO DE SEGURANCA CONTRA INCENDIO, FOTOLUMINESCENTE, RETANGULAR, *12 X 40* CM, EM PVC *2* MM ANTI-CHAMAS (SIMBOLOS, CORES E PICTOGRAMAS CONFORME NBR 13434)","UN    ",1,29.79,29.79,29.79,29.79]
[null,"MATERIAL (C) - TOTAL",null,null,null,null,null,null,30.029999999999998,30.029999999999998]
[]
[382,"FONTE","CÓDIGO","DESCRIÇÃO","UNIDADE","COEFIC.","CUSTO UNITÁRIO",null,"CUSTO  TOTAL (A) + (B) + (C) + (D) + (E)"]
[null,null,null,null,null,null,"DESONERADO","NÃO DESONER.","DESONERADO","NÃO DESONER."]
[null,"COMPOSIÇÃO","COMP 382_SEE","TE DE REDUCAO DE FERRO GALVANIZADO, COM ROSCA BSP, DE 3/4\" X 1/2\"","UN ",null,null,null,14.08,14.91]
[null,"AGETOP_I",8,"AJUDANTE","h     ",0.6,8.75,10.14,5.25,6.08]
[null,"AGETOP_I",11,"MATERIAL ELÉTRICO",0,0.61050000000000004,0,0,0,0]
[null,"MÃO DE OBRA (B) - TOTAL",null,null,null,null,null,null,5.25,6.08]
[null,"SINAPI_I",3146,"FITA VEDA ROSCA EM ROLOS DE 18 MM X 10 M (L X C)","UN    ",0.12075471698113208,3.93,3.93,0.47,0.47]
[null,"SINAPI_I",6302,"TE DE REDUCAO DE FERRO GALVANIZADO, COM ROSCA BSP, DE 3/4\" X 1/2\"","UN    ",1,8.36,8.36,8.36,8.36]
[null,"MATERIAL (C) - TOTAL",null,null,null,null,null,null,8.83,8.83]
[]
[383,"FONTE","CÓDIGO","DESCRIÇÃO","UNIDADE","COEFIC.","CUSTO UNITÁRIO",null,"CUSTO  TOTAL (A) + (B) + (C) + (D) + (E)"]
[null,null,null,null,null,null,"DESONERADO","NÃO DESONER.","DESONERADO","NÃO DESONER."]
[null,"COMPOSIÇÃO","COMP 383_SEE","BUCHA DE REDUCAO DE FERRO GALVANIZADO, COM ROSCA BSP, DE 1/2\" X 1/4\"","UN ",null,null,null,4.4800000000000004,4.7]
[null,"AGETOP_I",8,"AJUDANTE","h     ",0.16,8.75,10.14,1.4,1.62]
[null,"AGETOP_I",11,"MATERIAL ELÉTRICO",0,0.16,0,0,0,0]
[null,"MÃO DE OBRA (B) - TOTAL",null,null,null,null,null,null,1.4,1.62]
[null,"AGETOP_I","H689","","",1.2,0,0,0,0]
[null,"SINAPI_I",770,"BUCHA DE REDUCAO DE FERRO GALVANIZADO, COM ROSCA BSP, DE 1/2\" X 1/4\"","UN    ",1,3.08,3.08,3.08,3.08]
[null,"MATERIAL (C) - TOTAL",null,null,null,null,null,null,3.08,3.08]
[]
[212,"FONTE","CÓDIGO","DESCRIÇÃO","UNIDADE","COEFIC.","CUSTO UNITÁRIO",null,"CUSTO  TOTAL (A) + (B) + (C) + (D) + (E)"]
[null,null,null,null,null,null,"DESONERADO","NÃO DESONER.","DESONERADO","NÃO DESONER."]
[null,"COMPOSIÇÃO","COMP 212_SEE","NIPLE DE REDUÇÃO 1/2\" X 1/4\" BSP","UN ",null,null,null,7.4499999999999993,7.67]
[null,"AGETOP_I",8,"AJUDANTE","h     ",0.16,8.75,10.14,1.4,1.62]
[null,"AGETOP_I",11,"MATERIAL ELÉTRICO",0,0.16,0,0,0,0]
[null,"MÃO DE OBRA (B) - TOTAL",null,null,null,null,null,null,1.4,1.62]
[null,"COTAÇÃO","COT 103_SEE","NIPLE DE REDUÇÃO 1/2\" X 1/4\" BSP","UN",1,6.0533333333333337,6.0533333333333337,6.05,6.05]
[null,"MATERIAL (C) - TOTAL",null,null,null,null,null,null,6.05,6.05]
[]
[213,"FONTE","CÓDIGO","DESCRIÇÃO","UNIDADE","COEFIC.","CUSTO UNITÁRIO",null,"CUSTO  TOTAL (A) + (B) + (C) + (D) + (E)"]
[null,null,null,null,null,null,"DESONERADO","NÃO DESONER.","DESONERADO","NÃO DESONER."]
[null,"COMPOSIÇÃO","COMP 213_SEE","NIPLE DE REDUÇÃO 3/4\" X 1/2\" BSP","UN ",null,null,null,11.110000000000001,11.330000000000002]
[null,"AGETOP_I",8,"AJUDANTE","h     ",0.16,8.75,10.14,1.4,1.62]
[null,"AGETOP_I",11,"MATERIAL ELÉTRICO",0,0.16,0,0,0,0]
[null,"MÃO DE OBRA (B) - TOTAL",null,null,null,null,null,null,1.4,1.62]
[null,"COTAÇÃO","COT 104_SEE","NIPLE DE REDUÇÃO 3/4\" X 1/2\" BSP","UN",1,9.7099999999999991,9.7099999999999991,9.7100000000000009,9.7100000000000009]
[null,"MATERIAL (C) - TOTAL",null,null,null,null,null,null,9.7100000000000009,9.7100000000000009]
[]
[237,"FONTE","CÓDIGO","DESCRIÇÃO","UNIDADE","COEFIC.","CUSTO UNITÁRIO",null,"CUSTO  TOTAL (A) + (B) + (C) + (D) + (E)"]
[null,null,null,null,null,null,"DESONERADO","NÃO DESONER.","DESONERADO","NÃO DESONER."]
[null,"COMPOSIÇÃO","COMP 237_SEE","FITA ANTICORROSIVA","M",null,null,null,9.4,9.68]
[null,"AGETOP_I",8,"AJUDANTE","h     ",0.2,8.75,10.14,1.75,2.0299999999999998]
[null,"AGETOP_I",12,"MATERIAL HIDRO-SANITÁRIO",0,0.2,0,0,0,0]
[null,"MÃO DE OBRA (B) - TOTAL",null,null,null,null,null,null,1.75,2.0299999999999998]
[null,"SINAPI_I",39634,"FITA ADESIVA ANTICORROSIVA DE PVC FLEXIVEL, COR PRETA, PARA PROTECAO TUBULACAO, 50 MM X 30 M (L X C), E= *0,25* MM","M     ",1,7.65,7.65,7.65,7.65]
[null,"MATERIAL (C) - TOTAL",null,null,null,null,null,null,7.65,7.65]
[]
[542,"FONTE","CÓDIGO","DESCRIÇÃO","UNIDADE","COEFIC.","CUSTO UNITÁRIO",null,"CUSTO  TOTAL (A) + (B) + (C) + (D) + (E)"]
[null,null,null,null,null,null,"DESONERADO","NÃO DESONER.","DESONERADO","NÃO DESONER."]
[null,"COMPOSIÇÃO","COMP 542_SEE","VÁLVULA UGV 3/4\" (S) LATÃO","UN ",null,null,null,19.62,20.22]
[null,"AGETOP_I",8,"AJUDANTE","h     ",0.432,8.75,10.14,3.78,4.38]
[null,"AGETOP_I",11,"MATERIAL ELÉTRICO",0,0.432,0,0,0,0]
[null,"MÃO DE OBRA (B) - TOTAL",null,null,null,null,null,null,3.78,4.38]
[null,"COTAÇÃO","COT 281_SEE","VÁLVULA UGV 3/4\" (S) LATÃO","UN ",1,15.836666666666666,15.836666666666666,15.84,15.84]
[null,"MATERIAL (C) - TOTAL",null,null,null,null,null,null,15.84,15.84]
[]
[543,"FONTE","CÓDIGO","DESCRIÇÃO","UNIDADE","COEFIC.","CUSTO UNITÁRIO",null,"CUSTO  TOTAL (A) + (B) + (C) + (D) + (E)"]
[null,null,null,null,null,null,"DESONERADO","NÃO DESONER.","DESONERADO","NÃO DESONER."]
[null,"COMPOSIÇÃO","COMP 543_SEE","VÁLVULA UGV 1/2\" (S) LATÃO","UN ",null,null,null,18.95,19.55]
[null,"AGETOP_I",8,"AJUDANTE","h     ",0.432,8.75,10.14,3.78,4.38]
[null,"AGETOP_I",11,"MATERIAL ELÉTRICO",0,0.432,0,0,0,0]
[null,"MÃO DE OBRA (B) - TOTAL",null,null,null,null,null,null,3.78,4.38]
[null,"COTAÇÃO","COT 282_SEE","VÁLVULA UGV 1/2\" (S) LATÃO","UN ",1,15.166666666666666,15.166666666666666,15.17,15.17]
[null,"MATERIAL (C) - TOTAL",null,null,null,null,null,null,15.17,15.17]
[]
[211,"FONTE","CÓDIGO","DESCRIÇÃO","UNIDADE","COEFIC.","CUSTO UNITÁRIO",null,"CUSTO  TOTAL (A) + (B) + (C) + (D) + (E)"]
[null,null,null,null,null,null,"DESONERADO","NÃO DESONER.","DESONERADO","NÃO DESONER."]
[null,"COMPOSIÇÃO","COMP 211_SEE","REGULADOR DE 2º ESTÁGIO 5KG/H","UN ",null,null,null,69.89,71.489999999999995]
[null,"AGETOP_I",8,"AJUDANTE","h     ",1.1499999999999999,8.75,10.14,10.06,11.66]
[null,"AGETOP_I",11,"MATERIAL ELÉTRICO",0,1.1499999999999999,0,0,0,0]
[null,"MÃO DE OBRA (B) - TOTAL",null,null,null,null,null,null,10.06,11.66]
[null,"COTAÇÃO","COT 102_SEE","REGULADOR DE 2º ESTÁGIO 5KG/H","UN",1,59.833333333333336,59.833333333333336,59.83,59.83]
[null,"AGETOP_I","H689","","",2.82,0,0,0,0]
[null,"MATERIAL (C) - TOTAL",null,null,null,null,null,null,59.83,59.83]
[]
[210,"FONTE","CÓDIGO","DESCRIÇÃO","UNIDADE","COEFIC.","CUSTO UNITÁRIO",null,"CUSTO  TOTAL (A) + (B) + (C) + (D) + (E)"]
[null,null,null,null,null,null,"DESONERADO","NÃO DESONER.","DESONERADO","NÃO DESONER."]
[null,"COMPOSIÇÃO","COMP 210_SEE","REGULADOR DE 1º ESTÁGIO 60KG/H MODELO AP-40  COM MANÔMETRO","UN ",null,null,null,215.64000000000001,217.24]
[null,"AGETOP_I",8,"AJUDANTE","h     ",1.1499999999999999,8.75,10.14,10.06,11.66]
[null,"AGETOP_I",11,"MATERIAL ELÉTRICO",0,1.1499999999999999,0,0,0,0]
[null,"MÃO DE OBRA (B) - TOTAL",null,null,null,null,null,null,10.06,11.66]
[null,"COTAÇÃO","COT 101_SEE","REGULADOR DE 1º ESTÁGIO 60KG/H MODELO AP-40  COM MANÔMETRO","UN",1,205.57666666666668,205.57666666666668,205.58,205.58]
[null,"AGETOP_I","H689","","",2.82,0,0,0,0]
[null,"MATERIAL (C) - TOTAL",null,null,null,null,null,null,205.58,205.58]
[]
[235,"FONTE","CÓDIGO","DESCRIÇÃO","UNIDADE","COEFIC.","CUSTO UNITÁRIO",null,"CUSTO  TOTAL (A) + (B) + (C) + (D) + (E)"]
[null,null,null,null,null,null,"DESONERADO","NÃO DESONER.","DESONERADO","NÃO DESONER."]
[null,"COMPOSIÇÃO","COMP 235_SEE","PLACA DE SINALIZAÇÃO EM PVC COD 01 - (300X300) PROIBIDO FUMAR","UN ",null,null,null,25.319999999999997,25.439999999999998]
[null,"AGETOP_I",5,"SERVENTE","h     ",0.09,8.75,10.14,0.79,0.91]
[null,"MÃO DE OBRA (B) - TOTAL",null,null,null,null,null,null,0.79,0.91]
[null,"AGETOP_I",3070,"BUCHA DE NYLON S-6","un",2,0.04,0.04,0.08,0.08]
[null,"AGETOP_I",3393,"PARAFUSO P/BUCHA S-6","un",2,0.08,0.08,0.16,0.16]
[null,"SINAPI_I",37556,"PLACA DE SINALIZACAO DE SEGURANCA CONTRA INCENDIO, FOTOLUMINESCENTE, QUADRADA, *20 X 20* CM, EM PVC *2* MM ANTI-CHAMAS (SIMBOLOS, CORES E PICTOGRAMAS CONFORME NBR 13434)","UN    ",1,24.29,24.29,24.29,24.29]
[null,"MATERIAL (C) - TOTAL",null,null,null,null,null,null,24.529999999999998,24.529999999999998]
[]
[236,"FONTE","CÓDIGO","DESCRIÇÃO","UNIDADE","COEFIC.","CUSTO UNITÁRIO",null,"CUSTO  TOTAL (A) + (B) + (C) + (D) + (E)"]
[null,null,null,null,null,null,"DESONERADO","NÃO DESONER.","DESONERADO","NÃO DESONER."]
[null,"COMPOSIÇÃO","COMP 236_SEE","PLACA DE SINALIZAÇÃO EM PVC COD 06 - (300X300) PERIGO INFLAMÁVEL","UN ",null,null,null,25.319999999999997,25.439999999999998]
[null,"AGETOP_I",5,"SERVENTE","h     ",0.09,8.75,10.14,0.79,0.91]
[null,"MÃO DE OBRA (B) - TOTAL",null,null,null,null,null,null,0.79,0.91]
[null,"AGETOP_I",3070,"BUCHA DE NYLON S-6","un",2,0.04,0.04,0.08,0.08]
[null,"AGETOP_I",3393,"PARAFUSO P/BUCHA S-6","un",2,0.08,0.08,0.16,0.16]
[null,"SINAPI_I",37556,"PLACA DE SINALIZACAO DE SEGURANCA CONTRA INCENDIO, FOTOLUMINESCENTE, QUADRADA, *20 X 20* CM, EM PVC *2* MM ANTI-CHAMAS (SIMBOLOS, CORES E PICTOGRAMAS CONFORME NBR 13434)","UN    ",1,24.29,24.29,24.29,24.29]
[null,"MATERIAL (C) - TOTAL",null,null,null,null,null,null,24.529999999999998,24.529999999999998]
[]
[45,"FONTE","CÓDIGO","DESCRIÇÃO","UNIDADE","COEFIC.","CUSTO UNITÁRIO",null,"CUSTO  TOTAL (A) + (B) + (C) + (D) + (E)"]
[null,null,null,null,null,null,"DESONERADO","NÃO DESONER.","DESONERADO","NÃO DESONER."]
[null,"COMPOSIÇÃO","COMP 045_SEE","LAUDO DE ESTANQUEIDADE","UN ",null,null,null,936,1085.1199999999999]
[null,"AGETOP",250101,"ENGENHEIRO - (OBRAS CIVIS)","H     ",16,58.5,67.819999999999993,936,1085.1199999999999]
[null,"MÃO DE OBRA (B) - TOTAL",null,null,null,null,null,null,936,1085.1199999999999]
[null,"MATERIAL (C) - TOTAL",null,null,null,null,null,null,0,0]
[]
[86,"FONTE","CÓDIGO","DESCRIÇÃO","UNIDADE","COEFIC.","CUSTO UNITÁRIO",null,"CUSTO  TOTAL (A) + (B) + (C) + (D) + (E)"]
[null,null,null,null,null,null,"DESONERADO","NÃO DESONER.","DESONERADO","NÃO DESONER."]
[null,"COMPOSIÇÃO","COMP 086_SEE","ELEVADOR (PLATAFORMA VERTICAL) MODELO HERA OU EQUIVALENTE 02 PARADAS - CAPACIDADE 280KG (INSTALADO)","UN ",null,null,null,37873.33,37873.33]
[null,"MÃO DE OBRA (B) - TOTAL",null,null,null,null,null,null,0,0]
[null,"COTAÇÃO","COT 016_SEE","ELEVADOR (PLATAFORMA VERTICAL) MODELO HERA OU EQUIVALENTE 02 PARADAS - CAPACIDADE 280KG (INSTALADO)","UN ",1,37873.333333333336,37873.333333333336,37873.33,37873.33]
[null,"MATERIAL (C) - TOTAL",null,null,null,null,null,null,37873.33,37873.33]
[]
[387,"FONTE","CÓDIGO","DESCRIÇÃO","UNIDADE","COEFIC.","CUSTO UNITÁRIO",null,"CUSTO  TOTAL (A) + (B) + (C) + (D) + (E)"]
[null,null,null,null,null,null,"DESONERADO","NÃO DESONER.","DESONERADO","NÃO DESONER."]
[null,"COMPOSIÇÃO","COMP 387_SEE","LÂMPADA LED TUBULAR 18W ","UN ",null,null,null,22.09,22.11]
[null,"AGETOP_I",8,"AJUDANTE","h     ",1.4999999999999999E-2,8.75,10.14,0.13,0.15]
[null,"AGETOP_I",12,"MATERIAL HIDRO-SANITÁRIO",0,1.4999999999999999E-2,0,0,0,0]
[null,"MÃO DE OBRA (B) - TOTAL",null,null,null,null,null,null,0.13,0.15]
[null,"COTAÇÃO","COT 195_SEE","LÂMPADA LED TUBULAR 18W ","UN",1,21.959999999999997,21.959999999999997,21.96,21.96]
[null,"MATERIAL (C) - TOTAL",null,null,null,null,null,null,21.96,21.96]