{"text_format":"1","workbook":"xlsx","n_sheets":8,"sheets":["Orçamento","Resumo ","Somatório","Cronog_120_Dias","Composição BDI","Relatório CENTRAL","Parc Maior Relev","Composições"],"not_rendered":{"charts":0,"images":5,"macros":1,"external_links":1,"defined_names":150,"comments":2,"pivot_tables":0},"unopened":[],"bounds":{"document_bytes":16777216,"sheet_cells":100000,"rows_first":2000,"rows_last":500,"rows_between":2000,"halvings":0,"cell_chars":16384,"cell_head_chars":4096},"cells_cut":0,"cells_raw":0,"read":"whole","date_system":"1900"}

{"sheet":"Orçamento","index":0,"n_rows":818,"n_cols":24,"rows_kept":818,"cut":false,"hidden":false,"merged":[[753,16,753,22],[8,12,9,12],[788,18,788,20],[788,21,788,22],[0,14,0,22],[8,14,8,16],[9,14,9,16],[11,14,11,16],[12,14,12,16],[14,14,14,22],[1,14,1,22],[4,14,4,22],[7,14,7,22],[772,18,772,20],[772,21,772,22],[780,21,780,22],[769,15,769,17],[770,15,770,17],[771,15,771,17],[773,21,773,22],[781,18,781,20],[781,21,781,22],[779,18,779,20],[779,21,779,22],[787,18,787,20],[787,21,787,22],[774,18,774,20],[774,21,774,22],[767,18,767,20],[767,21,767,22],[789,18,789,20],[789,21,789,22],[743,20,743,21],[765,18,765,20],[765,21,765,22],[766,18,766,20],[766,21,766,22],[764,18,764,20],[764,21,764,22],[773,18,773,20],[744,20,744,21],[755,18,755,22],[761,18,761,20],[761,21,761,22],[762,18,762,20],[762,21,762,22],[763,18,763,20],[763,21,763,22],[786,18,786,20],[786,21,786,22],[783,21,783,22],[784,18,784,20],[784,21,784,22],[785,18,785,20],[785,21,785,22],[775,18,775,20],[775,21,775,22],[782,18,782,20],[782,21,782,22],[777,21,777,22],[778,18,778,20],[778,21,778,22],[780,18,780,20],[776,18,776,20],[776,21,776,22],[777,18,777,20],[781,15,781,17],[782,15,782,17],[783,15,783,17],[784,15,784,17],[785,15,785,17],[758,14,758,23],[747,20,747,21],[746,20,746,21],[742,17,747,17],[742,20,742,21],[759,18,759,20],[759,21,759,22],[760,18,760,20],[760,21,760,22],[748,20,748,21],[768,18,768,20],[768,21,768,22],[769,18,769,20],[769,21,769,22],[770,18,770,20],[770,21,770,22],[771,18,771,20],[771,21,771,22],[783,18,783,20],[760,15,760,17],[761,15,761,17],[762,15,762,17],[763,15,763,17],[764,15,764,17],[765,15,765,17],[766,15,766,17],[767,15,767,17],[768,15,768,17],[772,15,772,17],[773,15,773,17],[774,15,774,17],[775,15,775,17],[776,15,776,17],[777,15,777,17],[778,15,778,17],[779,15,779,17],[780,15,780,17],[750,16,750,22],[751,16,751,22],[752,16,752,22],[3,21,3,22],[2,21,2,22],[5,21,5,22],[10,14,10,23],[13,14,13,23],[6,21,6,22],[2,14,2,20],[3,14,3,20],[5,18,5,20],[6,18,6,20],[6,14,6,17],[5,14,5,17],[12,21,12,22],[12,18,12,20],[8,18,8,20],[8,21,8,22],[792,14,792,23],[793,18,793,20],[793,21,793,22],[794,15,794,17],[794,18,794,20],[794,21,794,22],[795,15,795,17],[795,18,795,20],[795,21,795,22],[817,18,817,20],[817,21,817,22],[814,14,814,17],[811,15,811,17],[811,18,811,20],[811,21,811,22],[812,15,812,17],[812,18,812,20],[812,21,812,22],[813,15,813,17],[813,18,813,20],[813,21,813,22],[816,18,816,20],[816,21,816,22],[815,18,815,20],[815,21,815,22],[786,14,786,17],[793,15,793,17],[759,15,759,17],[814,18,814,20],[814,21,814,22],[802,15,802,17],[802,18,802,20],[802,21,802,22],[803,15,803,17],[803,18,803,20],[803,21,803,22],[804,15,804,17],[804,18,804,20],[804,21,804,22],[808,15,808,17],[808,18,808,20],[808,21,808,22],[809,15,809,17],[809,18,809,20],[809,21,809,22],[810,15,810,17],[799,15,799,17],[754,16,754,22],[810,18,810,20],[810,21,810,22],[805,15,805,17],[805,18,805,20],[805,21,805,22],[806,15,806,17],[806,18,806,20],[806,21,806,22],[807,15,807,17],[807,18,807,20],[807,21,807,22],[799,18,799,20],[799,21,799,22],[800,15,800,17],[800,18,800,20],[800,21,800,22],[801,15,801,17],[801,18,801,20],[801,21,801,22],[796,15,796,17],[796,18,796,20],[796,21,796,22],[797,15,797,17],[797,18,797,20],[797,21,797,22],[798,15,798,17],[798,18,798,20],[798,21,798,22]]}
[]
[]
[null,null,null,null,null,null,null,null,null,null,null,null,null,null,"UNIDADE ESCOLAR",null,null,null,null,null,null,"CÓDIGO INEP"]
[null,null,null,null,null,null,null,null,null,null,null,null,null,null,"CENTRO DE ENSINO EM PERÍODO INTEGRAL PROFESSOR JOAQUIM CARVALHO FERREIRA",null,null,null,null,null,null,52033589]
[]
["Nmax",null,null,null,null,null,null,null,null,null,null,null,"Ajustar altura?",null,"OBRA",null,null,null,"DATA",null,null,"CIDADE"]
[{"$f":"MAX($C$18:$C$742)","v":4},null,null,null,null,null,null,null,null,null,null,null,"SIM",null,"REFORMA E AMPLIAÇÃO",null,null,null,"2020-03-25",null,null,"GOIÂNIA"]
[]
[null,null,null,null,null,null,null,null,null,null,null,null,"",null,"CRE",null,null,"ENDEREÇO","REFERÊNCIA AGETOP",null,null,"REFERÊNCIA SINAPI"]
[null,null,null,null,null,null,null,null,null,null,null,null,null,null,"GOIÂNIA",null,null,"AV FERNÃO DIAS PAES LEME S/Nº 32, CAPUAVA, CEP:74450-200","ABR/19","DESONERADA",null,"OUT/19","DESONERADA"]
[]
[null,null,null,null,null,null,null,null,null,null,null,null,null,null,"ÁREA EXISTENTE (M²)",null,null,"ÁREA A CONSTRUIR (M²)","ÁREA A DEMOLIR (M²)",null,null,"ÁREA TOTAL CONSTRUÍDA (M²)"]
[null,null,null,null,null,null,null,null,null,null,null,null,null,null,2809.72,null,null,159.91,0,null,null,2969.6299999999997]
[]
[null,null,null,null,null,null,null,null,null,null,null,"FILTRO",null,null,"PLANILHA ORÇAMENTÁRIA"]
["Nível E","Save Nivel","Nível C","Altura","n1","n2","n3","n4","n5","Czero","Cnível","↓","Nível","Nível Corrigido","ITEM","TABELA","CODIGO","DESCRIÇÃO DOS SERVIÇOS","UNID","QUANT","MAT","MO","T.SERVIÇO","OBSERVAÇÕES¹"]
[{"$f":"CHOOSE(1+LOG(1+2*(ORÇAMENTO.Nivel=\"Nível 1\")+4*(ORÇAMENTO.Nivel=\"Nível 2\")+8*(ORÇAMENTO.Nivel=\"Nível 3\")+16*(ORÇAMENTO.Nivel=\"Nível 4\")+32*(ORÇAMENTO.Nivel=\"Serviço\"),2),0,1,2,3,4,\"S\")","v":"S"},{"$f":"IF(OR(C17=\"s\",C17=0),OFFSET(B17,-1,0),C17)","v":"Save Nivel"},{"$f":"IF(OFFSET(C17,-1,0)=\"L\",1,IF(OFFSET(C17,-1,0)=1,2,IF(OR(A17=\"s\",A17=0),\"S\",IF(AND(OFFSET(C17,-1,0)=2,A17=4),3,IF(AND(OR(OFFSET(C17,-1,0)=\"s\",OFFSET(C17,-1,0)=0),A17<>\"s\",A17>OFFSET(B17,-1,0)),OFFSET(B17,-1,0),A17)))))","v":"S"},{"$f":"IF(OR(C17=\"S\",C17=0),0,IF(ISERROR(K17),J17,SMALL(J17:K17,1)))","v":0},{"$f":"IF($C17=1,OFFSET(E17,-1,0)+1,OFFSET(E17,-1,0))","v":"n1"},{"$f":"IF($C17=1,0,IF($C17=2,OFFSET(F17,-1,0)+1,OFFSET(F17,-1,0)))","v":"n2"},{"$f":"IF(AND($C17<=2,$C17<>0),0,IF($C17=3,OFFSET(G17,-1,0)+1,OFFSET(G17,-1,0)))","v":"n3"},{"$f":"IF(AND($C17<=3,$C17<>0),0,IF($C17=4,OFFSET(H17,-1,0)+1,OFFSET(H17,-1,0)))","v":"n4"},{"$f":"IF(AND($C17<=4,$C17<>0),0,IF(AND($C17=\"S\",$W17>0),OFFSET(I17,-1,0)+1,OFFSET(I17,-1,0)))","v":"n5"},{"$f":"IF(OR($C17=\"S\",$C17=0),0,MATCH(0,OFFSET($D17,1,$C17,ROW($C$742)-ROW($C17)),0))","v":0},{"$f":"IF(OR($C17=\"S\",$C17=0),0,MATCH(OFFSET($D17,0,$C17)+1,OFFSET($D17,1,$C17,ROW($C$742)-ROW($C17)),0))","v":0},"","Serviço","Serviço","-","SINAPI",null,"(sem código)","-",null,0,0,0,""]
[0,null,"L",{"$f":"COUNTA(OFFSET(D18,1,0):D$742)","v":723},{"$f":"LEFT(O19,1)-1","v":0},null,null,null,null,null,null,"F","LOTE","LOTE","REFORMA E AMPLIAÇÃO - CENTRO DE ENSINO EM PERÍODO INTEGRAL PROFESSOR JOAQUIM CARVALHO FERREIRA",null,null,null,null,null,null,null,718005.83000000007]
[{"$f":"CHOOSE(1+LOG(1+2*(ORÇAMENTO.Nivel=\"Nível 1\")+4*(ORÇAMENTO.Nivel=\"Nível 2\")+8*(ORÇAMENTO.Nivel=\"Nível 3\")+16*(ORÇAMENTO.Nivel=\"Nível 4\")+32*(ORÇAMENTO.Nivel=\"Serviço\"),2),0,1,2,3,4,\"S\")","v":1},{"$f":"IF(OR(C19=\"s\",C19=0),OFFSET(B19,-1,0),C19)","v":1},{"$f":"IF(OFFSET(C19,-1,0)=\"L\",1,IF(OFFSET(C19,-1,0)=1,2,IF(OR(A19=\"s\",A19=0),\"S\",IF(AND(OFFSET(C19,-1,0)=2,A19=4),3,IF(AND(OR(OFFSET(C19,-1,0)=\"s\",OFFSET(C19,-1,0)=0),A19<>\"s\",A19>OFFSET(B19,-1,0)),OFFSET(B19,-1,0),A19)))))","v":1},{"$f":"IF(OR(C19=\"S\",C19=0),0,IF(ISERROR(K19),J19,SMALL(J19:K19,1)))","v":488},{"$f":"IF($C19=1,OFFSET(E19,-1,0)+1,OFFSET(E19,-1,0))","v":1},{"$f":"IF($C19=1,0,IF($C19=2,OFFSET(F19,-1,0)+1,OFFSET(F19,-1,0)))","v":0},{"$f":"IF(AND($C19<=2,$C19<>0),0,IF($C19=3,OFFSET(G19,-1,0)+1,OFFSET(G19,-1,0)))","v":0},{"$f":"IF(AND($C19<=3,$C19<>0),0,IF($C19=4,OFFSET(H19,-1,0)+1,OFFSET(H19,-1,0)))","v":0},{"$f":"IF(AND($C19<=4,$C19<>0),0,IF(AND($C19=\"S\",$W19>0),OFFSET(I19,-1,0)+1,OFFSET(I19,-1,0)))","v":0},{"$f":"IF(OR($C19=\"S\",$C19=0),0,MATCH(0,OFFSET($D19,1,$C19,ROW($C$742)-ROW($C19)),0))","v":723},{"$f":"IF(OR($C19=\"S\",$C19=0),0,MATCH(OFFSET($D19,0,$C19)+1,OFFSET($D19,1,$C19,ROW($C$742)-ROW($C19)),0))","v":488},"F","Nível 1","Nível 1","1.","AGETOP",null,"REFORMA"]
[{"$f":"CHOOSE(1+LOG(1+2*(ORÇAMENTO.Nivel=\"Nível 1\")+4*(ORÇAMENTO.Nivel=\"Nível 2\")+8*(ORÇAMENTO.Nivel=\"Nível 3\")+16*(ORÇAMENTO.Nivel=\"Nível 4\")+32*(ORÇAMENTO.Nivel=\"Serviço\"),2),0,1,2,3,4,\"S\")","v":2},{"$f":"IF(OR(C20=\"s\",C20=0),OFFSET(B20,-1,0),C20)","v":2},{"$f":"IF(OFFSET(C20,-1,0)=\"L\",1,IF(OFFSET(C20,-1,0)=1,2,IF(OR(A20=\"s\",A20=0),\"S\",IF(AND(OFFSET(C20,-1,0)=2,A20=4),3,IF(AND(OR(OFFSET(C20,-1,0)=\"s\",OFFSET(C20,-1,0)=0),A20<>\"s\",A20>OFFSET(B20,-1,0)),OFFSET(B20,-1,0),A20)))))","v":2},{"$f":"IF(OR(C20=\"S\",C20=0),0,IF(ISERROR(K20),J20,SMALL(J20:K20,1)))","v":41},{"$f":"IF($C20=1,OFFSET(E20,-1,0)+1,OFFSET(E20,-1,0))","v":1},{"$f":"IF($C20=1,0,IF($C20=2,OFFSET(F20,-1,0)+1,OFFSET(F20,-1,0)))","v":1},{"$f":"IF(AND($C20<=2,$C20<>0),0,IF($C20=3,OFFSET(G20,-1,0)+1,OFFSET(G20,-1,0)))","v":0},{"$f":"IF(AND($C20<=3,$C20<>0),0,IF($C20=4,OFFSET(H20,-1,0)+1,OFFSET(H20,-1,0)))","v":0},{"$f":"IF(AND($C20<=4,$C20<>0),0,IF(AND($C20=\"S\",$W20>0),OFFSET(I20,-1,0)+1,OFFSET(I20,-1,0)))","v":0},487,41,"F","Nível 2","Nível 2","1.1.","AGETOP",null,"SERVIÇOS PRELIMINARES"]
[{"$f":"CHOOSE(1+LOG(1+2*(ORÇAMENTO.Nivel=\"Nível 1\")+4*(ORÇAMENTO.Nivel=\"Nível 2\")+8*(ORÇAMENTO.Nivel=\"Nível 3\")+16*(ORÇAMENTO.Nivel=\"Nível 4\")+32*(ORÇAMENTO.Nivel=\"Serviço\"),2),0,1,2,3,4,\"S\")","v":3},{"$f":"IF(OR(C21=\"s\",C21=0),OFFSET(B21,-1,0),C21)","v":3},{"$f":"IF(OFFSET(C21,-1,0)=\"L\",1,IF(OFFSET(C21,-1,0)=1,2,IF(OR(A21=\"s\",A21=0),\"S\",IF(AND(OFFSET(C21,-1,0)=2,A21=4),3,IF(AND(OR(OFFSET(C21,-1,0)=\"s\",OFFSET(C21,-1,0)=0),A21<>\"s\",A21>OFFSET(B21,-1,0)),OFFSET(B21,-1,0),A21)))))","v":3},{"$f":"IF(OR(C21=\"S\",C21=0),0,IF(ISERROR(K21),J21,SMALL(J21:K21,1)))","v":17},{"$f":"IF($C21=1,OFFSET(E21,-1,0)+1,OFFSET(E21,-1,0))","v":1},{"$f":"IF($C21=1,0,IF($C21=2,OFFSET(F21,-1,0)+1,OFFSET(F21,-1,0)))","v":1},{"$f":"IF(AND($C21<=2,$C21<>0),0,IF($C21=3,OFFSET(G21,-1,0)+1,OFFSET(G21,-1,0)))","v":1},{"$f":"IF(AND($C21<=3,$C21<>0),0,IF($C21=4,OFFSET(H21,-1,0)+1,OFFSET(H21,-1,0)))","v":0},{"$f":"IF(AND($C21<=4,$C21<>0),0,IF(AND($C21=\"S\",$W21>0),OFFSET(I21,-1,0)+1,OFFSET(I21,-1,0)))","v":0},40,17,"F","Nível 3","Nível 3","1.1.1.","SINAPI",null,"GERAL","-",null,0,0,null,""]
["S",3,"S",0,1,1,1,0,0,0,0,"F","Serviço","Serviço","1.1.1.0.1.","SINAPI",97640,"REMOÇÃO DE FORROS DE DRYWALL, PVC E FIBROMINERAL, DE FORMA MANUAL, SEM REAPROVEITAMENTO. AF_12/2017","M2",410,null,null,null,""]
["S",3,"S",0,1,1,1,0,0,0,0,"F","Serviço","Serviço","1.1.1.0.2.","SINAPI",97642,"REMOÇÃO DE TRAMA METÁLICA OU DE MADEIRA PARA FORRO, DE FORMA MANUAL, SEM REAPROVEITAMENTO. AF_12/2017","M2",205,null,null,null,""]
["S",3,"S",0,1,1,1,0,0,0,0,"F","Serviço","Serviço","1.1.1.0.3.","AGETOP",20101,"DEMOLICAO COBERTURA TELHA CERAMICA C/ TRANSP. ATÉ CB. E CARGA","m2    ",251,null,null,null,""]
["S",3,"S",0,1,1,1,0,0,0,0,"F","Serviço","Serviço","1.1.1.0.4.","SINAPI",100330,"RETIRADA E RECOLOCAÇÃO DE  TELHA CERÂMICA CAPA-CANAL, COM ATÉ DUAS ÁGUAS, INCLUSO IÇAMENTO. AF_07/2019","M2",251,null,null,null,""]
["S",3,"S",0,1,1,1,0,0,0,0,"F","Serviço","Serviço","1.1.1.0.5.","AGETOP",20103,"DEMOLIÇÃO ESTRUTURA EM MADEIRA TELHADO C/ TRANSP. ATÉ CB. E CARGA","m2    ",50,null,null,null,""]
["S",3,"S",0,1,1,1,0,0,0,0,"F","Serviço","Serviço","1.1.1.0.6.","AGETOP",20102,"DEMOLICAO-COBERTURA TELHA FIBROCIMENTO/FIBRA DE VIDRO/SIMILARES C/ TRANSP. ATÉ CB. E CARGA","m2    ",13,null,null,null,""]
["S",3,"S",0,1,1,1,0,0,0,0,"F","Serviço","Serviço","1.1.1.0.7.","AGETOP",20111,"DEM.PISO CERAM.SOBRE LASTRO CONC.C/TR.CB.E CARGA","m2    ",521.44000000000005,null,null,null,""]
["S",3,"S",0,1,1,1,0,0,0,0,"F","Serviço","Serviço","1.1.1.0.8.","AGETOP",20121,"DEM. MANUAL EM CONCR.SIMPLES C/TR.ATE CB.E CARGA (O.C.)","m3    ",0.13,null,null,null,""]
["S",3,"S",0,1,1,1,0,0,0,0,"F","Serviço","Serviço","1.1.1.0.9.","SINAPI",97633,"DEMOLIÇÃO DE REVESTIMENTO CERÂMICO, DE FORMA MANUAL, SEM REAPROVEITAMENTO. AF_12/2017","M2",24.6,null,null,null,"Referência: AGETOP - 20115"]
["S",3,"S",0,1,1,1,0,0,0,0,"F","Serviço","Serviço","1.1.1.0.10.","SINAPI",97622,"DEMOLIÇÃO DE ALVENARIA DE BLOCO FURADO, DE FORMA MANUAL, SEM REAPROVEITAMENTO. AF_12/2017","M3",0.1,null,null,null,"Referência: AGETOP - 20118"]
["S",3,"S",0,1,1,1,0,0,0,0,"F","Serviço","Serviço","1.1.1.0.11.","AGETOP",20137,"DEMOLIÇAO BACIA SANITARIA C/ TRANSP. ATÉ CB. E CARGA","Un    ",3,null,null,null,""]
["S",3,"S",0,1,1,1,0,0,0,0,"F","Serviço","Serviço","1.1.1.0.12.","AGETOP",20138,"DEMOLIÇAO DE LAVATÓRIO C/ TRANSP. ATÉ CB. E CARGA","Un    ",1,null,null,null,""]
["S",3,"S",0,1,1,1,0,0,0,0,"F","Serviço","Serviço","1.1.1.0.13.","AGETOP",20140,"DEMOLIÇAO DE VÁLVULA DE DESCARGA C/ TRANSP. ATÉ CB. E CARGA","Un    ",3,null,null,null,""]
["S",3,"S",0,1,1,1,0,0,0,0,"F","Serviço","Serviço","1.1.1.0.14.","AGETOP",20163,"DEMOLIÇÃO DAS INSTALAÇÕES HIDROSANITÁRIAS E AFINS C/ TRANSP. ATÉ CB. E CARGA","H     ",5.5,null,null,null,""]
["S",3,"S",0,1,1,1,0,0,0,0,"F","Serviço","Serviço","1.1.1.0.15.","AGETOP",72080,"POSTE/TRAFO - CAMINHÃO MUNCK 12 TON. (MÍNIMO 4H/DIA)","H     ",4,null,null,null,"Referência: AGETOP - 20202"]
["S",3,"S",0,1,1,1,0,0,0,0,"F","Serviço","Serviço","1.1.1.0.16.","SINAPI","74209/1","PLACA DE OBRA EM CHAPA DE ACO GALVANIZADO","M2",7.5,null,null,null,"Referência: AGETOP - 21301"]
[3,3,3,2,1,1,2,0,0,23,2,"F","Nível 3","Nível 3","1.1.2.","SINAPI",null,"PÁTIO MULTIUSO","-",null,null,null,null,""]
["S",3,"S",0,1,1,2,0,0,0,0,"F","Serviço","Serviço","1.1.2.0.1.","SINAPI",97622,"DEMOLIÇÃO DE ALVENARIA DE BLOCO FURADO, DE FORMA MANUAL, SEM REAPROVEITAMENTO. AF_12/2017","M3",2.0299999999999998,null,null,null,"Referência: AGETOP - 20118"]
[3,3,3,3,1,1,3,0,0,21,3,"F","Nível 3","Nível 3","1.1.3.","SINAPI",null,"CENTRAL DE GÁS","-",null,null,null,null,""]
["S",3,"S",0,1,1,3,0,0,0,0,"F","Serviço","Serviço","1.1.3.0.1.","SINAPI",97622,"DEMOLIÇÃO DE ALVENARIA DE BLOCO FURADO, DE FORMA MANUAL, SEM REAPROVEITAMENTO. AF_12/2017","M3",1,null,null,null,"Referência: AGETOP - 20118"]
["S",3,"S",0,1,1,3,0,0,0,0,"F","Serviço","Serviço","1.1.3.0.2.","SINAPI",97644,"REMOÇÃO DE PORTAS, DE FORMA MANUAL, SEM REAPROVEITAMENTO. AF_12/2017","M2",2.56,null,null,null,"Referência: AGETOP - 20106"]
[{"$f":"CHOOSE(1+LOG(1+2*(ORÇAMENTO.Nivel=\"Nível 1\")+4*(ORÇAMENTO.Nivel=\"Nível 2\")+8*(ORÇAMENTO.Nivel=\"Nível 3\")+16*(ORÇAMENTO.Nivel=\"Nível 4\")+32*(ORÇAMENTO.Nivel=\"Serviço\"),2),0,1,2,3,4,\"S\")","v":3},3,3,9,1,1,4,0,{"$f":"IF(AND($C43<=4,$C43<>0),0,IF(AND($C43=\"S\",$W43>0),OFFSET(I43,-1,0)+1,OFFSET(I43,-1,0)))","v":0},18,9,"F","Nível 3","Nível 3","1.1.4.","SINAPI",null,"COZINHA, DESPENSA, CANTINA, DEP. MERENDA E SALA DE ESTUDOS","-",null,null,null,null,""]
[{"$f":"CHOOSE(1+LOG(1+2*(ORÇAMENTO.Nivel=\"Nível 1\")+4*(ORÇAMENTO.Nivel=\"Nível 2\")+8*(ORÇAMENTO.Nivel=\"Nível 3\")+16*(ORÇAMENTO.Nivel=\"Nível 4\")+32*(ORÇAMENTO.Nivel=\"Serviço\"),2),0,1,2,3,4,\"S\")","v":"S"},3,"S",0,1,1,4,0,{"$f":"IF(AND($C44<=4,$C44<>0),0,IF(AND($C44=\"S\",$W44>0),OFFSET(I44,-1,0)+1,OFFSET(I44,-1,0)))","v":0},0,0,"F","Serviço","Serviço","1.1.4.0.1.","AGETOP",20111,"DEM.PISO CERAM.SOBRE LASTRO CONC.C/TR.CB.E CARGA","m2    ",70.900000000000006,null,null,null,""]
[{"$f":"CHOOSE(1+LOG(1+2*(ORÇAMENTO.Nivel=\"Nível 1\")+4*(ORÇAMENTO.Nivel=\"Nível 2\")+8*(ORÇAMENTO.Nivel=\"Nível 3\")+16*(ORÇAMENTO.Nivel=\"Nível 4\")+32*(ORÇAMENTO.Nivel=\"Serviço\"),2),0,1,2,3,4,\"S\")","v":"S"},3,"S",0,1,1,4,0,{"$f":"IF(AND($C45<=4,$C45<>0),0,IF(AND($C45=\"S\",$W45>0),OFFSET(I45,-1,0)+1,OFFSET(I45,-1,0)))","v":0},0,0,"F","Serviço","Serviço","1.1.4.0.2.","SINAPI",97633,"DEMOLIÇÃO DE REVESTIMENTO CERÂMICO, DE FORMA MANUAL, SEM REAPROVEITAMENTO. AF_12/2017","M2",194.19,null,null,null,"Referência: AGETOP - 20115"]
["S",3,"S",0,1,1,4,0,0,0,0,"F","Serviço","Serviço","1.1.4.0.3.","SINAPI",97622,"DEMOLIÇÃO DE ALVENARIA DE BLOCO FURADO, DE FORMA MANUAL, SEM REAPROVEITAMENTO. AF_12/2017","M3",2.52,null,null,null,"Referência: AGETOP - 20118"]
["S",3,"S",0,1,1,4,0,0,0,0,"F","Serviço","Serviço","1.1.4.0.4.","SINAPI",97644,"REMOÇÃO DE PORTAS, DE FORMA MANUAL, SEM REAPROVEITAMENTO. AF_12/2017","M2",1.68,null,null,null,"Referência: AGETOP - 20106"]
["S",3,"S",0,1,1,4,0,0,0,0,"F","Serviço","Serviço","1.1.4.0.5.","AGETOP",20139,"DEMOLIÇAO DE BANCADAS C/ TRANSP. ATÉ CB. E CARGA","m2    ",2.0299999999999998,null,null,null,""]
["S",3,"S",0,1,1,4,0,0,0,0,"F","Serviço","Serviço","1.1.4.0.6.","SINAPI",97640,"REMOÇÃO DE FORROS DE DRYWALL, PVC E FIBROMINERAL, DE FORMA MANUAL, SEM REAPROVEITAMENTO. AF_12/2017","M2",70.900000000000006,null,null,null,""]
["S",3,"S",0,1,1,4,0,0,0,0,"F","Serviço","Serviço","1.1.4.0.7.","SINAPI",97642,"REMOÇÃO DE TRAMA METÁLICA OU DE MADEIRA PARA FORRO, DE FORMA MANUAL, SEM REAPROVEITAMENTO. AF_12/2017","M2",35.450000000000003,null,null,null,""]
["S",3,"S",0,1,1,4,0,0,0,0,"F","Serviço","Serviço","1.1.4.0.8.","AGETOP",20163,"DEMOLIÇÃO DAS INSTALAÇÕES HIDROSANITÁRIAS E AFINS C/ TRANSP. ATÉ CB. E CARGA","H     ",1,null,null,null,""]
[3,3,3,2,1,1,5,0,0,9,2,"F","Nível 3","Nível 3","1.1.5.","SINAPI",null,"BLOCO 01 E 02","-",null,null,null,null,""]
["S",3,"S",0,1,1,5,0,0,0,0,"F","Serviço","Serviço","1.1.5.0.1.","AGETOP",20111,"DEM.PISO CERAM.SOBRE LASTRO CONC.C/TR.CB.E CARGA","m2    ",1335.08,null,null,null,""]
[3,3,3,5,1,1,6,0,0,7,5,"F","Nível 3","Nível 3","1.1.6.",null,null,"VESTIÁRIO MASCULINO","-",null,null,null,null,""]
["S",3,"S",0,1,1,6,0,0,0,0,"F","Serviço","Serviço","1.1.6.0.1.","SINAPI",97622,"DEMOLIÇÃO DE ALVENARIA DE BLOCO FURADO, DE FORMA MANUAL, SEM REAPROVEITAMENTO. AF_12/2017","M3",1.18,null,null,null,"Referência: AGETOP - 20118"]
["S",3,"S",0,1,1,6,0,0,0,0,"F","Serviço","Serviço","1.1.6.0.2.","SINAPI",97644,"REMOÇÃO DE PORTAS, DE FORMA MANUAL, SEM REAPROVEITAMENTO. AF_12/2017","M2",2.94,null,null,null,"Referência: AGETOP - 20106"]
["S",3,"S",0,1,1,6,0,0,0,0,"F","Serviço","Serviço","1.1.6.0.3.","AGETOP",20111,"DEM.PISO CERAM.SOBRE LASTRO CONC.C/TR.CB.E CARGA","m2    ",21.76,null,null,null,""]
["S",3,"S",0,1,1,6,0,0,0,0,"F","Serviço","Serviço","1.1.6.0.4.","AGETOP",20137,"DEMOLIÇAO BACIA SANITARIA C/ TRANSP. ATÉ CB. E CARGA","Un    ",1,null,null,null,""]
[3,3,3,2,1,1,7,0,0,2,{"$error":"#N/A"},"F","Nível 3","Nível 3","1.1.7.","SINAPI",null,"INST. ELÉTRICAS","-",null,null,null,null,""]
["S",3,"S",0,1,1,7,0,0,0,0,"F","Serviço","Serviço","1.1.7.0.1.","AGETOP",20162,"DEMOLIÇÃO DAS INSTALAÇÕES ELÉTRICAS E AFINS C/ TRANSP. ATÉ CB. E CARGA","H     ",40,null,null,null,""]
[2,2,2,3,1,2,0,0,0,446,3,"F","Nível 2","Nível 2","1.2.","AGETOP",null,"TRANSPORTES","-",null,null,null,null,""]
["S",2,"S",0,1,2,0,0,0,0,0,"F","Serviço","Serviço","1.2.0.0.1.","SINAPI",72900,"TRANSPORTE DE ENTULHO COM CAMINHAO BASCULANTE 6 M3, RODOVIA PAVIMENTADA, DMT 0,5 A 1,0 KM","M3",142.42250000000001,null,null,null,""]
["S",2,"S",0,1,2,0,0,0,0,0,"F","Serviço","Serviço","1.2.0.0.2.","SINAPI",72897,"CARGA MANUAL DE ENTULHO EM CAMINHAO BASCULANTE 6 M3","M3",142.42250000000001,null,null,null,""]
[2,2,2,28,1,3,0,0,0,443,28,"F","Nível 2","Nível 2","1.3.","AGETOP",null,"SERVIÇO EM TERRA","-",null,null,null,null,""]
[3,3,3,8,1,3,1,0,0,27,8,"F","Nível 3","Nível 3","1.3.1.",null,null,"AMPLIAÇÃO COZINHA COM REFEITÓRIO","-",null,null,null,null,""]
["S",3,"S",0,1,3,1,0,0,0,0,"F","Serviço","Serviço","1.3.1.0.1.","SINAPI","73859/2","CAPINA E LIMPEZA MANUAL DE TERRENO","M2",190.5,null,null,null,""]
["S",3,"S",0,1,3,1,0,0,0,0,"F","Serviço","Serviço","1.3.1.0.2.","AGETOP",41140,"REGULARIZAÇÃO DO TERRENO SEM APILOAMENTO COM TRANSPORTE MANUAL DA TERRA ESCAVADA ","m2    ",190.5,null,null,null,""]
["S",3,"S",0,1,3,1,0,0,0,0,"F","Serviço","Serviço","1.3.1.0.3.","SINAPI",79480,"ESCAVACAO MECANICA CAMPO ABERTO EM SOLO EXCETO ROCHA ATE 2,00M PROFUNDIDADE","M3",47.625,null,null,null,"Referência: AGETOP - 41004"]
["S",3,"S",0,1,3,1,0,0,0,0,"F","Serviço","Serviço","1.3.1.0.4.","SINAPI",72898,"CARGA E DESCARGA MECANIZADAS DE ENTULHO EM CAMINHAO BASCULANTE 6 M3","M3",47.625,null,null,null,"Referência: AGETOP - 41005"]
["S",3,"S",0,1,3,1,0,0,0,0,"F","Serviço","Serviço","1.3.1.0.5.","AGETOP",41012,"INDENIZAÇÃO DE JAZIDA","m3    ",47.625,null,null,null,""]
["S",3,"S",0,1,3,1,0,0,0,0,"F","Serviço","Serviço","1.3.1.0.6.","AGETOP",41006,"TRANSPORTE DE MATERIAL ESCAVADO M3.KM","m3km  ",476.25,null,null,null,""]
["S",3,"S",0,1,3,1,0,0,0,0,"F","Serviço","Serviço","1.3.1.0.7.","SINAPI","74005/1","COMPACTACAO MECANICA, SEM CONTROLE DO GC (C/COMPACTADOR PLACA 400 KG)","M3",50,null,null,null,"Referência: AGETOP - 41008"]
[3,3,3,2,1,3,2,0,0,19,2,"F","Nível 3","Nível 3","1.3.2.","SINAPI",null,"GERAL","-",null,null,null,null,""]
["S",3,"S",0,1,3,2,0,0,0,0,"F","Serviço","Serviço","1.3.2.0.1.","AGETOP",50620,"PEDRA MARROADA COM LANCAMENTO","m3    ",2.7,null,null,null,""]
[3,3,3,8,1,3,3,0,0,17,8,"F","Nível 3","Nível 3","1.3.3.",null,null,"AMPLIAÇÃO PASSARELA M2 - SEC. XXI - REV. 2015","-",null,null,null,null,""]
["S",3,"S",0,1,3,3,0,0,0,0,"F","Serviço","Serviço","1.3.3.0.1.","SINAPI","73859/2","CAPINA E LIMPEZA MANUAL DE TERRENO","M2",26.55,null,null,null,""]
["S",3,"S",0,1,3,3,0,0,0,0,"F","Serviço","Serviço","1.3.3.0.2.","AGETOP",41140,"REGULARIZAÇÃO DO TERRENO SEM APILOAMENTO COM TRANSPORTE MANUAL DA TERRA ESCAVADA ","m2    ",26.55,null,null,null,"Referência: AGETOP - 41005"]
["S",3,"S",0,1,3,3,0,0,0,0,"F","Serviço","Serviço","1.3.3.0.3.","SINAPI",79480,"ESCAVACAO MECANICA CAMPO ABERTO EM SOLO EXCETO ROCHA ATE 2,00M PROFUNDIDADE","M3",16.599999999999998,null,null,null,""]
["S",3,"S",0,1,3,3,0,0,0,0,"F","Serviço","Serviço","1.3.3.0.4.","SINAPI",72898,"CARGA E DESCARGA MECANIZADAS DE ENTULHO EM CAMINHAO BASCULANTE 6 M3","M3",16.599999999999998,null,null,null,"Referência: AGETOP - 41005"]
["S",3,"S",0,1,3,3,0,0,0,0,"F","Serviço","Serviço","1.3.3.0.5.","AGETOP",41012,"INDENIZAÇÃO DE JAZIDA","m3    ",16.599999999999998,null,null,null,""]
["S",3,"S",0,1,3,3,0,0,0,0,"F","Serviço","Serviço","1.3.3.0.6.","AGETOP",41006,"TRANSPORTE DE MATERIAL ESCAVADO M3.KM","m3km  ",165.99999999999997,null,null,null,""]
["S",3,"S",0,1,3,3,0,0,0,0,"F","Serviço","Serviço","1.3.3.0.7.","SINAPI","74005/1","COMPACTACAO MECANICA, SEM CONTROLE DO GC (C/COMPACTADOR PLACA 400 KG)","M3",16.739999999999998,null,null,null,"Referência: AGETOP - 41008"]
[3,3,3,4,1,3,4,0,0,{"$f":"IF(OR($C83=\"S\",$C83=0),0,MATCH(0,OFFSET($D83,1,$C83,ROW($C$742)-ROW($C83)),0))","v":9},{"$f":"IF(OR($C83=\"S\",$C83=0),0,MATCH(OFFSET($D83,0,$C83)+1,OFFSET($D83,1,$C83,ROW($C$742)-ROW($C83)),0))","v":4},"F","Nível 3","Nível 3","1.3.4.","SINAPI",null,"IMPLANTAÇÃO","-",null,null,null,null,""]
["S",3,"S",0,1,3,4,0,0,0,0,"F","Serviço","Serviço","1.3.4.0.1.","SINAPI","73859/2","CAPINA E LIMPEZA MANUAL DE TERRENO","M2",169.8,null,null,null,""]
["S",3,"S",0,1,3,4,0,0,0,0,"F","Serviço","Serviço","1.3.4.0.2.","AGETOP",41140,"REGULARIZAÇÃO DO TERRENO SEM APILOAMENTO COM TRANSPORTE MANUAL DA TERRA ESCAVADA ","m2    ",169.8,null,null,null,""]
["S",3,"S",0,1,3,4,0,0,0,0,"F","Serviço","Serviço","1.3.4.0.3.","SINAPI","74005/1","COMPACTACAO MECANICA, SEM CONTROLE DO GC (C/COMPACTADOR PLACA 400 KG)","M3",20.100000000000001,null,null,null,"Referência: AGETOP - 41009"]
[3,3,3,2,1,3,5,0,0,5,2,"F","Nível 3","Nível 3","1.3.5.","SINAPI",null,"CANALETA COM GRELHA","-",null,null,null,null,""]
["S",3,"S",0,1,3,5,0,0,0,0,"F","Serviço","Serviço","1.3.5.0.1.","AGETOP",40101,"ESCAVACAO MANUAL DE VALAS < 1 MTS. (OBRAS CIVIS)","m3    ",1.56,null,null,null,""]
[{"$f":"CHOOSE(1+LOG(1+2*(ORÇAMENTO.Nivel=\"Nível 1\")+4*(ORÇAMENTO.Nivel=\"Nível 2\")+8*(ORÇAMENTO.Nivel=\"Nível 3\")+16*(ORÇAMENTO.Nivel=\"Nível 4\")+32*(ORÇAMENTO.Nivel=\"Serviço\"),2),0,1,2,3,4,\"S\")","v":3},{"$f":"IF(OR(C89=\"s\",C89=0),OFFSET(B89,-1,0),C89)","v":3},{"$f":"IF(OFFSET(C89,-1,0)=\"L\",1,IF(OFFSET(C89,-1,0)=1,2,IF(OR(A89=\"s\",A89=0),\"S\",IF(AND(OFFSET(C89,-1,0)=2,A89=4),3,IF(AND(OR(OFFSET(C89,-1,0)=\"s\",OFFSET(C89,-1,0)=0),A89<>\"s\",A89>OFFSET(B89,-1,0)),OFFSET(B89,-1,0),A89)))))","v":3},{"$f":"IF(OR(C89=\"S\",C89=0),0,IF(ISERROR(K89),J89,SMALL(J89:K89,1)))","v":3},{"$f":"IF($C89=1,OFFSET(E89,-1,0)+1,OFFSET(E89,-1,0))","v":1},{"$f":"IF($C89=1,0,IF($C89=2,OFFSET(F89,-1,0)+1,OFFSET(F89,-1,0)))","v":3},{"$f":"IF(AND($C89<=2,$C89<>0),0,IF($C89=3,OFFSET(G89,-1,0)+1,OFFSET(G89,-1,0)))","v":6},{"$f":"IF(AND($C89<=3,$C89<>0),0,IF($C89=4,OFFSET(H89,-1,0)+1,OFFSET(H89,-1,0)))","v":0},{"$f":"IF(AND($C89<=4,$C89<>0),0,IF(AND($C89=\"S\",$W89>0),OFFSET(I89,-1,0)+1,OFFSET(I89,-1,0)))","v":0},3,{"$error":"#N/A"},"F","Nível 3","Nível 3","1.3.6.","SINAPI",null,"INST. ELÉTRICAS","-",null,null,null,null,""]
[{"$f":"CHOOSE(1+LOG(1+2*(ORÇAMENTO.Nivel=\"Nível 1\")+4*(ORÇAMENTO.Nivel=\"Nível 2\")+8*(ORÇAMENTO.Nivel=\"Nível 3\")+16*(ORÇAMENTO.Nivel=\"Nível 4\")+32*(ORÇAMENTO.Nivel=\"Serviço\"),2),0,1,2,3,4,\"S\")","v":"S"},{"$f":"IF(OR(C90=\"s\",C90=0),OFFSET(B90,-1,0),C90)","v":3},{"$f":"IF(OFFSET(C90,-1,0)=\"L\",1,IF(OFFSET(C90,-1,0)=1,2,IF(OR(A90=\"s\",A90=0),\"S\",IF(AND(OFFSET(C90,-1,0)=2,A90=4),3,IF(AND(OR(OFFSET(C90,-1,0)=\"s\",OFFSET(C90,-1,0)=0),A90<>\"s\",A90>OFFSET(B90,-1,0)),OFFSET(B90,-1,0),A90)))))","v":"S"},{"$f":"IF(OR(C90=\"S\",C90=0),0,IF(ISERROR(K90),J90,SMALL(J90:K90,1)))","v":0},{"$f":"IF($C90=1,OFFSET(E90,-1,0)+1,OFFSET(E90,-1,0))","v":1},{"$f":"IF($C90=1,0,IF($C90=2,OFFSET(F90,-1,0)+1,OFFSET(F90,-1,0)))","v":3},{"$f":"IF(AND($C90<=2,$C90<>0),0,IF($C90=3,OFFSET(G90,-1,0)+1,OFFSET(G90,-1,0)))","v":6},{"$f":"IF(AND($C90<=3,$C90<>0),0,IF($C90=4,OFFSET(H90,-1,0)+1,OFFSET(H90,-1,0)))","v":0},{"$f":"IF(AND($C90<=4,$C90<>0),0,IF(AND($C90=\"S\",$W90>0),OFFSET(I90,-1,0)+1,OFFSET(I90,-1,0)))","v":0},0,0,"F","Serviço","Serviço","1.3.6.0.1.","SINAPI",93358,"ESCAVAÇÃO MANUAL DE VALA COM PROFUNDIDADE MENOR OU IGUAL A 1,30 M. AF_03/2016","M3",6.6,null,null,null,"Referência: AGETOP - 40101"]
[{"$f":"CHOOSE(1+LOG(1+2*(ORÇAMENTO.Nivel=\"Nível 1\")+4*(ORÇAMENTO.Nivel=\"Nível 2\")+8*(ORÇAMENTO.Nivel=\"Nível 3\")+16*(ORÇAMENTO.Nivel=\"Nível 4\")+32*(ORÇAMENTO.Nivel=\"Serviço\"),2),0,1,2,3,4,\"S\")","v":"S"},{"$f":"IF(OR(C91=\"s\",C91=0),OFFSET(B91,-1,0),C91)","v":3},{"$f":"IF(OFFSET(C91,-1,0)=\"L\",1,IF(OFFSET(C91,-1,0)=1,2,IF(OR(A91=\"s\",A91=0),\"S\",IF(AND(OFFSET(C91,-1,0)=2,A91=4),3,IF(AND(OR(OFFSET(C91,-1,0)=\"s\",OFFSET(C91,-1,0)=0),A91<>\"s\",A91>OFFSET(B91,-1,0)),OFFSET(B91,-1,0),A91)))))","v":"S"},{"$f":"IF(OR(C91=\"S\",C91=0),0,IF(ISERROR(K91),J91,SMALL(J91:K91,1)))","v":0},{"$f":"IF($C91=1,OFFSET(E91,-1,0)+1,OFFSET(E91,-1,0))","v":1},{"$f":"IF($C91=1,0,IF($C91=2,OFFSET(F91,-1,0)+1,OFFSET(F91,-1,0)))","v":3},{"$f":"IF(AND($C91<=2,$C91<>0),0,IF($C91=3,OFFSET(G91,-1,0)+1,OFFSET(G91,-1,0)))","v":6},{"$f":"IF(AND($C91<=3,$C91<>0),0,IF($C91=4,OFFSET(H91,-1,0)+1,OFFSET(H91,-1,0)))","v":0},{"$f":"IF(AND($C91<=4,$C91<>0),0,IF(AND($C91=\"S\",$W91>0),OFFSET(I91,-1,0)+1,OFFSET(I91,-1,0)))","v":0},0,0,"F","Serviço","Serviço","1.3.6.0.2.","SINAPI",93382,"REATERRO MANUAL DE VALAS COM COMPACTAÇÃO MECANIZADA. AF_04/2016","M3",6.6,null,null,null,"Referência: AGETOP - 40904"]
[{"$f":"CHOOSE(1+LOG(1+2*(ORÇAMENTO.Nivel=\"Nível 1\")+4*(ORÇAMENTO.Nivel=\"Nível 2\")+8*(ORÇAMENTO.Nivel=\"Nível 3\")+16*(ORÇAMENTO.Nivel=\"Nível 4\")+32*(ORÇAMENTO.Nivel=\"Serviço\"),2),0,1,2,3,4,\"S\")","v":2},{"$f":"IF(OR(C92=\"s\",C92=0),OFFSET(B92,-1,0),C92)","v":2},{"$f":"IF(OFFSET(C92,-1,0)=\"L\",1,IF(OFFSET(C92,-1,0)=1,2,IF(OR(A92=\"s\",A92=0),\"S\",IF(AND(OFFSET(C92,-1,0)=2,A92=4),3,IF(AND(OR(OFFSET(C92,-1,0)=\"s\",OFFSET(C92,-1,0)=0),A92<>\"s\",A92>OFFSET(B92,-1,0)),OFFSET(B92,-1,0),A92)))))","v":2},{"$f":"IF(OR(C92=\"S\",C92=0),0,IF(ISERROR(K92),J92,SMALL(J92:K92,1)))","v":126},{"$f":"IF($C92=1,OFFSET(E92,-1,0)+1,OFFSET(E92,-1,0))","v":1},{"$f":"IF($C92=1,0,IF($C92=2,OFFSET(F92,-1,0)+1,OFFSET(F92,-1,0)))","v":4},{"$f":"IF(AND($C92<=2,$C92<>0),0,IF($C92=3,OFFSET(G92,-1,0)+1,OFFSET(G92,-1,0)))","v":0},{"$f":"IF(AND($C92<=3,$C92<>0),0,IF($C92=4,OFFSET(H92,-1,0)+1,OFFSET(H92,-1,0)))","v":0},{"$f":"IF(AND($C92<=4,$C92<>0),0,IF(AND($C92=\"S\",$W92>0),OFFSET(I92,-1,0)+1,OFFSET(I92,-1,0)))","v":0},415,126,"F","Nível 2","Nível 2","1.4.",null,null,"INSTALAÇÕES ELÉTRICAS","-",null,null,null,null,""]
[3,3,3,12,1,4,1,0,0,125,12,"F","Nível 3","Nível 3","1.4.1.","SINAPI",null,"IMPLANTAÇÃO","-",null,null,null,null,""]
["S",3,"S",0,1,4,1,0,0,0,0,"F","Serviço","Serviço","1.4.1.0.1.","SINAPI",93671,"DISJUNTOR TRIPOLAR TIPO DIN, CORRENTE NOMINAL DE 32A - FORNECIMENTO E INSTALAÇÃO. AF_04/2016","UN",1,null,null,null,"Referência: AGETOP - 71173"]
["S",3,"S",0,1,4,1,0,0,0,0,"F","Serviço","Serviço","1.4.1.0.2.","SINAPI",91930,"CABO DE COBRE FLEXÍVEL ISOLADO, 6 MM², ANTI-CHAMA 450/750 V, PARA CIRCUITOS TERMINAIS - FORNECIMENTO E INSTALAÇÃO. AF_12/2015","M",446.72,null,null,null,"Referência: AGETOP - 70565"]
["S",3,"S",0,1,4,1,0,0,0,0,"F","Serviço","Serviço","1.4.1.0.3.","SINAPI",91872,"ELETRODUTO RÍGIDO ROSCÁVEL, PVC, DN 32 MM (1\"), PARA CIRCUITOS TERMINAIS, INSTALADO EM PAREDE - FORNECIMENTO E INSTALAÇÃO. AF_12/2015","M",25.88,null,null,null,"Referência: AGETOP - 71202"]
["S",3,"S",0,1,4,1,0,0,0,0,"F","Serviço","Serviço","1.4.1.0.4.","SINAPI",91885,"LUVA PARA ELETRODUTO, PVC, ROSCÁVEL, DN 32 MM (1\"), PARA CIRCUITOS TERMINAIS, INSTALADA EM PAREDE - FORNECIMENTO E INSTALAÇÃO. AF_12/2015","UN",9,null,null,null,"Referência: AGETOP - 71742"]
["S",3,"S",0,1,4,1,0,0,0,0,"F","Serviço","Serviço","1.4.1.0.5.","AGETOP",70352,"BRACADEIRA METALICA TIPO \"U\" DIAM. 1\"","Un    ",9,null,null,null,""]
["S",3,"S",0,1,4,1,0,0,0,0,"F","Serviço","Serviço","1.4.1.0.6.","SINAPI",83446,"CAIXA DE PASSAGEM 30X30X40 COM TAMPA E DRENO BRITA","UN",1,null,null,null,""]
["S",3,"S",0,1,4,1,0,0,0,0,"F","Serviço","Serviço","1.4.1.0.7.","AGETOP",71861,"PARAFUSO P/BUCHA S-6","Un    ",72,null,null,null,""]
["S",3,"S",0,1,4,1,0,0,0,0,"F","Serviço","Serviço","1.4.1.0.8.","AGETOP",70391,"BUCHA DE NYLON S-6","Un    ",72,null,null,null,""]
["S",3,"S",0,1,4,1,0,0,0,0,"F","Serviço","Serviço","1.4.1.0.9.","SINAPI",93358,"ESCAVAÇÃO MANUAL DE VALA COM PROFUNDIDADE MENOR OU IGUAL A 1,30 M. AF_03/2016","M3",4.05,null,null,null,"Referência: AGETOP - 40101"]
["S",3,"S",0,1,4,1,0,0,0,0,"F","Serviço","Serviço","1.4.1.0.10.","SINAPI",96995,"REATERRO MANUAL APILOADO COM SOQUETE. AF_10/2017","M3",4.05,null,null,null,"Referência: AGETOP - 40902"]
["S",3,"S",0,1,4,1,0,0,0,0,"F","Serviço","Serviço","1.4.1.0.11.","AGETOP",220102,"PISO CONCRETO DESEMPENADO ESPESSURA = 5 CM  1:2,5:3,5","m2    ",4.05,null,null,null,""]
[3,3,3,9,1,4,2,0,0,113,9,"F","Nível 3","Nível 3","1.4.2.","SINAPI",null,"ALARME DE INCÊNDIO / ILUMINAÇÃO DE EMERGÊNCIA","-",null,null,null,null,""]
["S",3,"S",0,1,4,2,0,0,0,0,"F","Serviço","Serviço","1.4.2.0.1.","SINAPI",91868,"ELETRODUTO RÍGIDO ROSCÁVEL, PVC, DN 32 MM (1\"), PARA CIRCUITOS TERMINAIS, INSTALADO EM LAJE - FORNECIMENTO E INSTALAÇÃO. AF_12/2015","M",90,null,null,null,"Referência: AGETOP - 71202"]
["S",3,"S",0,1,4,2,0,0,0,0,"F","Serviço","Serviço","1.4.2.0.2.","SINAPI",91834,"ELETRODUTO FLEXÍVEL CORRUGADO, PVC, DN 25 MM (3/4\"), PARA CIRCUITOS TERMINAIS, INSTALADO EM FORRO - FORNECIMENTO E INSTALAÇÃO. AF_12/2015","M",340,null,null,null,"Referência: AGETOP - 71194"]
["S",3,"S",0,1,4,2,0,0,0,0,"F","Serviço","Serviço","1.4.2.0.3.","SINAPI",97891,"CAIXA ENTERRADA ELÉTRICA RETANGULAR, EM ALVENARIA COM BLOCOS DE CONCRETO, FUNDO COM BRITA, DIMENSÕES INTERNAS: 0,4X0,4X0,4 M. AF_05/2018","UN",4,null,null,null,""]
["S",3,"S",0,1,4,2,0,0,0,0,"F","Serviço","Serviço","1.4.2.0.4.","SINAPI",91929,"CABO DE COBRE FLEXÍVEL ISOLADO, 4 MM², ANTI-CHAMA 0,6/1,0 KV, PARA CIRCUITOS TERMINAIS - FORNECIMENTO E INSTALAÇÃO. AF_12/2015","M",400,null,null,null,"Referência: AGETOP - 70582"]
["S",3,"S",0,1,4,2,0,0,0,0,"F","Serviço","Serviço","1.4.2.0.5.","SINAPI",91926,"CABO DE COBRE FLEXÍVEL ISOLADO, 2,5 MM², ANTI-CHAMA 450/750 V, PARA CIRCUITOS TERMINAIS - FORNECIMENTO E INSTALAÇÃO. AF_12/2015","M",1050,null,null,null,"Referência: AGETOP - 70563"]
["S",3,"S",0,1,4,2,0,0,0,0,"F","Serviço","Serviço","1.4.2.0.6.","SINAPI",93670,"DISJUNTOR TRIPOLAR TIPO DIN, CORRENTE NOMINAL DE 25A - FORNECIMENTO E INSTALAÇÃO. AF_04/2016","UN",1,null,null,null,"Referência: AGETOP - 71173"]
["S",3,"S",0,1,4,2,0,0,0,0,"F","Serviço","Serviço","1.4.2.0.7.","SINAPI",83463,"QUADRO DE DISTRIBUICAO DE ENERGIA EM CHAPA DE ACO GALVANIZADO, PARA 12 DISJUNTORES TERMOMAGNETICOS MONOPOLARES, COM BARRAMENTO TRIFASICO E NEUTRO - FORNECIMENTO E INSTALACAO","UN",1,null,null,null,""]
["S",3,"S",0,1,4,2,0,0,0,0,"F","Serviço","Serviço","1.4.2.0.8.","AGETOP",70561,"CABO ISOLADO PP 3 X 2,5 MM2","M     ",230,null,null,null,""]
[3,3,3,42,1,4,3,0,0,104,42,"F","Nível 3","Nível 3","1.4.3.","SINAPI",null,"REFORMA ELÉTRICA","-",null,null,null,null,""]
["S",3,"S",0,1,4,3,0,0,0,0,"F","Serviço","Serviço","1.4.3.0.1.","SINAPI",83463,"QUADRO DE DISTRIBUICAO DE ENERGIA EM CHAPA DE ACO GALVANIZADO, PARA 12 DISJUNTORES TERMOMAGNETICOS MONOPOLARES, COM BARRAMENTO TRIFASICO E NEUTRO - FORNECIMENTO E INSTALACAO","UN",2,null,null,null,""]
["S",3,"S",0,1,4,3,0,0,0,0,"F","Serviço","Serviço","1.4.3.0.2.","SINAPI","74131/4","QUADRO DE DISTRIBUICAO DE ENERGIA DE EMBUTIR, EM CHAPA METALICA, PARA 18 DISJUNTORES TERMOMAGNETICOS MONOPOLARES, COM BARRAMENTO TRIFASICO E NEUTRO, FORNECIMENTO E INSTALACAO","UN",3,null,null,null,""]
["S",3,"S",0,1,4,3,0,0,0,0,"F","Serviço","Serviço","1.4.3.0.3.","SINAPI","74131/5","QUADRO DE DISTRIBUICAO DE ENERGIA DE EMBUTIR, EM CHAPA METALICA, PARA 24 DISJUNTORES TERMOMAGNETICOS MONOPOLARES, COM BARRAMENTO TRIFASICO E NEUTRO, FORNECIMENTO E INSTALACAO","UN",1,null,null,null,""]
["S",3,"S",0,1,4,3,0,0,0,0,"F","Serviço","Serviço","1.4.3.0.4.","AGETOP",71175,"DISJUNTOR TRIPOLAR DE 60 A 100-A","Un    ",1,null,null,null,""]
["S",3,"S",0,1,4,3,0,0,0,0,"F","Serviço","Serviço","1.4.3.0.5.","SINAPI",93673,"DISJUNTOR TRIPOLAR TIPO DIN, CORRENTE NOMINAL DE 50A - FORNECIMENTO E INSTALAÇÃO. AF_04/2016","UN",3,null,null,null,"Referência: AGETOP - 71174"]
["S",3,"S",0,1,4,3,0,0,0,0,"F","Serviço","Serviço","1.4.3.0.6.","SINAPI",93672,"DISJUNTOR TRIPOLAR TIPO DIN, CORRENTE NOMINAL DE 40A - FORNECIMENTO E INSTALAÇÃO. AF_04/2016","UN",1,null,null,null,"Referência: AGETOP - 71174"]
["S",3,"S",0,1,4,3,0,0,0,0,"F","Serviço","Serviço","1.4.3.0.7.","SINAPI",93670,"DISJUNTOR TRIPOLAR TIPO DIN, CORRENTE NOMINAL DE 25A - FORNECIMENTO E INSTALAÇÃO. AF_04/2016","UN",2,null,null,null,"Referência: AGETOP - 71173"]
["S",3,"S",0,1,4,3,0,0,0,0,"F","Serviço","Serviço","1.4.3.0.8.","AGETOP",71450,"INTERRUPTOR DIFERENCIAL RESIDUAL (D.R.) BIPOLAR DE 25A-30mA","Un    ",3,null,null,null,""]
["S",3,"S",0,1,4,3,0,0,0,0,"F","Serviço","Serviço","1.4.3.0.9.","SINAPI",91926,"CABO DE COBRE FLEXÍVEL ISOLADO, 2,5 MM², ANTI-CHAMA 450/750 V, PARA CIRCUITOS TERMINAIS - FORNECIMENTO E INSTALAÇÃO. AF_12/2015","M",4951,null,null,null,"Referência: AGETOP - 70563"]
["S",3,"S",0,1,4,3,0,0,0,0,"F","Serviço","Serviço","1.4.3.0.10.","SINAPI",91928,"CABO DE COBRE FLEXÍVEL ISOLADO, 4 MM², ANTI-CHAMA 450/750 V, PARA CIRCUITOS TERMINAIS - FORNECIMENTO E INSTALAÇÃO. AF_12/2015","M",2208,null,null,null,"Referência: AGETOP - 70564"]
["S",3,"S",0,1,4,3,0,0,0,0,"F","Serviço","Serviço","1.4.3.0.11.","SINAPI",91930,"CABO DE COBRE FLEXÍVEL ISOLADO, 6 MM², ANTI-CHAMA 450/750 V, PARA CIRCUITOS TERMINAIS - FORNECIMENTO E INSTALAÇÃO. AF_12/2015","M",10,null,null,null,"Referência: AGETOP - 70565"]
["S",3,"S",0,1,4,3,0,0,0,0,"F","Serviço","Serviço","1.4.3.0.12.","SINAPI",92979,"CABO DE COBRE FLEXÍVEL ISOLADO, 10 MM², ANTI-CHAMA 450/750 V, PARA DISTRIBUIÇÃO - FORNECIMENTO E INSTALAÇÃO. AF_12/2015","M",743,null,null,null,""]
["S",3,"S",0,1,4,3,0,0,0,0,"F","Serviço","Serviço","1.4.3.0.13.","SINAPI",92981,"CABO DE COBRE FLEXÍVEL ISOLADO, 16 MM², ANTI-CHAMA 450/750 V, PARA DISTRIBUIÇÃO - FORNECIMENTO E INSTALAÇÃO. AF_12/2015","M",17,null,null,null,""]
["S",3,"S",0,1,4,3,0,0,0,0,"F","Serviço","Serviço","1.4.3.0.14.","SINAPI",93010,"ELETRODUTO RÍGIDO ROSCÁVEL, PVC, DN 75 MM (2 1/2\") - FORNECIMENTO E INSTALAÇÃO. AF_12/2015","M",102.3,null,null,null,""]
["S",3,"S",0,1,4,3,0,0,0,0,"F","Serviço","Serviço","1.4.3.0.15.","SINAPI",93009,"ELETRODUTO RÍGIDO ROSCÁVEL, PVC, DN 60 MM (2\") - FORNECIMENTO E INSTALAÇÃO. AF_12/2015","M",3.5,null,null,null,""]
["S",3,"S",0,1,4,3,0,0,0,0,"F","Serviço","Serviço","1.4.3.0.16.","SINAPI",93008,"ELETRODUTO RÍGIDO ROSCÁVEL, PVC, DN 50 MM (1 1/2\") - FORNECIMENTO E INSTALAÇÃO. AF_12/2015","M",119.79,null,null,null,""]
["S",3,"S",0,1,4,3,0,0,0,0,"F","Serviço","Serviço","1.4.3.0.17.","SINAPI",91872,"ELETRODUTO RÍGIDO ROSCÁVEL, PVC, DN 32 MM (1\"), PARA CIRCUITOS TERMINAIS, INSTALADO EM PAREDE - FORNECIMENTO E INSTALAÇÃO. AF_12/2015","M",94.9,null,null,null,"Referência: AGETOP - 71202"]
["S",3,"S",0,1,4,3,0,0,0,0,"F","Serviço","Serviço","1.4.3.0.18.","SINAPI",91871,"ELETRODUTO RÍGIDO ROSCÁVEL, PVC, DN 25 MM (3/4\"), PARA CIRCUITOS TERMINAIS, INSTALADO EM PAREDE - FORNECIMENTO E INSTALAÇÃO. AF_12/2015","M",750.84,null,null,null,"Referência: AGETOP - 71201"]
["S",3,"S",0,1,4,3,0,0,0,0,"F","Serviço","Serviço","1.4.3.0.19.","SINAPI",93015,"LUVA PARA ELETRODUTO, PVC, ROSCÁVEL, DN 75 MM (2 1/2\") - FORNECIMENTO E INSTALAÇÃO. AF_12/2015","UN",34,null,null,null,""]
["S",3,"S",0,1,4,3,0,0,0,0,"F","Serviço","Serviço","1.4.3.0.20.","SINAPI",93014,"LUVA PARA ELETRODUTO, PVC, ROSCÁVEL, DN 60 MM (2\") - FORNECIMENTO E INSTALAÇÃO. AF_12/2015","UN",2,null,null,null,"Referência: AGETOP - 71745"]
["S",3,"S",0,1,4,3,0,0,0,0,"F","Serviço","Serviço","1.4.3.0.21.","SINAPI",93013,"LUVA PARA ELETRODUTO, PVC, ROSCÁVEL, DN 50 MM (1 1/2\") - FORNECIMENTO E INSTALAÇÃO. AF_12/2015","UN",40,null,null,null,"Referência: AGETOP - 71744"]
["S",3,"S",0,1,4,3,0,0,0,0,"F","Serviço","Serviço","1.4.3.0.22.","SINAPI",91885,"LUVA PARA ELETRODUTO, PVC, ROSCÁVEL, DN 32 MM (1\"), PARA CIRCUITOS TERMINAIS, INSTALADA EM PAREDE - FORNECIMENTO E INSTALAÇÃO. AF_12/2015","UN",32,null,null,null,"Referência: AGETOP - 71742"]
["S",3,"S",0,1,4,3,0,0,0,0,"F","Serviço","Serviço","1.4.3.0.23.","SINAPI",91884,"LUVA PARA ELETRODUTO, PVC, ROSCÁVEL, DN 25 MM (3/4\"), PARA CIRCUITOS TERMINAIS, INSTALADA EM PAREDE - FORNECIMENTO E INSTALAÇÃO. AF_12/2015","UN",150,null,null,null,"Referência: AGETOP - 71741"]
["S",3,"S",0,1,4,3,0,0,0,0,"F","Serviço","Serviço","1.4.3.0.24.","AGETOP",70375,"BRACADEIRA METALICA TIPO \"D\" DIAM. 2\"","Un    ",34,null,null,null,""]
["S",3,"S",0,1,4,3,0,0,0,0,"F","Serviço","Serviço","1.4.3.0.25.","AGETOP",70376,"BRACADEIRA METALICA TIPO \"D\" DIAM. 2.1/2\"","Un    ",2,null,null,null,""]
["S",3,"S",0,1,4,3,0,0,0,0,"F","Serviço","Serviço","1.4.3.0.26.","AGETOP",70372,"BRACADEIRA METALICA TIPO \"D\" DIAM. 1\"","Un    ",40,null,null,null,""]
["S",3,"S",0,1,4,3,0,0,0,0,"F","Serviço","Serviço","1.4.3.0.27.","AGETOP",70370,"BRACADEIRA METALICA TIPO \"D\" DIAM. 1/2\"","Un    ",32,null,null,null,""]
["S",3,"S",0,1,4,3,0,0,0,0,"F","Serviço","Serviço","1.4.3.0.28.","AGETOP",70371,"BRACADEIRA METALICA TIPO \"D\" DIAM. 3/4\"","Un    ",150,null,null,null,""]
["S",3,"S",0,1,4,3,0,0,0,0,"F","Serviço","Serviço","1.4.3.0.29.","AGETOP",70391,"BUCHA DE NYLON S-6","Un    ",1032,null,null,null,""]
["S",3,"S",0,1,4,3,0,0,0,0,"F","Serviço","Serviço","1.4.3.0.30.","AGETOP",71861,"PARAFUSO P/BUCHA S-6","Un    ",1032,null,null,null,""]
["S",3,"S",0,1,4,3,0,0,0,0,"F","Serviço","Serviço","1.4.3.0.31.","SINAPI",97585,"LUMINÁRIA TIPO CALHA, DE SOBREPOR, COM 2 LÂMPADAS TUBULARES DE 18 W - FORNECIMENTO E INSTALAÇÃO. AF_11/2017","UN",215,null,null,null,""]
["S",3,"S",0,1,4,3,0,0,0,0,"F","Serviço","Serviço","1.4.3.0.32.","SINAPI",97593,"LUMINÁRIA TIPO SPOT, DE SOBREPOR, COM 1 LÂMPADA DE 15 W - FORNECIMENTO E INSTALAÇÃO. AF_11/2017","UN",70,null,null,null,"Referência: AGETOP - 71688"]
["S",3,"S",0,1,4,3,0,0,{"$f":"IF(OR($C147=\"S\",$C147=0),0,MATCH(0,OFFSET($D147,1,$C147,ROW($C$742)-ROW($C147)),0))","v":0},{"$f":"IF(OR($C147=\"S\",$C147=0),0,MATCH(OFFSET($D147,0,$C147)+1,OFFSET($D147,1,$C147,ROW($C$742)-ROW($C147)),0))","v":0},"F","Serviço","Serviço","1.4.3.0.33.","SINAPI",97610,"LÂMPADA COMPACTA DE LED 10 W, BASE E27 - FORNECIMENTO E INSTALAÇÃO. AF_11/2017","UN",70,null,null,null,""]
["S",3,"S",0,1,4,3,0,0,0,0,"F","Serviço","Serviço","1.4.3.0.34.","SINAPI",91953,"INTERRUPTOR SIMPLES (1 MÓDULO), 10A/250V, INCLUINDO SUPORTE E PLACA - FORNECIMENTO E INSTALAÇÃO. AF_12/2015","UN",45,null,null,null,"Referência: AGETOP - 71440"]
["S",3,"S",0,1,4,3,0,0,0,0,"F","Serviço","Serviço","1.4.3.0.35.","SINAPI",91959,"INTERRUPTOR SIMPLES (2 MÓDULOS), 10A/250V, INCLUINDO SUPORTE E PLACA - FORNECIMENTO E INSTALAÇÃO. AF_12/2015","UN",3,null,null,null,"Referência: AGETOP - 71441"]
["S",3,"S",0,1,4,3,0,0,0,0,"F","Serviço","Serviço","1.4.3.0.36.","SINAPI",92865,"CAIXA OCTOGONAL 4\" X 4\", METÁLICA, INSTALADA EM LAJE - FORNECIMENTO E INSTALAÇÃO. AF_12/2015","UN",48,null,null,null,"Referência: AGETOP - 70682"]
["S",3,"S",0,1,4,3,0,0,0,0,"F","Serviço","Serviço","1.4.3.0.37.","AGETOP",71331,"FITA ISOLANTE, ROLO DE 20,00 M","Un    ",8,null,null,null,""]
["S",3,"S",0,1,4,3,0,0,0,0,"F","Serviço","Serviço","1.4.3.0.38.","SINAPI","74246/1","REFLETOR RETANGULAR FECHADO COM LAMPADA VAPOR METALICO 400 W","UN",16,null,null,null,"Referência: AGETOP - 71684"]
["S",3,"S",0,1,4,3,0,0,0,0,"F","Serviço","Serviço","1.4.3.0.39.","SINAPI",92008,"TOMADA BAIXA DE EMBUTIR (2 MÓDULOS), 2P+T 10 A, INCLUINDO SUPORTE E PLACA - FORNECIMENTO E INSTALAÇÃO. AF_12/2015","UN",52,null,null,null,""]
["S",3,"S",0,1,4,3,0,0,0,0,"F","Serviço","Serviço","1.4.3.0.40.","SINAPI",91993,"TOMADA ALTA DE EMBUTIR (1 MÓDULO), 2P+T 20 A, INCLUINDO SUPORTE E PLACA - FORNECIMENTO E INSTALAÇÃO. AF_12/2015","UN",25,null,null,null,"Referência: AGETOP - 72585"]
["S",3,"S",0,1,4,3,0,0,0,0,"F","Serviço","Serviço","1.4.3.0.41.","SINAPI",92865,"CAIXA OCTOGONAL 4\" X 4\", METÁLICA, INSTALADA EM LAJE - FORNECIMENTO E INSTALAÇÃO. AF_12/2015","UN",77,null,null,null,"Referência: AGETOP - 70682"]
[3,3,3,62,1,4,4,0,0,62,277,"F","Nível 3","Nível 3","1.4.4.","SINAPI",null,"SUBESTAÇÃO 112,5 KVA","-",null,null,null,null,""]
["S",3,"S",0,1,4,4,0,0,0,0,"F","Serviço","Serviço","1.4.4.0.1.","SINAPI","73767/2","ALCA PRE-FORMADA DISTRIBUIÇÃO EM  ACO RECOBERTO COM ALUMINIO PARA CABO 25MM2, ENCAPADO. FORNECIMENTO E INSTALAÇÃO.","UN",1,null,null,null,""]
["S",3,"S",0,1,4,4,0,0,0,0,"F","Serviço","Serviço","1.4.4.0.2.","AGETOP",70252,"ARRUELA LISA D=5/16\"","Un    ",8,null,null,null,""]
["S",3,"S",0,1,4,4,0,0,0,0,"F","Serviço","Serviço","1.4.4.0.3.","AGETOP",70268,"BARRA DE COBRE 2\" X 3/16\"  (2,0865 KG/M)","m     ",1.5,null,null,null,""]
["S",3,"S",0,1,4,4,0,0,0,0,"F","Serviço","Serviço","1.4.4.0.4.","SINAPI",91175,"FIXAÇÃO DE TUBOS VERTICAIS DE PPR DIÂMETROS MAIORES QUE 75 MM COM ABRAÇADEIRA METÁLICA RÍGIDA TIPO D 3\", FIXADA EM PERFILADO EM ALVENARIA. AF_05/2015","M",6,null,null,null,""]
["S",3,"S",0,1,4,4,0,0,0,0,"F","Serviço","Serviço","1.4.4.0.5.","AGETOP",70386,"BRAÇO C AÇO GALVANIZADO , CONFORME NTD-17","un    ",1,null,null,null,""]
["S",3,"S",0,1,4,4,0,0,0,0,"F","Serviço","Serviço","1.4.4.0.6.","AGETOP",70422,"BUCHA E ARRUELA METALICA DIAM. 1\"","PR    ",2,null,null,null,""]
["S",3,"S",0,1,4,4,0,0,0,0,"F","Serviço","Serviço","1.4.4.0.7.","AGETOP",70426,"BUCHA E ARRUELA METALICA DIAM. 2.1/2\"","PR    ",1,null,null,null,""]
["S",3,"S",0,1,4,4,0,0,0,0,"F","Serviço","Serviço","1.4.4.0.8.","SINAPI",92986,"CABO DE COBRE FLEXÍVEL ISOLADO, 35 MM², ANTI-CHAMA 0,6/1,0 KV, PARA DISTRIBUIÇÃO - FORNECIMENTO E INSTALAÇÃO. AF_12/2015","M",83.61,null,null,null,"Referência: AGETOP - 70512"]
["S",3,"S",0,1,4,4,0,0,0,0,"F","Serviço","Serviço","1.4.4.0.9.","SINAPI",92990,"CABO DE COBRE FLEXÍVEL ISOLADO, 70 MM², ANTI-CHAMA 0,6/1,0 KV, PARA DISTRIBUIÇÃO - FORNECIMENTO E INSTALAÇÃO. AF_12/2015","M",335,null,null,null,"Referência: AGETOP - 70514"]
["S",3,"S",0,1,4,4,0,0,0,0,"F","Serviço","Serviço","1.4.4.0.10.","AGETOP",70543,"CABO DE COBRE NÚ No. 35 MM2","M     ",3,null,null,null,""]
["S",3,"S",0,1,4,4,0,0,0,0,"F","Serviço","Serviço","1.4.4.0.11.","SINAPI",96977,"CORDOALHA DE COBRE NU 50 MM², ENTERRADA, SEM ISOLADOR - FORNECIMENTO E INSTALAÇÃO. AF_12/2017","M",45,null,null,null,""]
["S",3,"S",0,1,4,4,0,0,0,0,"F","Serviço","Serviço","1.4.4.0.12.","AGETOP",70695,"CAIXA METÁLICA PARA PROTEÇÃO GERAL 580X500X216MM ATÉ 175A","Un    ",1,null,null,null,""]
["S",3,"S",0,1,4,4,0,0,0,0,"F","Serviço","Serviço","1.4.4.0.13.","AGETOP",70725,"CAIXA METÁLICA PARA T.C. 580X500X216MM - ATÉ 175A","Un    ",1,null,null,null,""]
["S",3,"S",0,1,4,4,0,0,0,0,"F","Serviço","Serviço","1.4.4.0.14.","SINAPI",97893,"CAIXA ENTERRADA ELÉTRICA RETANGULAR, EM ALVENARIA COM BLOCOS DE CONCRETO, FUNDO COM BRITA, DIMENSÕES INTERNAS: 0,8X0,8X0,6 M. AF_05/2018","UN",2,null,null,null,""]
["S",3,"S",0,1,4,4,0,0,0,0,"F","Serviço","Serviço","1.4.4.0.15.","AGETOP",70771,"CANTONEIRA AUXILIAR PARA BRAÇO TIPO C","un    ",1,null,null,null,""]
["S",3,"S",0,1,4,4,0,0,0,0,"F","Serviço","Serviço","1.4.4.0.16.","AGETOP",70920,"CINTA DE ACO GALVANIZADO DIAM.190 MM","Un    ",1,null,null,null,""]
["S",3,"S",0,1,4,4,0,0,0,0,"F","Serviço","Serviço","1.4.4.0.17.","AGETOP",70921,"CINTA DE ACO GALVANIZADO DIAM.220 MM","Un    ",2,null,null,null,""]
["S",3,"S",0,1,4,4,0,0,0,0,"F","Serviço","Serviço","1.4.4.0.18.","AGETOP",70922,"CINTA DE ACO GALVANIZADO DIAM.230MM","Un    ",2,null,null,null,""]
["S",3,"S",0,1,4,4,0,0,0,0,"F","Serviço","Serviço","1.4.4.0.19.","AGETOP",71016,"CONECTOR DE COMPRESSÃO FORMATO H PARA CABO 25 A 70 MM2","un    ",4,null,null,null,""]
["S",3,"S",0,1,4,4,0,0,0,0,"F","Serviço","Serviço","1.4.4.0.20.","AGETOP",71036,"CONECTOR TIPO PARAFUSO FENDIDO 50 MM2","Un    ",6,null,null,null,""]
["S",3,"S",0,1,4,4,0,0,0,0,"F","Serviço","Serviço","1.4.4.0.21.","SINAPI",72272,"CONECTOR PARAFUSO FENDIDO \u0094SPLIT-BOLT\u0094 - PARA CABO DE 35MM2 - FORNECIMENTO E INSTALACAO","UN",1,null,null,null,""]
["S",3,"S",0,1,4,4,0,0,0,0,"F","Serviço","Serviço","1.4.4.0.22.","AGETOP",71037,"CONECTOR TIPO PARAFUSO FENDIDO 70 MM2","Un    ",4,null,null,null,""]
["S",3,"S",0,1,4,4,0,0,0,0,"F","Serviço","Serviço","1.4.4.0.23.","AGETOP",71142,"CURVA DE 90 GRAUS DE PVC RIGIDO DIAM. 1\"","Un    ",1,null,null,null,""]
["S",3,"S",0,1,4,4,0,0,0,0,"F","Serviço","Serviço","1.4.4.0.24.","SINAPI",93022,"CURVA 90 GRAUS PARA ELETRODUTO, PVC, ROSCÁVEL, DN 75 MM (2 1/2\") - FORNECIMENTO E INSTALAÇÃO. AF_12/2015","UN",1,null,null,null,""]
["S",3,"S",0,1,4,4,0,0,0,0,"F","Serviço","Serviço","1.4.4.0.25.","AGETOP",71184,"DISPOSITIVO DE PROTEÇÃO CONTRA SURTOS (D.P.S.) 275V DE 8 A 40KA","Un    ",3,null,null,null,""]
["S",3,"S",0,1,4,4,0,0,0,0,"F","Serviço","Serviço","1.4.4.0.26.","SINAPI","74130/10","DISJUNTOR TERMOMAGNETICO TRIPOLAR EM CAIXA MOLDADA 175 A 225A 240V, FORNECIMENTO E INSTALACAO","UN",2,null,null,null,""]
["S",3,"S",0,1,4,4,0,0,0,0,"F","Serviço","Serviço","1.4.4.0.27.","AGETOP",71202,"ELETRODUTO DE PVC RIGIDO DIAMETRO 1\"","M     ",3,null,null,null,""]
["S",3,"S",0,1,4,4,0,0,0,0,"F","Serviço","Serviço","1.4.4.0.28.","SINAPI",93010,"ELETRODUTO RÍGIDO ROSCÁVEL, PVC, DN 75 MM (2 1/2\") - FORNECIMENTO E INSTALAÇÃO. AF_12/2015","M",3,null,null,null,""]
["S",3,"S",0,1,4,4,0,0,0,0,"F","Serviço","Serviço","1.4.4.0.29.","AGETOP",71216,"ELETRODUTO EM AÇO GALVANIZADO A FOGO DIÂMETRO 2 1/2\" - PESADO ","M     ",7,null,null,null,""]
["S",3,"S",0,1,4,4,0,0,0,0,"F","Serviço","Serviço","1.4.4.0.30.","AGETOP",71268,"ELO FUSÍVEL 6 K","Un    ",1,null,null,null,""]
["S",3,"S",0,1,4,4,0,0,0,0,"F","Serviço","Serviço","1.4.4.0.31.","AGETOP",71321,"FITA DE AUTO FUSAO, ROLO E 10,00 MM","Un    ",5,null,null,null,""]
["S",3,"S",0,1,4,4,0,0,0,0,"F","Serviço","Serviço","1.4.4.0.32.","AGETOP",71365,"GRAMPO DE ANCORAGEM POLIMÉRICO","un    ",3,null,null,null,""]
["S",3,"S",0,1,4,4,0,0,0,0,"F","Serviço","Serviço","1.4.4.0.33.","AGETOP",71381,"HASTE REV.COBRE(COPPERWELD)  5/8\" X 3,00 M C/CONECTOR","Un    ",4,null,null,null,""]
["S",3,"S",0,1,4,4,0,0,0,0,"F","Serviço","Serviço","1.4.4.0.34.","AGETOP",71463,"ISOLADOR EPOXI 50X40 (BUJAO)","Un    ",2,null,null,null,""]
["S",3,"S",0,1,4,4,0,0,0,0,"F","Serviço","Serviço","1.4.4.0.35.","AGETOP",71476,"ISOLADOR DE ANCORAGEM POLIMÉRICO 15KV","un    ",1,null,null,null,""]
["S",3,"S",0,1,4,4,0,0,0,0,"F","Serviço","Serviço","1.4.4.0.36.","AGETOP",71510,"LACO PREFORMADO DE DISTRIBUICAO","Un    ",1,null,null,null,""]
["S",3,"S",0,1,4,4,0,0,0,0,"F","Serviço","Serviço","1.4.4.0.37.","AGETOP",71742,"LUVA PVC ROSQUEAVEL DIAMETRO 1\"","Un    ",1,null,null,null,""]
["S",3,"S",0,1,4,4,0,0,0,0,"F","Serviço","Serviço","1.4.4.0.38.","SINAPI",93015,"LUVA PARA ELETRODUTO, PVC, ROSCÁVEL, DN 75 MM (2 1/2\") - FORNECIMENTO E INSTALAÇÃO. AF_12/2015","UN",1,null,null,null,""]
["S",3,"S",0,1,4,4,0,0,0,0,"F","Serviço","Serviço","1.4.4.0.39.","AGETOP",71706,"LUVA  EM AÇO GALVANIZADO DIÂMETRO 2.1/2\"","Un    ",2,null,null,null,""]
["S",3,"S",0,1,4,4,0,0,0,0,"F","Serviço","Serviço","1.4.4.0.40.","AGETOP",71750,"MANILHA-SAPATILHA EM AÇO GALVANIZADO","un    ",1,null,null,null,""]
["S",3,"S",0,1,4,4,0,0,0,0,"F","Serviço","Serviço","1.4.4.0.41.","AGETOP",71761,"MURETA MEDIÇÃO ALVEN. 1 1/2 V.(35CM) REBOC.C/PINTURA ACRÍL. E LAJE CONC. 20MPA MALHA 8.0MM CADA 10CM REVEST.C/ARGAMASSA 1:3 C/ IMPERMEABILIZANTE","m2    ",4,null,null,null,""]
["S",3,"S",0,1,4,4,0,0,0,0,"F","Serviço","Serviço","1.4.4.0.42.","AGETOP",71791,"NIPLE DUPLO FERRO GALVANIZADO 2\"","Un    ",1,null,null,null,""]
["S",3,"S",0,1,4,4,0,0,0,0,"F","Serviço","Serviço","1.4.4.0.43.","AGETOP",71776,"NIPLE METALICO Fo.Zo. DIAMETRO 2.1/2\"","Un    ",1,null,null,null,""]
["S",3,"S",0,1,4,4,0,0,0,0,"F","Serviço","Serviço","1.4.4.0.44.","AGETOP",71795,"OLHAL PARA PARAFUSO","un    ",3,null,null,null,""]
["S",3,"S",0,1,4,4,0,0,0,0,"F","Serviço","Serviço","1.4.4.0.45.","AGETOP",71835,"PARAFUSO CABEÇA ABAULADA (FRANCES) M16 X 45 MM","Un    ",3,null,null,null,""]
["S",3,"S",0,1,4,4,0,0,0,0,"F","Serviço","Serviço","1.4.4.0.46.","AGETOP",71841,"PARAFUSO CABEÇA ABAULADA (FRANCES) M16 X 150 MM","Un    ",3,null,null,null,""]
["S",3,"S",0,1,4,4,0,0,0,0,"F","Serviço","Serviço","1.4.4.0.47.","AGETOP",71833,"PARA RAIOS DISTRIBUIDOR POLIMÉRICO ÓXIDO DE ZINCO S/CENTELHADOR C/ DESLIGAMENTO AUTOMÁTICO 15KV,10KA","Un    ",3,null,null,null,""]
["S",3,"S",0,1,4,4,0,0,0,0,"F","Serviço","Serviço","1.4.4.0.48.","AGETOP",71997,"POSTE - FUNDAÇÃO EM CONCRETO SIMPLES DA BASE DOS POSTES 11/600 PARA TRAFO ( DIAM. 1000MM)","m     ",0.3,null,null,null,""]
["S",3,"S",0,1,4,4,0,0,0,0,"F","Serviço","Serviço","1.4.4.0.49.","AGETOP",72061,"POSTE DE CONCRETO SC 11/600 - SEM FUNDAÇÃO/CONCRETO","Un    ",1,null,null,null,""]
["S",3,"S",0,1,4,4,0,0,0,0,"F","Serviço","Serviço","1.4.4.0.50.","AGETOP",72080,"POSTE/TRAFO - CAMINHÃO MUNCK 12 TON. (MÍNIMO 4H/DIA)","H     ",4,null,null,null,""]
["S",3,"S",0,1,4,4,0,0,0,0,"F","Serviço","Serviço","1.4.4.0.51.","AGETOP",72329,"SAPATILHA DE AÇO GALVANIZADO PARA POSTE COM TRANSFORMADOR","un    ",3,null,null,null,""]
["S",3,"S",0,1,4,4,0,0,0,0,"F","Serviço","Serviço","1.4.4.0.52.","SINAPI",73624,"SUPORTE PARA TRANSFORMADOR EM POSTE DE CONCRETO CIRCULAR","UN",2,null,null,null,""]
["S",3,"S",0,1,4,4,0,0,0,0,"F","Serviço","Serviço","1.4.4.0.53.","AGETOP",72518,"TERMINAL DE PRESSAO 10 MM2","Un    ",10,null,null,null,""]
["S",3,"S",0,1,4,4,0,0,0,0,"F","Serviço","Serviço","1.4.4.0.54.","AGETOP",72528,"TERMINAL DE PRESSAO 35 MM2","Un    ",10,null,null,null,""]
["S",3,"S",0,1,4,4,0,0,{"$f":"IF(OR($C211=\"S\",$C211=0),0,MATCH(0,OFFSET($D211,1,$C211,ROW($C$742)-ROW($C211)),0))","v":0},{"$f":"IF(OR($C211=\"S\",$C211=0),0,MATCH(OFFSET($D211,0,$C211)+1,OFFSET($D211,1,$C211,ROW($C$742)-ROW($C211)),0))","v":0},"F","Serviço","Serviço","1.4.4.0.55.","AGETOP",72535,"TERMINAL DE PRESSAO 70 MMM2","Un    ",8,null,null,null,""]
["S",3,"S",0,1,4,4,0,0,0,0,"F","Serviço","Serviço","1.4.4.0.56.","SINAPI","73857/2","TRANSFORMADOR DISTRIBUICAO  112,5KVA TRIFASICO 60HZ CLASSE 15KV IMERSO EM ÓLEO MINERAL FORNECIMENTO E INSTALACAO","UN",1,null,null,null,""]
["S",3,"S",0,1,4,4,0,0,0,0,"F","Serviço","Serviço","1.4.4.0.57.","SINAPI",88543,"ARMACAO SECUNDARIA OU REX COMPLETA PARA TRESLINHAS-FORNECIMENTO E INSTALACAO.","UN",1,null,null,null,""]
["S",3,"S",0,1,4,4,0,0,0,0,"F","Serviço","Serviço","1.4.4.0.58.","COMPOSIÇÃO","COMP 046_SEE","CAPUZ PARA PROTEÇÃO DOS PARA RAIOS","UN ",3,null,null,null,""]
["S",3,"S",0,1,4,4,0,0,0,0,"F","Serviço","Serviço","1.4.4.0.59.","COMPOSIÇÃO","COMP 047_SEE","CAPUZ DE PROTEÇÃO PARA BUCHA DE TRANSFORMADOR","UN ",3,null,null,null,""]
["S",3,"S",0,1,4,4,0,0,0,0,"F","Serviço","Serviço","1.4.4.0.60.","COMPOSIÇÃO","COMP 048_SEE","HASTE ROSQUEADA \"TIRANTE\" 3/8\"","M",0.5,null,null,null,""]
["S",3,"S",0,1,4,4,0,0,0,0,"F","Serviço","Serviço","1.4.4.0.61.","COMPOSIÇÃO","COMP 049_SEE","PORCA SEXTAVADA 3/8\"","UN ",8,null,null,null,""]
[{"$f":"CHOOSE(1+LOG(1+2*(ORÇAMENTO.Nivel=\"Nível 1\")+4*(ORÇAMENTO.Nivel=\"Nível 2\")+8*(ORÇAMENTO.Nivel=\"Nível 3\")+16*(ORÇAMENTO.Nivel=\"Nível 4\")+32*(ORÇAMENTO.Nivel=\"Serviço\"),2),0,1,2,3,4,\"S\")","v":2},{"$f":"IF(OR(C218=\"s\",C218=0),OFFSET(B218,-1,0),C218)","v":2},{"$f":"IF(OFFSET(C218,-1,0)=\"L\",1,IF(OFFSET(C218,-1,0)=1,2,IF(OR(A218=\"s\",A218=0),\"S\",IF(AND(OFFSET(C218,-1,0)=2,A218=4),3,IF(AND(OR(OFFSET(C218,-1,0)=\"s\",OFFSET(C218,-1,0)=0),A218<>\"s\",A218>OFFSET(B218,-1,0)),OFFSET(B218,-1,0),A218)))))","v":2},{"$f":"IF(OR(C218=\"S\",C218=0),0,IF(ISERROR(K218),J218,SMALL(J218:K218,1)))","v":100},{"$f":"IF($C218=1,OFFSET(E218,-1,0)+1,OFFSET(E218,-1,0))","v":1},{"$f":"IF($C218=1,0,IF($C218=2,OFFSET(F218,-1,0)+1,OFFSET(F218,-1,0)))","v":5},{"$f":"IF(AND($C218<=2,$C218<>0),0,IF($C218=3,OFFSET(G218,-1,0)+1,OFFSET(G218,-1,0)))","v":0},{"$f":"IF(AND($C218<=3,$C218<>0),0,IF($C218=4,OFFSET(H218,-1,0)+1,OFFSET(H218,-1,0)))","v":0},{"$f":"IF(AND($C218<=4,$C218<>0),0,IF(AND($C218=\"S\",$W218>0),OFFSET(I218,-1,0)+1,OFFSET(I218,-1,0)))","v":0},289,100,"F","Nível 2","Nível 2","1.5.","AGETOP",null,"INSTALAÇÕES HIDROSSANITÁRIAS","-",null,null,null,null,""]
[3,3,3,24,1,5,1,0,0,99,24,"F","Nível 3","Nível 3","1.5.1.","SINAPI",null,"PEÇAS E ACESSÓRIOS","-",null,null,null,null,""]
[4,4,4,7,1,5,1,1,0,23,7,"F","Nível 4","Nível 4","1.5.1.1.","SINAPI",null,"VASO SANITÁRIO E ACESSÓRIOS","-",null,null,null,null,""]
["S",4,"S",0,1,5,1,1,0,0,0,"F","Serviço","Serviço","1.5.1.1.1.","SINAPI",95470,"VASO SANITARIO SIFONADO CONVENCIONAL COM LOUÇA BRANCA, INCLUSO CONJUNTO DE LIGAÇÃO PARA BACIA SANITÁRIA AJUSTÁVEL - FORNECIMENTO E INSTALAÇÃO. AF_10/2016","UN",4,null,null,null,"Referência: AGETOP - 80502"]
["S",4,"S",0,1,5,1,1,0,0,0,"F","Serviço","Serviço","1.5.1.1.2.","SINAPI",99635,"VÁLVULA DE DESCARGA METÁLICA, BASE 1 1/2 \", ACABAMENTO METALICO CROMADO - FORNECIMENTO E INSTALAÇÃO. AF_01/2019","UN",4,null,null,null,"Referência: AGETOP - 80515"]
["S",4,"S",0,1,5,1,1,0,0,0,"F","Serviço","Serviço","1.5.1.1.3.","AGETOP",80520,"CONJUNTO DE FIXACAO P/VASO SANITARIO (PAR)","CJ    ",4,null,null,null,""]
["S",4,"S",0,1,5,1,1,0,0,0,"F","Serviço","Serviço","1.5.1.1.4.","AGETOP",80513,"TUBO PARA VÁLVULA DE DESCARGA ( CURTO 1.1/4\" )","Un    ",4,null,null,null,""]
["S",4,"S",0,1,5,1,1,0,0,0,"F","Serviço","Serviço","1.5.1.1.5.","AGETOP",80510,"ANEL DE VEDAÇÃO PARA VASO SANITÁRIO","Un    ",4,null,null,null,""]
["S",4,"S",0,1,5,1,1,0,0,0,"F","Serviço","Serviço","1.5.1.1.6.","AGETOP",80526,"ASSENTO EM POLIPROPILENO COM SISTEMA DE FECHAMENTO SUAVE PARA VASO SANITÁRIO","Un    ",4,null,null,null,""]
[4,4,4,7,1,5,1,2,0,16,7,"F","Nível 4","Nível 4","1.5.1.2.","SINAPI",null,"LAVATÓRIO E ACESSÓRIOS","-",null,null,null,null,""]
["S",4,"S",0,1,5,1,2,0,0,0,"F","Serviço","Serviço","1.5.1.2.1.","AGETOP",80542,"LAVATÓRIO MÉDIO SEM COLUNA","Un    ",2,null,null,null,""]
["S",4,"S",0,1,5,1,2,0,0,0,"F","Serviço","Serviço","1.5.1.2.2.","AGETOP",80550,"FIXACAO P/LAVATORIO (PAR)","PAR   ",2,null,null,null,""]
["S",4,"S",0,1,5,1,2,0,0,0,"F","Serviço","Serviço","1.5.1.2.3.","AGETOP",80556,"LIGAÇÃO FLEXÍVEL PVC DIAM.1/2\" (ENGATE)","Un    ",4,null,null,null,""]
["S",4,"S",0,1,5,1,2,0,0,0,"F","Serviço","Serviço","1.5.1.2.4.","SINAPI",86883,"SIFÃO DO TIPO FLEXÍVEL EM PVC 1\u0094 X 1.1/2\u0094 - FORNECIMENTO E INSTALAÇÃO. AF_12/2013","UN",4,null,null,null,""]
["S",4,"S",0,1,5,1,2,0,0,0,"F","Serviço","Serviço","1.5.1.2.5.","SINAPI",86906,"TORNEIRA CROMADA DE MESA, 1/2\" OU 3/4\", PARA LAVATÓRIO, PADRÃO POPULAR - FORNECIMENTO E INSTALAÇÃO. AF_12/2013","UN",2,null,null,null,"Referência: AGETOP - 80570"]
["S",4,"S",0,1,5,1,2,0,0,0,"F","Serviço","Serviço","1.5.1.2.6.","SINAPI",86877,"VÁLVULA EM METAL CROMADO 1.1/2\" X 1.1/2\" PARA TANQUE OU LAVATÓRIO, COM OU SEM LADRÃO - FORNECIMENTO E INSTALAÇÃO. AF_12/2013","UN",2,null,null,null,""]
[4,4,4,3,1,5,1,3,0,9,3,"F","Nível 4","Nível 4","1.5.1.3.","SINAPI",null,"FILTRO E CHUVEIROS","-",null,null,null,null,""]
["S",4,"S",0,1,5,1,3,0,0,0,"F","Serviço","Serviço","1.5.1.3.1.","SINAPI",9535,"CHUVEIRO ELETRICO COMUM CORPO PLASTICO TIPO DUCHA, FORNECIMENTO E INSTALACAO","UN",1,null,null,null,""]
["S",4,"S",0,1,5,1,3,0,0,0,"F","Serviço","Serviço","1.5.1.3.2.","SINAPI",88571,"SABONETEIRA DE SOBREPOR (FIXADA NA PAREDE), TIPO CONCHA, EM ACO INOXIDAVEL - FORNECIMENTO E INSTALACAO","UN",1,null,null,null,"Referência: AGETOP - 80741"]
[4,4,4,6,1,5,1,4,0,6,31,"F","Nível 4","Nível 4","1.5.1.4.","SINAPI",null,"REGISTROS","-",null,null,null,null,""]
["S",4,"S",0,1,5,1,4,0,0,0,"F","Serviço","Serviço","1.5.1.4.1.","SINAPI",94500,"REGISTRO DE GAVETA BRUTO, LATÃO, ROSCÁVEL, 3\u0094, INSTALADO EM RESERVAÇÃO DE ÁGUA DE EDIFICAÇÃO QUE POSSUA RESERVATÓRIO DE FIBRA/FIBROCIMENTO \u0096 FORNECIMENTO E INSTALAÇÃO. AF_06/2016","UN",1,null,null,null,"Referência: AGETOP - 80910"]
["S",4,"S",0,1,5,1,4,0,0,0,"F","Serviço","Serviço","1.5.1.4.2.","SINAPI",89987,"REGISTRO DE GAVETA BRUTO, LATÃO, ROSCÁVEL, 3/4\", COM ACABAMENTO E CANOPLA CROMADOS. FORNECIDO E INSTALADO EM RAMAL DE ÁGUA. AF_12/2014","UN",2,null,null,null,"Referência: AGETOP - 80926"]
["S",4,"S",0,1,5,1,4,0,0,0,"F","Serviço","Serviço","1.5.1.4.3.","SINAPI",94495,"REGISTRO DE GAVETA BRUTO, LATÃO, ROSCÁVEL, 1\u0094, INSTALADO EM RESERVAÇÃO DE ÁGUA DE EDIFICAÇÃO QUE POSSUA RESERVATÓRIO DE FIBRA/FIBROCIMENTO \u0096 FORNECIMENTO E INSTALAÇÃO. AF_06/2016","UN",2,null,null,null,""]
["S",4,"S",0,1,5,1,4,0,0,0,"F","Serviço","Serviço","1.5.1.4.4.","SINAPI",94794,"REGISTRO DE GAVETA BRUTO, LATÃO, ROSCÁVEL, 1 1/2\u0094, COM ACABAMENTO E CANOPLA CROMADOS, INSTALADO EM RESERVAÇÃO DE ÁGUA DE EDIFICAÇÃO QUE POSSUA RESERVATÓRIO DE FIBRA/FIBROCIMENTO \u0096 FORNECIMENTO E INSTALAÇÃO. AF_06/2016","UN",2,null,null,null,"Referência: AGETOP - 80929"]
["S",4,"S",0,1,5,1,4,0,0,0,"F","Serviço","Serviço","1.5.1.4.5.","SINAPI",89984,"REGISTRO DE PRESSÃO BRUTO, LATÃO, ROSCÁVEL, 1/2\", COM ACABAMENTO E CANOPLA CROMADOS. FORNECIDO E INSTALADO EM RAMAL DE ÁGUA. AF_12/2014","UN",1,null,null,null,"Referência: AGETOP - 80946"]
[3,3,3,42,1,5,2,0,0,75,42,"F","Nível 3","Nível 3","1.5.2.","SINAPI",null,"ÁGUA FRIA","-",null,null,null,null,""]
[4,4,4,6,1,5,2,1,0,41,6,"F","Nível 4","Nível 4","1.5.2.1.","SINAPI",null,"TUBOS DE PVC SOLDÁVEL","-",null,null,null,null,""]
["S",4,"S",0,1,5,2,1,0,0,0,"F","Serviço","Serviço","1.5.2.1.1.","SINAPI",89402,"TUBO, PVC, SOLDÁVEL, DN 25MM, INSTALADO EM RAMAL DE DISTRIBUIÇÃO DE ÁGUA - FORNECIMENTO E INSTALAÇÃO. AF_12/2014","M",18,null,null,null,"Referência: AGETOP - 81003"]
["S",4,"S",0,1,5,2,1,0,0,0,"F","Serviço","Serviço","1.5.2.1.2.","SINAPI",89447,"TUBO, PVC, SOLDÁVEL, DN 32MM, INSTALADO EM PRUMADA DE ÁGUA - FORNECIMENTO E INSTALAÇÃO. AF_12/2014","M",108,null,null,null,""]
["S",4,"S",0,1,5,2,1,0,0,0,"F","Serviço","Serviço","1.5.2.1.3.","SINAPI",89449,"TUBO, PVC, SOLDÁVEL, DN 50MM, INSTALADO EM PRUMADA DE ÁGUA - FORNECIMENTO E INSTALAÇÃO. AF_12/2014","M",36,null,null,null,""]
[{"$f":"CHOOSE(1+LOG(1+2*(ORÇAMENTO.Nivel=\"Nível 1\")+4*(ORÇAMENTO.Nivel=\"Nível 2\")+8*(ORÇAMENTO.Nivel=\"Nível 3\")+16*(ORÇAMENTO.Nivel=\"Nível 4\")+32*(ORÇAMENTO.Nivel=\"Serviço\"),2),0,1,2,3,4,\"S\")","v":"S"},{"$f":"IF(OR(C248=\"s\",C248=0),OFFSET(B248,-1,0),C248)","v":4},{"$f":"IF(OFFSET(C248,-1,0)=\"L\",1,IF(OFFSET(C248,-1,0)=1,2,IF(OR(A248=\"s\",A248=0),\"S\",IF(AND(OFFSET(C248,-1,0)=2,A248=4),3,IF(AND(OR(OFFSET(C248,-1,0)=\"s\",OFFSET(C248,-1,0)=0),A248<>\"s\",A248>OFFSET(B248,-1,0)),OFFSET(B248,-1,0),A248)))))","v":"S"},{"$f":"IF(OR(C248=\"S\",C248=0),0,IF(ISERROR(K248),J248,SMALL(J248:K248,1)))","v":0},{"$f":"IF($C248=1,OFFSET(E248,-1,0)+1,OFFSET(E248,-1,0))","v":1},{"$f":"IF($C248=1,0,IF($C248=2,OFFSET(F248,-1,0)+1,OFFSET(F248,-1,0)))","v":5},{"$f":"IF(AND($C248<=2,$C248<>0),0,IF($C248=3,OFFSET(G248,-1,0)+1,OFFSET(G248,-1,0)))","v":2},{"$f":"IF(AND($C248<=3,$C248<>0),0,IF($C248=4,OFFSET(H248,-1,0)+1,OFFSET(H248,-1,0)))","v":1},{"$f":"IF(AND($C248<=4,$C248<>0),0,IF(AND($C248=\"S\",$W248>0),OFFSET(I248,-1,0)+1,OFFSET(I248,-1,0)))","v":0},0,0,"F","Serviço","Serviço","1.5.2.1.4.","SINAPI",89451,"TUBO, PVC, SOLDÁVEL, DN 75MM, INSTALADO EM PRUMADA DE ÁGUA - FORNECIMENTO E INSTALAÇÃO. AF_12/2014","M",24,null,null,null,""]
["S",4,"S",0,1,5,2,1,0,0,0,"F","Serviço","Serviço","1.5.2.1.5.","SINAPI",89452,"TUBO, PVC, SOLDÁVEL, DN 85MM, INSTALADO EM PRUMADA DE ÁGUA - FORNECIMENTO E INSTALAÇÃO. AF_12/2014","M",54,null,null,null,""]
[4,4,4,7,1,5,2,2,0,35,7,"F","Nível 4","Nível 4","1.5.2.2.","SINAPI",null,"ADAPTADORES DE PVC SOLDÁVEL","-",null,null,null,null,""]
["S",4,"S",0,1,5,2,2,0,0,0,"F","Serviço","Serviço","1.5.2.2.1.","SINAPI",89616,"ADAPTADOR CURTO COM BOLSA E ROSCA PARA REGISTRO, PVC, SOLDÁVEL, DN 85MM X 3\u0094, INSTALADO EM PRUMADA DE ÁGUA - FORNECIMENTO E INSTALAÇÃO. AF_12/2014","UN",2,null,null,null,""]
["S",4,"S",0,1,5,2,2,0,0,0,"F","Serviço","Serviço","1.5.2.2.2.","SINAPI",94714,"ADAPTADOR COM FLANGES LIVRES, PVC, SOLDÁVEL, DN 85 MM X 3 , INSTALADO EM RESERVAÇÃO DE ÁGUA DE EDIFICAÇÃO QUE POSSUA RESERVATÓRIO DE FIBRA/FIBROCIMENTO   FORNECIMENTO E INSTALAÇÃO. AF_06/2016","UN",1,null,null,null,"Referência: AGETOP - 81071"]
["S",4,"S",0,1,5,2,2,0,0,0,"F","Serviço","Serviço","1.5.2.2.3.","SINAPI",94709,"ADAPTADOR COM FLANGES LIVRES, PVC, SOLDÁVEL, DN 32 MM X 1 , INSTALADO EM RESERVAÇÃO DE ÁGUA DE EDIFICAÇÃO QUE POSSUA RESERVATÓRIO DE FIBRA/FIBROCIMENTO   FORNECIMENTO E INSTALAÇÃO. AF_06/2016","UN",2,null,null,null,""]
["S",4,"S",0,1,5,2,2,0,0,0,"F","Serviço","Serviço","1.5.2.2.4.","SINAPI",89553,"ADAPTADOR CURTO COM BOLSA E ROSCA PARA REGISTRO, PVC, SOLDÁVEL, DN 32MM X 1\u0094, INSTALADO EM PRUMADA DE ÁGUA - FORNECIMENTO E INSTALAÇÃO. AF_12/2014","UN",4,null,null,null,""]
[{"$f":"CHOOSE(1+LOG(1+2*(ORÇAMENTO.Nivel=\"Nível 1\")+4*(ORÇAMENTO.Nivel=\"Nível 2\")+8*(ORÇAMENTO.Nivel=\"Nível 3\")+16*(ORÇAMENTO.Nivel=\"Nível 4\")+32*(ORÇAMENTO.Nivel=\"Serviço\"),2),0,1,2,3,4,\"S\")","v":"S"},{"$f":"IF(OR(C255=\"s\",C255=0),OFFSET(B255,-1,0),C255)","v":4},{"$f":"IF(OFFSET(C255,-1,0)=\"L\",1,IF(OFFSET(C255,-1,0)=1,2,IF(OR(A255=\"s\",A255=0),\"S\",IF(AND(OFFSET(C255,-1,0)=2,A255=4),3,IF(AND(OR(OFFSET(C255,-1,0)=\"s\",OFFSET(C255,-1,0)=0),A255<>\"s\",A255>OFFSET(B255,-1,0)),OFFSET(B255,-1,0),A255)))))","v":"S"},{"$f":"IF(OR(C255=\"S\",C255=0),0,IF(ISERROR(K255),J255,SMALL(J255:K255,1)))","v":0},{"$f":"IF($C255=1,OFFSET(E255,-1,0)+1,OFFSET(E255,-1,0))","v":1},{"$f":"IF($C255=1,0,IF($C255=2,OFFSET(F255,-1,0)+1,OFFSET(F255,-1,0)))","v":5},{"$f":"IF(AND($C255<=2,$C255<>0),0,IF($C255=3,OFFSET(G255,-1,0)+1,OFFSET(G255,-1,0)))","v":2},{"$f":"IF(AND($C255<=3,$C255<>0),0,IF($C255=4,OFFSET(H255,-1,0)+1,OFFSET(H255,-1,0)))","v":2},{"$f":"IF(AND($C255<=4,$C255<>0),0,IF(AND($C255=\"S\",$W255>0),OFFSET(I255,-1,0)+1,OFFSET(I255,-1,0)))","v":0},0,0,"F","Serviço","Serviço","1.5.2.2.5.","SINAPI",89538,"ADAPTADOR CURTO COM BOLSA E ROSCA PARA REGISTRO, PVC, SOLDÁVEL, DN 25MM X 3/4\u0094, INSTALADO EM PRUMADA DE ÁGUA - FORNECIMENTO E INSTALAÇÃO. AF_12/2014","UN",3,null,null,null,""]
["S",4,"S",0,1,5,2,2,0,0,0,"F","Serviço","Serviço","1.5.2.2.6.","SINAPI",89596,"ADAPTADOR CURTO COM BOLSA E ROSCA PARA REGISTRO, PVC, SOLDÁVEL, DN 50MM X 1.1/2\u0094, INSTALADO EM PRUMADA DE ÁGUA - FORNECIMENTO E INSTALAÇÃO. AF_12/2014","UN",7,null,null,null,"Referência: AGETOP - 81069"]
[4,4,4,7,1,5,2,3,0,28,7,"F","Nível 4","Nível 4","1.5.2.3.","SINAPI",null,"LUVAS DE PVC","-",null,null,null,null,""]
["S",4,"S",0,1,5,2,3,0,0,0,"F","Serviço","Serviço","1.5.2.3.1.","SINAPI",89528,"LUVA, PVC, SOLDÁVEL, DN 25MM, INSTALADO EM PRUMADA DE ÁGUA - FORNECIMENTO E INSTALAÇÃO. AF_12/2014","UN",2,null,null,null,""]
["S",4,"S",0,1,5,2,3,0,0,0,"F","Serviço","Serviço","1.5.2.3.2.","SINAPI",89534,"LUVA SOLDÁVEL E COM ROSCA, PVC, SOLDÁVEL, DN 25MM X 3/4\u0094, INSTALADO EM PRUMADA DE ÁGUA - FORNECIMENTO E INSTALAÇÃO. AF_12/2014","UN",1,null,null,null,""]
["S",4,"S",0,1,5,2,3,0,0,0,"F","Serviço","Serviço","1.5.2.3.3.","SINAPI",89541,"LUVA, PVC, SOLDÁVEL, DN 32MM, INSTALADO EM PRUMADA DE ÁGUA - FORNECIMENTO E INSTALAÇÃO. AF_12/2014","UN",12,null,null,null,""]
["S",4,"S",0,1,5,2,3,0,0,0,"F","Serviço","Serviço","1.5.2.3.4.","SINAPI",89575,"LUVA, PVC, SOLDÁVEL, DN 50MM, INSTALADO EM PRUMADA DE ÁGUA - FORNECIMENTO E INSTALAÇÃO. AF_12/2014","UN",4,null,null,null,"Referência: AGETOP - 81105"]
["S",4,"S",0,1,5,2,3,0,0,0,"F","Serviço","Serviço","1.5.2.3.5.","SINAPI",89614,"LUVA, PVC, SOLDÁVEL, DN 85MM, INSTALADO EM PRUMADA DE ÁGUA - FORNECIMENTO E INSTALAÇÃO. AF_12/2014","UN",6,null,null,null,"Referência: AGETOP - 81107"]
["S",4,"S",0,1,5,2,3,0,0,0,"F","Serviço","Serviço","1.5.2.3.6.","SINAPI",89611,"LUVA, PVC, SOLDÁVEL, DN 75MM, INSTALADO EM PRUMADA DE ÁGUA - FORNECIMENTO E INSTALAÇÃO. AF_12/2014","UN",2,null,null,null,""]
[4,4,4,4,1,5,2,4,0,21,4,"F","Nível 4","Nível 4","1.5.2.4.","SINAPI",null,"BUCHAS","-",null,null,null,null,""]
["S",4,"S",0,1,5,2,4,0,0,0,"F","Serviço","Serviço","1.5.2.4.1.","AGETOP",81185,"BUCHA DE REDUÇÃO SOLDÁVEL LONGA 75 X 50 MM","un    ",3,null,null,null,"Referência: AGETOP - 81179"]
["S",4,"S",0,1,5,2,4,0,0,0,"F","Serviço","Serviço","1.5.2.4.2.","AGETOP",81167,"BUCHA DE REDUCAO SOLDAVEL CURTA 85 X 75 mm","Un    ",1,null,null,null,""]
["S",4,"S",0,1,5,2,4,0,0,0,"F","Serviço","Serviço","1.5.2.4.3.","AGETOP",81179,"BUCHA DE REDUCAO SOLDAVEL LONGA 50 X 25 mm","Un    ",2,null,null,null,""]
[4,4,4,8,1,5,2,5,0,17,8,"F","Nível 4","Nível 4","1.5.2.5.","SINAPI",null,"JOELHO","-",null,null,null,null,""]
["S",4,"S",0,1,5,2,5,0,0,0,"F","Serviço","Serviço","1.5.2.5.1.","SINAPI",89481,"JOELHO 90 GRAUS, PVC, SOLDÁVEL, DN 25MM, INSTALADO EM PRUMADA DE ÁGUA - FORNECIMENTO E INSTALAÇÃO. AF_12/2014","UN",7,null,null,null,""]
["S",4,"S",0,1,5,2,5,0,0,0,"F","Serviço","Serviço","1.5.2.5.2.","SINAPI",89492,"JOELHO 90 GRAUS, PVC, SOLDÁVEL, DN 32MM, INSTALADO EM PRUMADA DE ÁGUA - FORNECIMENTO E INSTALAÇÃO. AF_12/2014","UN",9,null,null,null,""]
["S",4,"S",0,1,5,2,5,0,0,0,"F","Serviço","Serviço","1.5.2.5.3.","SINAPI",89501,"JOELHO 90 GRAUS, PVC, SOLDÁVEL, DN 50MM, INSTALADO EM PRUMADA DE ÁGUA - FORNECIMENTO E INSTALAÇÃO. AF_12/2014","UN",12,null,null,null,""]
["S",4,"S",0,1,5,2,5,0,0,0,"F","Serviço","Serviço","1.5.2.5.4.","SINAPI",89521,"JOELHO 90 GRAUS, PVC, SOLDÁVEL, DN 85MM, INSTALADO EM PRUMADA DE ÁGUA - FORNECIMENTO E INSTALAÇÃO. AF_12/2014","UN",3,null,null,null,"Referência: AGETOP - 81326"]
["S",4,"S",0,1,5,2,5,0,0,0,"F","Serviço","Serviço","1.5.2.5.5.","SINAPI",89493,"JOELHO 45 GRAUS, PVC, SOLDÁVEL, DN 32MM, INSTALADO EM PRUMADA DE ÁGUA - FORNECIMENTO E INSTALAÇÃO. AF_12/2014","UN",2,null,null,null,""]
["S",4,"S",0,1,5,2,5,0,0,0,"F","Serviço","Serviço","1.5.2.5.6.","SINAPI",89513,"JOELHO 90 GRAUS, PVC, SOLDÁVEL, DN 75MM, INSTALADO EM PRUMADA DE ÁGUA - FORNECIMENTO E INSTALAÇÃO. AF_12/2014","UN",2,null,null,null,""]
["S",4,"S",0,1,5,2,5,0,{"$f":"IF(OR($C275=\"S\",$C275=0),0,MATCH(0,OFFSET($D275,1,$C275,ROW($C$742)-ROW($C275)),0))","v":0},{"$f":"IF(OR($C275=\"S\",$C275=0),0,MATCH(OFFSET($D275,0,$C275)+1,OFFSET($D275,1,$C275,ROW($C$742)-ROW($C275)),0))","v":0},"F","Serviço","Serviço","1.5.2.5.7.","SINAPI",90373,"JOELHO 90 GRAUS COM BUCHA DE LATÃO, PVC, SOLDÁVEL, DN 25MM, X 1/2\u0094 INSTALADO EM RAMAL OU SUB-RAMAL DE ÁGUA - FORNECIMENTO E INSTALAÇÃO. AF_12/2014","UN",3,null,null,null,""]
[4,4,4,6,1,5,2,6,0,9,6,"F","Nível 4","Nível 4","1.5.2.6.","SINAPI",null,"TÊ","-",null,null,null,null,""]
["S",4,"S",0,1,5,2,6,0,0,0,"F","Serviço","Serviço","1.5.2.6.1.","SINAPI",89617,"TE, PVC, SOLDÁVEL, DN 25MM, INSTALADO EM PRUMADA DE ÁGUA - FORNECIMENTO E INSTALAÇÃO. AF_12/2014","UN",1,null,null,null,""]
["S",4,"S",0,1,5,2,6,0,0,0,"F","Serviço","Serviço","1.5.2.6.2.","SINAPI",89620,"TE, PVC, SOLDÁVEL, DN 32MM, INSTALADO EM PRUMADA DE ÁGUA - FORNECIMENTO E INSTALAÇÃO. AF_12/2014","UN",1,null,null,null,""]
["S",4,"S",0,1,5,2,6,0,0,0,"F","Serviço","Serviço","1.5.2.6.3.","SINAPI",89627,"TÊ DE REDUÇÃO, PVC, SOLDÁVEL, DN 50MM X 25MM, INSTALADO EM PRUMADA DE ÁGUA - FORNECIMENTO E INSTALAÇÃO. AF_12/2014","UN",1,null,null,null,""]
["S",4,"S",0,1,5,2,6,0,0,0,"F","Serviço","Serviço","1.5.2.6.4.","SINAPI",89625,"TE, PVC, SOLDÁVEL, DN 50MM, INSTALADO EM PRUMADA DE ÁGUA - FORNECIMENTO E INSTALAÇÃO. AF_12/2014","UN",4,null,null,null,""]
["S",4,"S",0,1,5,2,6,0,0,0,"F","Serviço","Serviço","1.5.2.6.5.","SINAPI",89630,"TE DE REDUÇÃO, PVC, SOLDÁVEL, DN 75MM X 50MM, INSTALADO EM PRUMADA DE ÁGUA - FORNECIMENTO E INSTALAÇÃO. AF_12/2014","UN",1,null,null,null,""]
[4,4,4,3,1,5,2,7,0,3,{"$error":"#N/A"},"F","Nível 4","Nível 4","1.5.2.7.","SINAPI",null,"ADESIVOS","-",null,null,null,null,""]
["S",4,"S",0,1,5,2,7,0,0,0,"F","Serviço","Serviço","1.5.2.7.1.","AGETOP",81501,"ADESIVO PLASTICO - FRASCO 850 G","Un    ",3,null,null,null,""]
["S",4,"S",0,1,5,2,7,0,0,0,"F","Serviço","Serviço","1.5.2.7.2.","AGETOP",81504,"SOLUCAO LIMPADORA 1000 CM3","Un    ",3,null,null,null,""]
[3,3,3,25,1,5,3,0,0,33,25,"F","Nível 3","Nível 3","1.5.3.","SINAPI",null,"ESGOTO SANITÁRIO","-",null,null,null,null,""]
[4,4,4,4,1,5,3,1,0,24,4,"F","Nível 4","Nível 4","1.5.3.1.","SINAPI",null,"CORPO DE CAIXA SIFONADA / RALO","-",null,null,null,null,""]
["S",4,"S",0,1,5,3,1,0,0,0,"F","Serviço","Serviço","1.5.3.1.1.","AGETOP",81661,"CORPO CX. SIFONADA DIAM. 100 X 100 X 50","Un    ",2,null,null,null,""]
["S",4,"S",0,1,5,3,1,0,0,0,"F","Serviço","Serviço","1.5.3.1.2.","AGETOP",81760,"GRELHA QUADRADA ACO INOX SIMP. DIAM. 100 MM","Un    ",3,null,null,null,""]
["S",4,"S",0,1,5,3,1,0,0,0,"F","Serviço","Serviço","1.5.3.1.3.","AGETOP",81691,"CORPO RALO SIFONADO QUADRADO 100 X 53 X 40","Un    ",1,null,null,null,""]
[4,4,4,3,1,5,3,2,0,20,3,"F","Nível 4","Nível 4","1.5.3.2.","SINAPI",null,"CURVAS","-",null,null,null,null,""]
["S",4,"S",0,1,5,3,2,0,0,0,"F","Serviço","Serviço","1.5.3.2.1.","SINAPI",89728,"CURVA CURTA 90 GRAUS, PVC, SERIE NORMAL, ESGOTO PREDIAL, DN 40 MM, JUNTA SOLDÁVEL, FORNECIDO E INSTALADO EM RAMAL DE DESCARGA OU RAMAL DE ESGOTO SANITÁRIO. AF_12/2014","UN",2,null,null,null,""]
["S",4,"S",0,1,5,3,2,0,0,0,"F","Serviço","Serviço","1.5.3.2.2.","SINAPI",89812,"CURVA LONGA 90 GRAUS, PVC, SERIE NORMAL, ESGOTO PREDIAL, DN 100 MM, JUNTA ELÁSTICA, FORNECIDO E INSTALADO EM PRUMADA DE ESGOTO SANITÁRIO OU VENTILAÇÃO. AF_12/2014","UN",2,null,null,null,""]
[4,4,4,5,1,5,3,3,0,17,5,"F","Nível 4","Nível 4","1.5.3.3.","SINAPI",null,"JOELHOS","-",null,null,null,null,""]
["S",4,"S",0,1,5,3,3,0,0,0,"F","Serviço","Serviço","1.5.3.3.1.","SINAPI",89726,"JOELHO 45 GRAUS, PVC, SERIE NORMAL, ESGOTO PREDIAL, DN 40 MM, JUNTA SOLDÁVEL, FORNECIDO E INSTALADO EM RAMAL DE DESCARGA OU RAMAL DE ESGOTO SANITÁRIO. AF_12/2014","UN",4,null,null,null,""]
["S",4,"S",0,1,5,3,3,0,0,0,"F","Serviço","Serviço","1.5.3.3.2.","SINAPI",89810,"JOELHO 45 GRAUS, PVC, SERIE NORMAL, ESGOTO PREDIAL, DN 100 MM, JUNTA ELÁSTICA, FORNECIDO E INSTALADO EM PRUMADA DE ESGOTO SANITÁRIO OU VENTILAÇÃO. AF_12/2014","UN",2,null,null,null,""]
["S",4,"S",0,1,5,3,3,0,0,0,"F","Serviço","Serviço","1.5.3.3.3.","AGETOP",81927,"JOELHO 90 GRAUS C/ANEL 40 mm ","Un    ",2,null,null,null,"Referência: AGETOP - 81927"]
["S",4,"S",0,1,5,3,3,0,0,0,"F","Serviço","Serviço","1.5.3.3.4.","SINAPI",89731,"JOELHO 90 GRAUS, PVC, SERIE NORMAL, ESGOTO PREDIAL, DN 50 MM, JUNTA ELÁSTICA, FORNECIDO E INSTALADO EM RAMAL DE DESCARGA OU RAMAL DE ESGOTO SANITÁRIO. AF_12/2014","UN",6,null,null,null,""]
[4,4,4,2,1,5,3,4,0,12,2,"F","Nível 4","Nível 4","1.5.3.4.","SINAPI",null,"JUNÇÕES","-",null,null,null,null,""]
["S",4,"S",0,1,5,3,4,0,0,0,"F","Serviço","Serviço","1.5.3.4.1.","AGETOP",81973,"JUNCAO SIMPLES DIAM. 100 X 50 MM","Un    ",1,null,null,null,""]
[4,4,4,4,1,5,3,5,0,10,4,"F","Nível 4","Nível 4","1.5.3.5.","SINAPI",null,"LUVAS","-",null,null,null,null,""]
["S",4,"S",0,1,5,3,5,0,0,0,"F","Serviço","Serviço","1.5.3.5.1.","SINAPI",89752,"LUVA SIMPLES, PVC, SERIE NORMAL, ESGOTO PREDIAL, DN 40 MM, JUNTA SOLDÁVEL, FORNECIDO E INSTALADO EM RAMAL DE DESCARGA OU RAMAL DE ESGOTO SANITÁRIO. AF_12/2014","UN",2,null,null,null,"Referência: AGETOP - 82001"]
["S",4,"S",0,1,5,3,5,0,0,0,"F","Serviço","Serviço","1.5.3.5.2.","SINAPI",89753,"LUVA SIMPLES, PVC, SERIE NORMAL, ESGOTO PREDIAL, DN 50 MM, JUNTA ELÁSTICA, FORNECIDO E INSTALADO EM RAMAL DE DESCARGA OU RAMAL DE ESGOTO SANITÁRIO. AF_12/2014","UN",2,null,null,null,"Referência: AGETOP - 82002"]
["S",4,"S",0,1,5,3,5,0,0,0,"F","Serviço","Serviço","1.5.3.5.3.","SINAPI",89778,"LUVA SIMPLES, PVC, SERIE NORMAL, ESGOTO PREDIAL, DN 100 MM, JUNTA ELÁSTICA, FORNECIDO E INSTALADO EM RAMAL DE DESCARGA OU RAMAL DE ESGOTO SANITÁRIO. AF_12/2014","UN",10,null,null,null,"Referência: AGETOP - 82004"]
[4,4,4,2,1,5,3,6,0,6,2,"F","Nível 4","Nível 4","1.5.3.6.","SINAPI",null,"TÊ","-",null,null,null,null,""]
["S",4,"S",0,1,5,3,6,0,0,0,"F","Serviço","Serviço","1.5.3.6.1.","SINAPI",89825,"TE, PVC, SERIE NORMAL, ESGOTO PREDIAL, DN 50 X 50 MM, JUNTA ELÁSTICA, FORNECIDO E INSTALADO EM PRUMADA DE ESGOTO SANITÁRIO OU VENTILAÇÃO. AF_12/2014","UN",2,null,null,null,""]
[4,4,4,4,1,5,3,7,0,4,{"$error":"#N/A"},"F","Nível 4","Nível 4","1.5.3.7.","SINAPI",null,"TUBOS","-",null,null,null,null,""]
["S",4,"S",0,1,5,3,7,0,0,0,"F","Serviço","Serviço","1.5.3.7.1.","SINAPI",89711,"TUBO PVC, SERIE NORMAL, ESGOTO PREDIAL, DN 40 MM, FORNECIDO E INSTALADO EM RAMAL DE DESCARGA OU RAMAL DE ESGOTO SANITÁRIO. AF_12/2014","M",12,null,null,null,"Referência: AGETOP - 82301"]
["S",4,"S",0,1,5,3,7,0,0,0,"F","Serviço","Serviço","1.5.3.7.2.","SINAPI",89798,"TUBO PVC, SERIE NORMAL, ESGOTO PREDIAL, DN 50 MM, FORNECIDO E INSTALADO EM PRUMADA DE ESGOTO SANITÁRIO OU VENTILAÇÃO. AF_12/2014","M",18,null,null,null,""]
["S",4,"S",0,1,5,3,7,0,0,0,"F","Serviço","Serviço","1.5.3.7.3.","SINAPI",89800,"TUBO PVC, SERIE NORMAL, ESGOTO PREDIAL, DN 100 MM, FORNECIDO E INSTALADO EM PRUMADA DE ESGOTO SANITÁRIO OU VENTILAÇÃO. AF_12/2014","M",126,null,null,null,""]
[3,3,3,8,1,5,4,0,0,8,123,"F","Nível 3","Nível 3","1.5.4.","SINAPI",null,"EXTRAS","-",null,null,null,null,""]
["S",3,"S",0,1,5,4,0,0,0,0,"F","Serviço","Serviço","1.5.4.0.1.","SINAPI",97902,"CAIXA ENTERRADA HIDRÁULICA RETANGULAR EM ALVENARIA COM TIJOLOS CERÂMICOS MACIÇOS, DIMENSÕES INTERNAS: 0,6X0,6X0,6 M PARA REDE DE ESGOTO. AF_05/2018","UN",2,null,null,null,"Referência: AGETOP - 81825"]
["S",3,"S",0,1,5,4,0,0,0,0,"F","Serviço","Serviço","1.5.4.0.2.","AGETOP",81828,"CAIXA DE AREIA 60X60CM FUNDO DE BRITA COM GRELHA METÁLICA FERRO CHATO PADRÃO GOINFRA","Un    ",4,null,null,null,"Referência: AGETOP - 81852"]
["S",3,"S",0,1,5,4,0,0,0,0,"F","Serviço","Serviço","1.5.4.0.3.","SINAPI",6171,"TAMPA DE CONCRETO ARMADO 60X60X5CM PARA CAIXA","UN",2,null,null,null,""]
["S",3,"S",0,1,5,4,0,0,0,0,"F","Serviço","Serviço","1.5.4.0.4.","AGETOP",180323,"GRELHA PADRÃO GOINFRA DE FERRO CHATO COM BERÇO (ESPAÇAMENTO ENTRE FACES = 1,5CM - NBR 9050 ACESSIBILIDADE)","m2    ",4.5,null,null,null,""]
["S",3,"S",0,1,5,4,0,0,0,0,"F","Serviço","Serviço","1.5.4.0.5.","AGETOP",271417,"CANALETA CONCRETO DESEMPENADO 5 CM PD.GOINFRA","m     ",11.2,null,null,null,""]
["S",3,"S",0,1,5,4,0,0,0,0,"F","Serviço","Serviço","1.5.4.0.6.","AGETOP",81882,"RES.METALICO TAÇA AÇO PATINÁVEL-V=15M3-COL.SEC.H=6M+FUNDAÇÃO+LOGOTIPO","Un    ",1,null,null,null,""]
[{"$f":"CHOOSE(1+LOG(1+2*(ORÇAMENTO.Nivel=\"Nível 1\")+4*(ORÇAMENTO.Nivel=\"Nível 2\")+8*(ORÇAMENTO.Nivel=\"Nível 3\")+16*(ORÇAMENTO.Nivel=\"Nível 4\")+32*(ORÇAMENTO.Nivel=\"Serviço\"),2),0,1,2,3,4,\"S\")","v":"S"},{"$f":"IF(OR(C317=\"s\",C317=0),OFFSET(B317,-1,0),C317)","v":3},{"$f":"IF(OFFSET(C317,-1,0)=\"L\",1,IF(OFFSET(C317,-1,0)=1,2,IF(OR(A317=\"s\",A317=0),\"S\",IF(AND(OFFSET(C317,-1,0)=2,A317=4),3,IF(AND(OR(OFFSET(C317,-1,0)=\"s\",OFFSET(C317,-1,0)=0),A317<>\"s\",A317>OFFSET(B317,-1,0)),OFFSET(B317,-1,0),A317)))))","v":"S"},{"$f":"IF(OR(C317=\"S\",C317=0),0,IF(ISERROR(K317),J317,SMALL(J317:K317,1)))","v":0},{"$f":"IF($C317=1,OFFSET(E317,-1,0)+1,OFFSET(E317,-1,0))","v":1},{"$f":"IF($C317=1,0,IF($C317=2,OFFSET(F317,-1,0)+1,OFFSET(F317,-1,0)))","v":5},{"$f":"IF(AND($C317<=2,$C317<>0),0,IF($C317=3,OFFSET(G317,-1,0)+1,OFFSET(G317,-1,0)))","v":4},{"$f":"IF(AND($C317<=3,$C317<>0),0,IF($C317=4,OFFSET(H317,-1,0)+1,OFFSET(H317,-1,0)))","v":0},{"$f":"IF(AND($C317<=4,$C317<>0),0,IF(AND($C317=\"S\",$W317>0),OFFSET(I317,-1,0)+1,OFFSET(I317,-1,0)))","v":0},0,0,"F","Serviço","Serviço","1.5.4.0.7.","AGETOP",81883,"RES.METALICO TAÇA AÇO PATINÁVEL-V=20M3-COL.SEC.H=6M+FUNDAÇÃO+LOGOTIPO","un    ",1,null,null,null,""]
[{"$f":"CHOOSE(1+LOG(1+2*(ORÇAMENTO.Nivel=\"Nível 1\")+4*(ORÇAMENTO.Nivel=\"Nível 2\")+8*(ORÇAMENTO.Nivel=\"Nível 3\")+16*(ORÇAMENTO.Nivel=\"Nível 4\")+32*(ORÇAMENTO.Nivel=\"Serviço\"),2),0,1,2,3,4,\"S\")","v":2},2,2,67,1,6,0,0,0,189,67,"F","Nível 2","Nível 2","1.6.",null,null,"INSTALAÇÕES ESPECIAIS","-",null,null,null,null,""]
[{"$f":"CHOOSE(1+LOG(1+2*(ORÇAMENTO.Nivel=\"Nível 1\")+4*(ORÇAMENTO.Nivel=\"Nível 2\")+8*(ORÇAMENTO.Nivel=\"Nível 3\")+16*(ORÇAMENTO.Nivel=\"Nível 4\")+32*(ORÇAMENTO.Nivel=\"Serviço\"),2),0,1,2,3,4,\"S\")","v":3},3,3,28,1,6,1,0,0,66,28,"F","Nível 3","Nível 3","1.6.1.","SINAPI",null,"CENTRAL DE GÁS","-",null,null,null,null,""]
["S",3,"S",0,1,6,1,0,0,0,0,"F","Serviço","Serviço","1.6.1.0.1.","AGETOP",91007,"CENTRAL DE GÁS PADRÃO GOINFRA SEM INSTALAÇÕES (1+1 CILINDRO 45 KG)","Un    ",1,null,null,null,""]
["S",3,"S",0,1,6,1,0,0,0,0,"F","Serviço","Serviço","1.6.1.0.2.","AGETOP",91023,"UNIÃO S/BRONZE PRETA 3/4\" NPT 300 LBS","Un    ",3,null,null,null,""]
["S",3,"S",0,1,6,1,0,0,0,0,"F","Serviço","Serviço","1.6.1.0.3.","COMPOSIÇÃO","COMP 382_SEE","TE DE REDUCAO DE FERRO GALVANIZADO, COM ROSCA BSP, DE 3/4\" X 1/2\"","UN ",1,null,null,null,""]
["S",3,"S",0,1,6,1,0,0,0,0,"F","Serviço","Serviço","1.6.1.0.4.","COMPOSIÇÃO","COMP 383_SEE","BUCHA DE REDUCAO DE FERRO GALVANIZADO, COM ROSCA BSP, DE 1/2\" X 1/4\"","UN ",3,null,null,null,""]
["S",3,"S",0,1,6,1,0,0,0,0,"F","Serviço","Serviço","1.6.1.0.5.","AGETOP",91021,"LUVA GALVANIZADO DE REDUÇÃO 3/4\" X 1/2\" (GÁS)","Un    ",2,null,null,null,""]
["S",3,"S",0,1,6,1,0,0,0,0,"F","Serviço","Serviço","1.6.1.0.6.","SINAPI",92692,"NIPLE, EM FERRO GALVANIZADO, CONEXÃO ROSQUEADA, DN 15 (1/2\"), INSTALADO EM RAMAIS E SUB-RAMAIS DE GÁS - FORNECIMENTO E INSTALAÇÃO. AF_12/2015","UN",6,null,null,null,""]
["S",3,"S",0,1,6,1,0,0,0,0,"F","Serviço","Serviço","1.6.1.0.7.","AGETOP",91031,"NIPLE DUPLO 300 PSI 3/4\"","Un    ",6,null,null,null,""]
["S",3,"S",0,1,6,1,0,0,0,0,"F","Serviço","Serviço","1.6.1.0.8.","COMPOSIÇÃO","COMP 212_SEE","NIPLE DE REDUÇÃO 1/2\" X 1/4\" BSP","UN ",4,null,null,null,""]
["S",3,"S",0,1,6,1,0,0,0,0,"F","Serviço","Serviço","1.6.1.0.9.","COMPOSIÇÃO","COMP 213_SEE","NIPLE DE REDUÇÃO 3/4\" X 1/2\" BSP","UN ",4,null,null,null,""]
["S",3,"S",0,1,6,1,0,0,0,0,"F","Serviço","Serviço","1.6.1.0.10.","SINAPI",92688,"TUBO DE AÇO GALVANIZADO COM COSTURA, CLASSE MÉDIA, CONEXÃO ROSQUEADA, DN 20 (3/4\"), INSTALADO EM RAMAIS E SUB-RAMAIS DE GÁS - FORNECIMENTO E INSTALAÇÃO. AF_12/2015","M",9,null,null,null,""]
["S",3,"S",0,1,6,1,0,0,0,0,"F","Serviço","Serviço","1.6.1.0.11.","SINAPI",92701,"JOELHO 90 GRAUS, EM FERRO GALVANIZADO, CONEXÃO ROSQUEADA, DN 20 (3/4\"), INSTALADO EM RAMAIS E SUB-RAMAIS DE GÁS - FORNECIMENTO E INSTALAÇÃO. AF_12/2015","UN",4,null,null,null,""]
["S",3,"S",0,1,6,1,0,0,0,0,"F","Serviço","Serviço","1.6.1.0.12.","COMPOSIÇÃO","COMP 237_SEE","FITA ANTICORROSIVA","M",7,null,null,null,""]
["S",3,"S",0,1,6,1,0,0,0,0,"F","Serviço","Serviço","1.6.1.0.13.","AGETOP",91025,"VÁLVULA ESFERICA LATÃO 3/4\"","Un    ",3,null,null,null,""]
["S",3,"S",0,1,6,1,0,0,0,0,"F","Serviço","Serviço","1.6.1.0.14.","AGETOP",91019,"TE PRETO 90º 3/4\" NPT 300 LBS","Un    ",1,null,null,null,""]
["S",3,"S",0,1,6,1,0,0,0,0,"F","Serviço","Serviço","1.6.1.0.15.","COMPOSIÇÃO","COMP 542_SEE","VÁLVULA UGV 3/4\" (S) LATÃO","UN ",4,null,null,null,""]
["S",3,"S",0,1,6,1,0,0,0,0,"F","Serviço","Serviço","1.6.1.0.16.","COMPOSIÇÃO","COMP 543_SEE","VÁLVULA UGV 1/2\" (S) LATÃO","UN ",4,null,null,null,""]
["S",{"$f":"IF(OR(C336=\"s\",C336=0),OFFSET(B336,-1,0),C336)","v":3},{"$f":"IF(OFFSET(C336,-1,0)=\"L\",1,IF(OFFSET(C336,-1,0)=1,2,IF(OR(A336=\"s\",A336=0),\"S\",IF(AND(OFFSET(C336,-1,0)=2,A336=4),3,IF(AND(OR(OFFSET(C336,-1,0)=\"s\",OFFSET(C336,-1,0)=0),A336<>\"s\",A336>OFFSET(B336,-1,0)),OFFSET(B336,-1,0),A336)))))","v":"S"},{"$f":"IF(OR(C336=\"S\",C336=0),0,IF(ISERROR(K336),J336,SMALL(J336:K336,1)))","v":0},{"$f":"IF($C336=1,OFFSET(E336,-1,0)+1,OFFSET(E336,-1,0))","v":1},{"$f":"IF($C336=1,0,IF($C336=2,OFFSET(F336,-1,0)+1,OFFSET(F336,-1,0)))","v":6},{"$f":"IF(AND($C336<=2,$C336<>0),0,IF($C336=3,OFFSET(G336,-1,0)+1,OFFSET(G336,-1,0)))","v":1},{"$f":"IF(AND($C336<=3,$C336<>0),0,IF($C336=4,OFFSET(H336,-1,0)+1,OFFSET(H336,-1,0)))","v":0},0,0,0,"F","Serviço","Serviço","1.6.1.0.17.","AGETOP",91029,"VALVULA DE RETENÇÃO LATÃO 1/2\" X 7/16\" NPT","Un    ",4,null,null,null,""]
["S",3,"S",0,1,6,1,0,{"$f":"IF(AND($C337<=4,$C337<>0),0,IF(AND($C337=\"S\",$W337>0),OFFSET(I337,-1,0)+1,OFFSET(I337,-1,0)))","v":0},0,0,"F","Serviço","Serviço","1.6.1.0.18.","COMPOSIÇÃO","COMP 211_SEE","REGULADOR DE 2º ESTÁGIO 5KG/H","UN ",4,null,null,null,""]
["S",3,"S",0,1,6,1,0,0,0,0,"F","Serviço","Serviço","1.6.1.0.19.","COMPOSIÇÃO","COMP 210_SEE","REGULADOR DE 1º ESTÁGIO 60KG/H MODELO AP-40  COM MANÔMETRO","UN ",1,null,null,null,""]
["S",3,"S",0,1,6,1,0,0,{"$f":"IF(OR($C339=\"S\",$C339=0),0,MATCH(0,OFFSET($D339,1,$C339,ROW($C$742)-ROW($C339)),0))","v":0},{"$f":"IF(OR($C339=\"S\",$C339=0),0,MATCH(OFFSET($D339,0,$C339)+1,OFFSET($D339,1,$C339,ROW($C$742)-ROW($C339)),0))","v":0},"F","Serviço","Serviço","1.6.1.0.20.","AGETOP",85003,"EXTINTOR PO QUIMICO SECO (6 KG) - CAPACIDADE EXTINTORA 20 BC","Un    ",1,null,null,null,""]
["S",3,"S",0,1,6,1,0,0,0,0,"F","Serviço","Serviço","1.6.1.0.21.","COMPOSIÇÃO","COMP 235_SEE","PLACA DE SINALIZAÇÃO EM PVC COD 01 - (300X300) PROIBIDO FUMAR","UN ",2,null,null,null,""]
["S",3,"S",0,1,6,1,0,0,0,0,"F","Serviço","Serviço","1.6.1.0.22.","COMPOSIÇÃO","COMP 236_SEE","PLACA DE SINALIZAÇÃO EM PVC COD 06 - (300X300) PERIGO INFLAMÁVEL","UN ",2,null,null,null,""]
["S",3,"S",0,1,6,1,0,0,0,0,"F","Serviço","Serviço","1.6.1.0.23.","AGETOP",91043,"BRAÇADEIRA METALICA TIPO \"D\" DIAM. 3/4\"","Un    ",4,null,null,null,""]
["S",3,"S",0,1,6,1,0,0,0,0,"F","Serviço","Serviço","1.6.1.0.24.","AGETOP",71863,"PARAFUSO P/BUCHA S-10","Un    ",8,null,null,null,""]
["S",3,"S",0,1,6,1,0,0,0,0,"F","Serviço","Serviço","1.6.1.0.25.","AGETOP",70393,"BUCHA DE NYLON S-10","Un    ",8,null,null,null,""]
[{"$f":"CHOOSE(1+LOG(1+2*(ORÇAMENTO.Nivel=\"Nível 1\")+4*(ORÇAMENTO.Nivel=\"Nível 2\")+8*(ORÇAMENTO.Nivel=\"Nível 3\")+16*(ORÇAMENTO.Nivel=\"Nível 4\")+32*(ORÇAMENTO.Nivel=\"Serviço\"),2),0,1,2,3,4,\"S\")","v":"S"},{"$f":"IF(OR(C345=\"s\",C345=0),OFFSET(B345,-1,0),C345)","v":3},{"$f":"IF(OFFSET(C345,-1,0)=\"L\",1,IF(OFFSET(C345,-1,0)=1,2,IF(OR(A345=\"s\",A345=0),\"S\",IF(AND(OFFSET(C345,-1,0)=2,A345=4),3,IF(AND(OR(OFFSET(C345,-1,0)=\"s\",OFFSET(C345,-1,0)=0),A345<>\"s\",A345>OFFSET(B345,-1,0)),OFFSET(B345,-1,0),A345)))))","v":"S"},{"$f":"IF(OR(C345=\"S\",C345=0),0,IF(ISERROR(K345),J345,SMALL(J345:K345,1)))","v":0},{"$f":"IF($C345=1,OFFSET(E345,-1,0)+1,OFFSET(E345,-1,0))","v":1},{"$f":"IF($C345=1,0,IF($C345=2,OFFSET(F345,-1,0)+1,OFFSET(F345,-1,0)))","v":6},{"$f":"IF(AND($C345<=2,$C345<>0),0,IF($C345=3,OFFSET(G345,-1,0)+1,OFFSET(G345,-1,0)))","v":1},{"$f":"IF(AND($C345<=3,$C345<>0),0,IF($C345=4,OFFSET(H345,-1,0)+1,OFFSET(H345,-1,0)))","v":0},{"$f":"IF(AND($C345<=4,$C345<>0),0,IF(AND($C345=\"S\",$W345>0),OFFSET(I345,-1,0)+1,OFFSET(I345,-1,0)))","v":0},0,0,"F","Serviço","Serviço","1.6.1.0.26.","AGETOP",91045,"SUPORTE PARA COLETOR","Un    ",2,null,null,null,""]
[{"$f":"CHOOSE(1+LOG(1+2*(ORÇAMENTO.Nivel=\"Nível 1\")+4*(ORÇAMENTO.Nivel=\"Nível 2\")+8*(ORÇAMENTO.Nivel=\"Nível 3\")+16*(ORÇAMENTO.Nivel=\"Nível 4\")+32*(ORÇAMENTO.Nivel=\"Serviço\"),2),0,1,2,3,4,\"S\")","v":"S"},{"$f":"IF(OR(C346=\"s\",C346=0),OFFSET(B346,-1,0),C346)","v":3},{"$f":"IF(OFFSET(C346,-1,0)=\"L\",1,IF(OFFSET(C346,-1,0)=1,2,IF(OR(A346=\"s\",A346=0),\"S\",IF(AND(OFFSET(C346,-1,0)=2,A346=4),3,IF(AND(OR(OFFSET(C346,-1,0)=\"s\",OFFSET(C346,-1,0)=0),A346<>\"s\",A346>OFFSET(B346,-1,0)),OFFSET(B346,-1,0),A346)))))","v":"S"},{"$f":"IF(OR(C346=\"S\",C346=0),0,IF(ISERROR(K346),J346,SMALL(J346:K346,1)))","v":0},{"$f":"IF($C346=1,OFFSET(E346,-1,0)+1,OFFSET(E346,-1,0))","v":1},{"$f":"IF($C346=1,0,IF($C346=2,OFFSET(F346,-1,0)+1,OFFSET(F346,-1,0)))","v":6},{"$f":"IF(AND($C346<=2,$C346<>0),0,IF($C346=3,OFFSET(G346,-1,0)+1,OFFSET(G346,-1,0)))","v":1},{"$f":"IF(AND($C346<=3,$C346<>0),0,IF($C346=4,OFFSET(H346,-1,0)+1,OFFSET(H346,-1,0)))","v":0},{"$f":"IF(AND($C346<=4,$C346<>0),0,IF(AND($C346=\"S\",$W346>0),OFFSET(I346,-1,0)+1,OFFSET(I346,-1,0)))","v":0},0,0,"F","Serviço","Serviço","1.6.1.0.27.","COMPOSIÇÃO","COMP 045_SEE","LAUDO DE ESTANQUEIDADE","UN ",1,null,null,null,""]
[{"$f":"CHOOSE(1+LOG(1+2*(ORÇAMENTO.Nivel=\"Nível 1\")+4*(ORÇAMENTO.Nivel=\"Nível 2\")+8*(ORÇAMENTO.Nivel=\"Nível 3\")+16*(ORÇAMENTO.Nivel=\"Nível 4\")+32*(ORÇAMENTO.Nivel=\"Serviço\"),2),0,1,2,3,4,\"S\")","v":3},{"$f":"IF(OR(C347=\"s\",C347=0),OFFSET(B347,-1,0),C347)","v":3},{"$f":"IF(OFFSET(C347,-1,0)=\"L\",1,IF(OFFSET(C347,-1,0)=1,2,IF(OR(A347=\"s\",A347=0),\"S\",IF(AND(OFFSET(C347,-1,0)=2,A347=4),3,IF(AND(OR(OFFSET(C347,-1,0)=\"s\",OFFSET(C347,-1,0)=0),A347<>\"s\",A347>OFFSET(B347,-1,0)),OFFSET(B347,-1,0),A347)))))","v":3},{"$f":"IF(OR(C347=\"S\",C347=0),0,IF(ISERROR(K347),J347,SMALL(J347:K347,1)))","v":38},{"$f":"IF($C347=1,OFFSET(E347,-1,0)+1,OFFSET(E347,-1,0))","v":1},{"$f":"IF($C347=1,0,IF($C347=2,OFFSET(F347,-1,0)+1,OFFSET(F347,-1,0)))","v":6},{"$f":"IF(AND($C347<=2,$C347<>0),0,IF($C347=3,OFFSET(G347,-1,0)+1,OFFSET(G347,-1,0)))","v":2},{"$f":"IF(AND($C347<=3,$C347<>0),0,IF($C347=4,OFFSET(H347,-1,0)+1,OFFSET(H347,-1,0)))","v":0},{"$f":"IF(AND($C347<=4,$C347<>0),0,IF(AND($C347=\"S\",$W347>0),OFFSET(I347,-1,0)+1,OFFSET(I347,-1,0)))","v":0},38,43,"F","Nível 3","Nível 3","1.6.2.","SINAPI",null,"INSTALAÇÕES DE INCÊNDIO","-",null,null,null,null,""]
[{"$f":"CHOOSE(1+LOG(1+2*(ORÇAMENTO.Nivel=\"Nível 1\")+4*(ORÇAMENTO.Nivel=\"Nível 2\")+8*(ORÇAMENTO.Nivel=\"Nível 3\")+16*(ORÇAMENTO.Nivel=\"Nível 4\")+32*(ORÇAMENTO.Nivel=\"Serviço\"),2),0,1,2,3,4,\"S\")","v":"S"},{"$f":"IF(OR(C348=\"s\",C348=0),OFFSET(B348,-1,0),C348)","v":3},{"$f":"IF(OFFSET(C348,-1,0)=\"L\",1,IF(OFFSET(C348,-1,0)=1,2,IF(OR(A348=\"s\",A348=0),\"S\",IF(AND(OFFSET(C348,-1,0)=2,A348=4),3,IF(AND(OR(OFFSET(C348,-1,0)=\"s\",OFFSET(C348,-1,0)=0),A348<>\"s\",A348>OFFSET(B348,-1,0)),OFFSET(B348,-1,0),A348)))))","v":"S"},{"$f":"IF(OR(C348=\"S\",C348=0),0,IF(ISERROR(K348),J348,SMALL(J348:K348,1)))","v":0},{"$f":"IF($C348=1,OFFSET(E348,-1,0)+1,OFFSET(E348,-1,0))","v":1},{"$f":"IF($C348=1,0,IF($C348=2,OFFSET(F348,-1,0)+1,OFFSET(F348,-1,0)))","v":6},{"$f":"IF(AND($C348<=2,$C348<>0),0,IF($C348=3,OFFSET(G348,-1,0)+1,OFFSET(G348,-1,0)))","v":2},{"$f":"IF(AND($C348<=3,$C348<>0),0,IF($C348=4,OFFSET(H348,-1,0)+1,OFFSET(H348,-1,0)))","v":0},{"$f":"IF(AND($C348<=4,$C348<>0),0,IF(AND($C348=\"S\",$W348>0),OFFSET(I348,-1,0)+1,OFFSET(I348,-1,0)))","v":0},0,0,"F","Serviço","Serviço","1.6.2.0.1.","AGETOP",72338,"SIRENE METALICA ALCANCE 500 M","Un    ",1,null,null,null,""]
["S",3,"S",0,1,6,2,0,0,0,0,"F","Serviço","Serviço","1.6.2.0.2.","AGETOP",80910,"REGISTRO DE GAVETA BRUTO DIAMETRO 2.1/2\"","Un    ",2,null,null,null,""]
["S",3,"S",0,1,6,2,0,0,0,0,"F","Serviço","Serviço","1.6.2.0.3.","AGETOP",82379,"TUBO FERRO GALVANIZADO DIAM.2.1/2\"","m     ",390,null,null,null,""]
["S",3,"S",0,1,6,2,0,0,0,0,"F","Serviço","Serviço","1.6.2.0.4.","AGETOP",85003,"EXTINTOR PO QUIMICO SECO (6 KG) - CAPACIDADE EXTINTORA 20 BC","Un    ",2,null,null,null,""]
["S",3,"S",0,1,6,2,0,0,0,0,"F","Serviço","Serviço","1.6.2.0.5.","AGETOP",85006,"EXTINTOR MULTI USO EM PO A B C (6 KG) - CAPACIDADE EXTINTORA 3A 20BC","un    ",9,null,null,null,""]
["S",3,"S",0,1,6,2,0,0,0,0,"F","Serviço","Serviço","1.6.2.0.6.","AGETOP",85011,"CAIXA DE INCÊNDIO METÁLICA COM SUPORTE PARA MANGUEIRA, TAMPA E MURETA 17X60X90 CM C/PINTURA","Un    ",6,null,null,null,""]
["S",3,"S",0,1,6,2,0,0,0,0,"F","Serviço","Serviço","1.6.2.0.7.","AGETOP",85017,"MANGUEIRA DE INCÊNDIO D.I. = 38 MM TIPO 2 COMP. = 15 M","CJ    ",12,null,null,null,""]
["S",3,"S",0,1,6,2,0,0,0,0,"F","Serviço","Serviço","1.6.2.0.8.","AGETOP",85025,"ESGUICHO REGULÁVEL 1.1/2\"","Un    ",6,null,null,null,""]
["S",3,"S",0,1,6,2,0,0,0,0,"F","Serviço","Serviço","1.6.2.0.9.","AGETOP",85027,"ADAPTADOR P/ENGATE STORZ 2.1/2\" X 1.1/2\"","Un    ",7,null,null,null,""]
["S",3,"S",0,1,6,2,0,0,0,0,"F","Serviço","Serviço","1.6.2.0.10.","AGETOP",85031,"REGISTRO GLOBO ANGULAR 2.1/2\"","Un    ",6,null,null,null,""]
["S",3,"S",0,1,6,2,0,0,0,0,"F","Serviço","Serviço","1.6.2.0.11.","AGETOP",85035,"TAMPÃO CEGO COM CORRENTE 2.1/2\"","Un    ",7,null,null,null,""]
["S",3,"S",0,1,6,2,0,0,0,0,"F","Serviço","Serviço","1.6.2.0.12.","AGETOP",85037,"TANQUE DE PRESSÃO DE 10 L","Un    ",1,null,null,null,""]
["S",3,"S",0,1,6,2,0,0,0,0,"F","Serviço","Serviço","1.6.2.0.13.","AGETOP",85039,"PRESSOSTATO 50 A 80 PSI","Un    ",1,null,null,null,""]
["S",3,"S",0,1,6,2,0,0,0,0,"F","Serviço","Serviço","1.6.2.0.14.","AGETOP",85041,"MANOMETRO - 0 A 10 KG/CM2","Un    ",1,null,null,null,""]
["S",3,"S",0,1,6,2,0,0,0,0,"F","Serviço","Serviço","1.6.2.0.15.","AGETOP",85077,"VÁLVULA DE RETENÇÃO HORIZONTAL 2.1/2\"","Un    ",2,null,null,null,""]
["S",3,"S",0,1,6,2,0,0,0,0,"F","Serviço","Serviço","1.6.2.0.16.","COMPOSIÇÃO","COMP 017_SEE","REDUCAO GIRATÓRIA TIPO STORZ LATAO P/ INST. PREDIAL COMBATE A INCENDIO ENGATE RAPIDO 2.1/2\" X 1.1/2\"","UN ",6,null,null,null,""]
["S",3,"S",0,1,6,2,0,0,0,0,"F","Serviço","Serviço","1.6.2.0.17.","COMPOSIÇÃO","COMP 018_SEE","CHAVE DUPLA P/ CONEXÕES TIPO STORZ EM LATÃO ENGATE RÁPIDO 1 1/2\" X 2 1/2\"","UN ",6,null,null,null,""]
["S",3,"S",0,1,6,2,0,0,0,0,"F","Serviço","Serviço","1.6.2.0.18.","COMPOSIÇÃO","COMP 087_SEE","REGISTRO DE GAVETA COM HASTE ASCENDENTE DE BRONZE 2 1/2\"","UN ",1,null,null,null,""]
["S",3,"S",0,1,6,2,0,0,0,0,"F","Serviço","Serviço","1.6.2.0.19.","AGETOP",85056,"TÊ DE FERRO GALVANIZADO 90º X 2 1/2\"","un    ",12,null,null,null,""]
["S",3,"S",0,1,6,2,0,0,0,0,"F","Serviço","Serviço","1.6.2.0.20.","COMPOSIÇÃO","COMP 030_SEE","COTOVELO DE FERRO GALV. 90° X 2 1/2\"","UN ",34,null,null,null,""]
["S",3,"S",0,1,6,2,0,0,0,0,"F","Serviço","Serviço","1.6.2.0.21.","AGETOP",85065,"COTOVELO FERRO GALVANIZADO 45º X 2.1/2\"","Un    ",3,null,null,null,""]
["S",3,"S",0,1,6,2,0,0,0,0,"F","Serviço","Serviço","1.6.2.0.22.","COMPOSIÇÃO","COMP 077_SEE","UNIAO FERRO GALV C/ASSENTO CONICO BRONZE 2 1/2\"","UN ",6,null,null,null,""]
["S",3,"S",0,1,6,2,0,0,0,0,"F","Serviço","Serviço","1.6.2.0.23.","AGETOP",85047,"NIPLE DUPLO FERRO GALVANIZADO 2.1/2\"","Un    ",11,null,null,null,""]
["S",3,"S",0,1,6,2,0,0,0,0,"F","Serviço","Serviço","1.6.2.0.24.","COMPOSIÇÃO","COMP 076_SEE","CURVA FERRO GALVANIZADO 45G ROSCA MACHO/FEMEA REF. 2 1/2\"","UN ",1,null,null,null,""]
["S",3,"S",0,1,6,2,0,0,0,0,"F","Serviço","Serviço","1.6.2.0.25.","COMPOSIÇÃO","COMP 022_SEE","TAMPÃO FOFO 40X50CM C/INSCRIÇÃO ","UN ",1,null,null,null,""]
["S",3,"S",0,1,6,2,0,0,0,0,"F","Serviço","Serviço","1.6.2.0.26.","COMPOSIÇÃO","COMP 024_SEE","SINALIZADOR FOTOLUMINESCENTE PARA EXTINTOR","UN ",8,null,null,null,""]
["S",3,"S",0,1,6,2,0,0,0,0,"F","Serviço","Serviço","1.6.2.0.27.","COMPOSIÇÃO","COMP 186_SEE","BOTOEIRA BOMBA DE INCÊNDIO C/ MARTELO CONVENCIONAL/ ANALÓGICA","UN ",1,null,null,null,""]
["S",3,"S",0,1,6,2,0,0,0,0,"F","Serviço","Serviço","1.6.2.0.28.","COMPOSIÇÃO","COMP 188_SEE","ACIONADOR MANUAL DE ALARME","UN ",7,null,null,null,""]
["S",3,"S",0,1,6,2,0,0,0,0,"F","Serviço","Serviço","1.6.2.0.29.","COMPOSIÇÃO","COMP 190_SEE","CENTRAL DE DETECÇÃO E ALARME DE 40 SETORES COM BATERIA","UN ",1,null,null,null,""]
["S",3,"S",0,1,6,2,0,0,0,0,"F","Serviço","Serviço","1.6.2.0.30.","COMPOSIÇÃO","COMP 025_SEE","SINALIZADOR FOTOLUMINESCENTE DE EMERGÊNCIA","UN ",28,null,null,null,""]
["S",3,"S",0,1,6,2,0,0,0,0,"F","Serviço","Serviço","1.6.2.0.31.","COMPOSIÇÃO","COMP 277_SEE","MARCAÇÃO NO PISO - 1X1 M PARA EXTINTOR","M2",11,null,null,null,""]
["S",3,"S",0,1,6,2,0,0,0,0,"F","Serviço","Serviço","1.6.2.0.32.","AGETOP",71598,"LUMINÁRIA DE EMERGÊNCIA 30 LEDS","un    ",19,null,null,null,""]
["S",3,"S",0,1,6,2,0,0,0,0,"F","Serviço","Serviço","1.6.2.0.33.","COMPOSIÇÃO","COMP 040_SEE","CONJUNTO MOTOR-BOMBA ELÉTRICA TRIFÁSICO 380/220 V PARA VZ= 24,33 M³/H, HM= 46,24 M POTÊNCIA= 7,5 CV","UN ",1,null,null,null,""]
["S",3,"S",0,1,6,2,0,0,0,0,"F","Serviço","Serviço","1.6.2.0.34.","COMPOSIÇÃO","COMP 546_SEE","BUJÃO DE REBORDO 2.1/2\"","UN ",1,null,null,null,""]
["S",3,"S",0,1,6,2,0,0,0,0,"F","Serviço","Serviço","1.6.2.0.35.","COMPOSIÇÃO","COMP 548_SEE","VÁLVULA DE ESFERA BRUTA, METAL, ROSCÁVEL, 2.1/2\" - FORNECIMENTO E INSTALAÇÃO","UN ",1,null,null,null,""]
["S",3,"S",0,1,6,2,0,0,0,0,"F","Serviço","Serviço","1.6.2.0.36.","COMPOSIÇÃO","COMP 347_SEE","ADAPTADOR PVC SOLDAVEL, COM FLANGES LIVRES, 75 MM X 2 1/2\", PARA CAIXA D' AGUA","UN ",1,null,null,null,""]
["S",3,"S",0,1,6,2,0,0,0,0,"F","Serviço","Serviço","1.6.2.0.37.","AGETOP",70356,"BRACADEIRA METALICA TIPO \"U\" DIAM. 2.1/2\"","Un    ",25,null,null,null,""]
[{"$f":"CHOOSE(1+LOG(1+2*(ORÇAMENTO.Nivel=\"Nível 1\")+4*(ORÇAMENTO.Nivel=\"Nível 2\")+8*(ORÇAMENTO.Nivel=\"Nível 3\")+16*(ORÇAMENTO.Nivel=\"Nível 4\")+32*(ORÇAMENTO.Nivel=\"Serviço\"),2),0,1,2,3,4,\"S\")","v":2},{"$f":"IF(OR(C385=\"s\",C385=0),OFFSET(B385,-1,0),C385)","v":2},{"$f":"IF(OFFSET(C385,-1,0)=\"L\",1,IF(OFFSET(C385,-1,0)=1,2,IF(OR(A385=\"s\",A385=0),\"S\",IF(AND(OFFSET(C385,-1,0)=2,A385=4),3,IF(AND(OR(OFFSET(C385,-1,0)=\"s\",OFFSET(C385,-1,0)=0),A385<>\"s\",A385>OFFSET(B385,-1,0)),OFFSET(B385,-1,0),A385)))))","v":2},{"$f":"IF(OR(C385=\"S\",C385=0),0,IF(ISERROR(K385),J385,SMALL(J385:K385,1)))","v":7},{"$f":"IF($C385=1,OFFSET(E385,-1,0)+1,OFFSET(E385,-1,0))","v":1},{"$f":"IF($C385=1,0,IF($C385=2,OFFSET(F385,-1,0)+1,OFFSET(F385,-1,0)))","v":7},{"$f":"IF(AND($C385<=2,$C385<>0),0,IF($C385=3,OFFSET(G385,-1,0)+1,OFFSET(G385,-1,0)))","v":0},{"$f":"IF(AND($C385<=3,$C385<>0),0,IF($C385=4,OFFSET(H385,-1,0)+1,OFFSET(H385,-1,0)))","v":0},{"$f":"IF(AND($C385<=4,$C385<>0),0,IF(AND($C385=\"S\",$W385>0),OFFSET(I385,-1,0)+1,OFFSET(I385,-1,0)))","v":0},122,7,"F","Nível 2","Nível 2","1.7.","AGETOP",91045,"ALVENARIAS E DIVISÓRIAS","Un    ",null,null,null,null,""]
[{"$f":"CHOOSE(1+LOG(1+2*(ORÇAMENTO.Nivel=\"Nível 1\")+4*(ORÇAMENTO.Nivel=\"Nível 2\")+8*(ORÇAMENTO.Nivel=\"Nível 3\")+16*(ORÇAMENTO.Nivel=\"Nível 4\")+32*(ORÇAMENTO.Nivel=\"Serviço\"),2),0,1,2,3,4,\"S\")","v":3},{"$f":"IF(OR(C386=\"s\",C386=0),OFFSET(B386,-1,0),C386)","v":3},{"$f":"IF(OFFSET(C386,-1,0)=\"L\",1,IF(OFFSET(C386,-1,0)=1,2,IF(OR(A386=\"s\",A386=0),\"S\",IF(AND(OFFSET(C386,-1,0)=2,A386=4),3,IF(AND(OR(OFFSET(C386,-1,0)=\"s\",OFFSET(C386,-1,0)=0),A386<>\"s\",A386>OFFSET(B386,-1,0)),OFFSET(B386,-1,0),A386)))))","v":3},{"$f":"IF(OR(C386=\"S\",C386=0),0,IF(ISERROR(K386),J386,SMALL(J386:K386,1)))","v":2},{"$f":"IF($C386=1,OFFSET(E386,-1,0)+1,OFFSET(E386,-1,0))","v":1},{"$f":"IF($C386=1,0,IF($C386=2,OFFSET(F386,-1,0)+1,OFFSET(F386,-1,0)))","v":7},{"$f":"IF(AND($C386<=2,$C386<>0),0,IF($C386=3,OFFSET(G386,-1,0)+1,OFFSET(G386,-1,0)))","v":1},{"$f":"IF(AND($C386<=3,$C386<>0),0,IF($C386=4,OFFSET(H386,-1,0)+1,OFFSET(H386,-1,0)))","v":0},{"$f":"IF(AND($C386<=4,$C386<>0),0,IF(AND($C386=\"S\",$W386>0),OFFSET(I386,-1,0)+1,OFFSET(I386,-1,0)))","v":0},6,2,"F","Nível 3","Nível 3","1.7.1.","SINAPI",null,"AMPLIAÇÃO PASSARELA M2 - SEC. XXI - REV. 2015","-",null,null,null,null,""]
["S",3,"S",0,1,7,1,0,0,0,0,"F","Serviço","Serviço","1.7.1.0.1.","SINAPI",87520,"ALVENARIA DE VEDAÇÃO DE BLOCOS CERÂMICOS FURADOS NA HORIZONTAL DE 9X19X19CM (ESPESSURA 9CM) DE PAREDES COM ÁREA LÍQUIDA MAIOR OU IGUAL A 6M² COM VÃOS E ARGAMASSA DE ASSENTAMENTO COM PREPARO MANUAL. AF_06/2014","M2",9.6,null,null,null,"Referência: AGETOP - 100201"]
[3,3,3,2,1,7,2,0,0,4,2,"F","Nível 3","Nível 3","1.7.2.","SINAPI",null,"COZINHA, DESPENSA, CANTINA, DEP. MERENDA E SALA DE ESTUDOS","-",null,null,null,null,""]
["S",3,"S",0,1,7,2,0,0,0,0,"F","Serviço","Serviço","1.7.2.0.1.","SINAPI",87520,"ALVENARIA DE VEDAÇÃO DE BLOCOS CERÂMICOS FURADOS NA HORIZONTAL DE 9X19X19CM (ESPESSURA 9CM) DE PAREDES COM ÁREA LÍQUIDA MAIOR OU IGUAL A 6M² COM VÃOS E ARGAMASSA DE ASSENTAMENTO COM PREPARO MANUAL. AF_06/2014","M2",2.94,null,null,null,"Referência: AGETOP - 100201"]
[3,3,3,2,1,7,3,0,0,2,24,"F","Nível 3","Nível 3","1.7.3.","SINAPI",null,"VESTIÁRIO MASCULINO","-",null,null,null,null,""]
["S",3,"S",0,1,7,3,0,0,0,0,"F","Serviço","Serviço","1.7.3.0.1.","SINAPI",87520,"ALVENARIA DE VEDAÇÃO DE BLOCOS CERÂMICOS FURADOS NA HORIZONTAL DE 9X19X19CM (ESPESSURA 9CM) DE PAREDES COM ÁREA LÍQUIDA MAIOR OU IGUAL A 6M² COM VÃOS E ARGAMASSA DE ASSENTAMENTO COM PREPARO MANUAL. AF_06/2014","M2",7.1,null,null,null,"Referência: AGETOP - 100201"]
[{"$f":"CHOOSE(1+LOG(1+2*(ORÇAMENTO.Nivel=\"Nível 1\")+4*(ORÇAMENTO.Nivel=\"Nível 2\")+8*(ORÇAMENTO.Nivel=\"Nível 3\")+16*(ORÇAMENTO.Nivel=\"Nível 4\")+32*(ORÇAMENTO.Nivel=\"Serviço\"),2),0,1,2,3,4,\"S\")","v":2},{"$f":"IF(OR(C392=\"s\",C392=0),OFFSET(B392,-1,0),C392)","v":2},{"$f":"IF(OFFSET(C392,-1,0)=\"L\",1,IF(OFFSET(C392,-1,0)=1,2,IF(OR(A392=\"s\",A392=0),\"S\",IF(AND(OFFSET(C392,-1,0)=2,A392=4),3,IF(AND(OR(OFFSET(C392,-1,0)=\"s\",OFFSET(C392,-1,0)=0),A392<>\"s\",A392>OFFSET(B392,-1,0)),OFFSET(B392,-1,0),A392)))))","v":2},{"$f":"IF(OR(C392=\"S\",C392=0),0,IF(ISERROR(K392),J392,SMALL(J392:K392,1)))","v":3},{"$f":"IF($C392=1,OFFSET(E392,-1,0)+1,OFFSET(E392,-1,0))","v":1},{"$f":"IF($C392=1,0,IF($C392=2,OFFSET(F392,-1,0)+1,OFFSET(F392,-1,0)))","v":8},{"$f":"IF(AND($C392<=2,$C392<>0),0,IF($C392=3,OFFSET(G392,-1,0)+1,OFFSET(G392,-1,0)))","v":0},{"$f":"IF(AND($C392<=3,$C392<>0),0,IF($C392=4,OFFSET(H392,-1,0)+1,OFFSET(H392,-1,0)))","v":0},{"$f":"IF(AND($C392<=4,$C392<>0),0,IF(AND($C392=\"S\",$W392>0),OFFSET(I392,-1,0)+1,OFFSET(I392,-1,0)))","v":0},115,3,"F","Nível 2","Nível 2","1.8.",null,null,"ESTRUTURA DE MADEIRA","-",null,null,null,null,""]
[3,3,3,2,1,8,1,0,0,2,8,"F","Nível 3","Nível 3","1.8.1.","SINAPI",null,"GERAL","-",null,null,null,null,""]
["S",3,"S",0,1,8,1,0,0,0,0,"F","Serviço","Serviço","1.8.1.0.1.","SINAPI",92541,"TRAMA DE MADEIRA COMPOSTA POR RIPAS, CAIBROS E TERÇAS PARA TELHADOS DE ATÉ 2 ÁGUAS PARA TELHA CERÂMICA CAPA-CANAL, INCLUSO TRANSPORTE VERTICAL. AF_07/2019","M2",50,null,null,null,"Referência: AGETOP - 140202"]
[2,2,2,10,1,9,0,0,0,112,10,"F","Nível 2","Nível 2","1.9.",null,null,"COBERTURAS","-",null,null,null,null,""]
[3,3,3,5,1,9,1,0,0,9,5,"F","Nível 3","Nível 3","1.9.1.",null,null,"GERAL","-",null,null,null,null,""]
["S",3,"S",0,1,9,1,0,0,0,0,"F","Serviço","Serviço","1.9.1.0.1.","SINAPI",94445,"TELHAMENTO COM TELHA CERÂMICA CAPA-CANAL, TIPO PLAN, COM ATÉ 2 ÁGUAS, INCLUSO TRANSPORTE VERTICAL. AF_07/2019","M2",251,null,null,null,"Referência: AGETOP - 160401"]
["S",3,"S",0,1,9,1,0,0,0,0,"F","Serviço","Serviço","1.9.1.0.2.","SINAPI",94221,"CUMEEIRA PARA TELHA CERÂMICA EMBOÇADA COM ARGAMASSA TRAÇO 1:2:9 (CIMENTO, CAL E AREIA) PARA TELHADOS COM ATÉ 2 ÁGUAS, INCLUSO TRANSPORTE VERTICAL. AF_07/2019","M",51.39,null,null,null,""]
["S",3,"S",0,1,9,1,0,0,0,0,"F","Serviço","Serviço","1.9.1.0.3.","SINAPI",94224,"EMBOÇAMENTO COM ARGAMASSA TRAÇO 1:2:9 (CIMENTO, CAL E AREIA). AF_07/2019","M",122.26,null,null,null,"Referência: AGETOP - 160403"]
["S",3,"S",0,1,9,1,0,0,0,0,"F","Serviço","Serviço","1.9.1.0.4.","AGETOP",160901,"COBERTURA COM TELHA CANALETE 90 OU EQUIV. COM ACESSÓRIOS","m2    ",13,null,null,null,""]
[3,3,3,2,1,9,2,0,0,4,2,"F","Nível 3","Nível 3","1.9.2.",null,null,"AMPLIAÇÃO PASSARELA M2 - SEC. XXI - REV. 2015","-",null,null,null,null,""]
["S",3,"S",0,1,9,2,0,0,0,0,"F","Serviço","Serviço","1.9.2.0.1.","SINAPI",94228,"CALHA EM CHAPA DE AÇO GALVANIZADO NÚMERO 24, DESENVOLVIMENTO DE 50 CM, INCLUSO TRANSPORTE VERTICAL. AF_07/2019","M",7.2,null,null,null,"Referência: AGETOP - 160601"]
[3,3,3,2,1,9,3,0,0,{"$f":"IF(OR($C403=\"S\",$C403=0),0,MATCH(0,OFFSET($D403,1,$C403,ROW($C$742)-ROW($C403)),0))","v":2},{"$f":"IF(OR($C403=\"S\",$C403=0),0,MATCH(OFFSET($D403,0,$C403)+1,OFFSET($D403,1,$C403,ROW($C$742)-ROW($C403)),0))","v":11},"F","Nível 3","Nível 3","1.9.3.","SINAPI",null,"PÁTIO MULTIUSO","-",null,null,null,null,""]
["S",3,"S",0,1,9,3,0,0,0,0,"F","Serviço","Serviço","1.9.3.0.1.","SINAPI",94228,"CALHA EM CHAPA DE AÇO GALVANIZADO NÚMERO 24, DESENVOLVIMENTO DE 50 CM, INCLUSO TRANSPORTE VERTICAL. AF_07/2019","M",20.83,null,null,null,"Referência: AGETOP - 160601"]
[2,2,2,11,1,10,0,0,0,102,11,"F","Nível 2","Nível 2","1.10.",null,null,"ESQUADRIAS METÁLICAS","-",null,null,null,null,""]
[3,3,3,2,1,10,1,0,0,10,2,"F","Nível 3","Nível 3","1.10.1.","SINAPI",null,"GERAL","-",null,null,null,null,""]
["S",3,"S",0,1,10,1,0,0,0,0,"F","Serviço","Serviço","1.10.1.0.1.","COMPOSIÇÃO","COMP 083_SEE","CORRIMÃO PISO - SEDUC","M",1.52,null,null,null,""]
[3,3,3,2,1,10,2,0,0,8,2,"F","Nível 3","Nível 3","1.10.2.","SINAPI",null,"PASSARELA M2 - SEC. XXI - REV. 2015","-",null,null,null,null,""]
["S",3,"S",0,1,10,2,0,0,0,0,"F","Serviço","Serviço","1.10.2.0.1.","COMPOSIÇÃO","COMP 083_SEE","CORRIMÃO PISO - SEDUC","M",14.1,null,null,null,""]
[{"$f":"CHOOSE(1+LOG(1+2*(ORÇAMENTO.Nivel=\"Nível 1\")+4*(ORÇAMENTO.Nivel=\"Nível 2\")+8*(ORÇAMENTO.Nivel=\"Nível 3\")+16*(ORÇAMENTO.Nivel=\"Nível 4\")+32*(ORÇAMENTO.Nivel=\"Serviço\"),2),0,1,2,3,4,\"S\")","v":3},{"$f":"IF(OR(C410=\"s\",C410=0),OFFSET(B410,-1,0),C410)","v":3},{"$f":"IF(OFFSET(C410,-1,0)=\"L\",1,IF(OFFSET(C410,-1,0)=1,2,IF(OR(A410=\"s\",A410=0),\"S\",IF(AND(OFFSET(C410,-1,0)=2,A410=4),3,IF(AND(OR(OFFSET(C410,-1,0)=\"s\",OFFSET(C410,-1,0)=0),A410<>\"s\",A410>OFFSET(B410,-1,0)),OFFSET(B410,-1,0),A410)))))","v":3},{"$f":"IF(OR(C410=\"S\",C410=0),0,IF(ISERROR(K410),J410,SMALL(J410:K410,1)))","v":4},{"$f":"IF($C410=1,OFFSET(E410,-1,0)+1,OFFSET(E410,-1,0))","v":1},{"$f":"IF($C410=1,0,IF($C410=2,OFFSET(F410,-1,0)+1,OFFSET(F410,-1,0)))","v":10},{"$f":"IF(AND($C410<=2,$C410<>0),0,IF($C410=3,OFFSET(G410,-1,0)+1,OFFSET(G410,-1,0)))","v":3},{"$f":"IF(AND($C410<=3,$C410<>0),0,IF($C410=4,OFFSET(H410,-1,0)+1,OFFSET(H410,-1,0)))","v":0},{"$f":"IF(AND($C410<=4,$C410<>0),0,IF(AND($C410=\"S\",$W410>0),OFFSET(I410,-1,0)+1,OFFSET(I410,-1,0)))","v":0},6,4,"F","Nível 3","Nível 3","1.10.3.","SINAPI",null,"COZINHA, DESPENSA, CANTINA, DEP. MERENDA E SALA DE ESTUDOS","-",null,null,null,null,""]
["S",3,"S",0,1,10,3,0,0,0,0,"F","Serviço","Serviço","1.10.3.0.1.","SINAPI","73933/4","PORTA DE FERRO DE ABRIR TIPO BARRA CHATA, COM REQUADRO E GUARNICAO COMPLETA","M2",1.89,null,null,null,""]
["S",3,"S",0,1,10,3,0,0,0,0,"F","Serviço","Serviço","1.10.3.0.2.","SINAPI",94562,"JANELA DE AÇO DE CORRER, 4 FOLHAS, FIXAÇÃO COM ARGAMASSA, SEM VIDROS, PADRONIZADA. AF_07/2016","M2",6,null,null,null,"Referência: AGETOP - 180401"]
["S",3,"S",0,1,10,3,0,0,0,0,"F","Serviço","Serviço","1.10.3.0.3.","AGETOP",180208,"GRADE PROTECAO TIPO TIJOLINHO GP-1/GP-2","m2    ",7.92,null,null,null,""]
[3,3,3,2,1,10,4,0,0,2,19,"F","Nível 3","Nível 3","1.10.4.","SINAPI",null,"VESTIÁRIO MASCULINO","-",null,null,null,null,""]
["S",3,"S",0,1,10,4,0,0,0,0,"F","Serviço","Serviço","1.10.4.0.1.","SINAPI","73933/4","PORTA DE FERRO DE ABRIR TIPO BARRA CHATA, COM REQUADRO E GUARNICAO COMPLETA","M2",4,null,null,null,""]
[{"$f":"CHOOSE(1+LOG(1+2*(ORÇAMENTO.Nivel=\"Nível 1\")+4*(ORÇAMENTO.Nivel=\"Nível 2\")+8*(ORÇAMENTO.Nivel=\"Nível 3\")+16*(ORÇAMENTO.Nivel=\"Nível 4\")+32*(ORÇAMENTO.Nivel=\"Serviço\"),2),0,1,2,3,4,\"S\")","v":2},{"$f":"IF(OR(C416=\"s\",C416=0),OFFSET(B416,-1,0),C416)","v":2},{"$f":"IF(OFFSET(C416,-1,0)=\"L\",1,IF(OFFSET(C416,-1,0)=1,2,IF(OR(A416=\"s\",A416=0),\"S\",IF(AND(OFFSET(C416,-1,0)=2,A416=4),3,IF(AND(OR(OFFSET(C416,-1,0)=\"s\",OFFSET(C416,-1,0)=0),A416<>\"s\",A416>OFFSET(B416,-1,0)),OFFSET(B416,-1,0),A416)))))","v":2},{"$f":"IF(OR(C416=\"S\",C416=0),0,IF(ISERROR(K416),J416,SMALL(J416:K416,1)))","v":3},{"$f":"IF($C416=1,OFFSET(E416,-1,0)+1,OFFSET(E416,-1,0))","v":1},{"$f":"IF($C416=1,0,IF($C416=2,OFFSET(F416,-1,0)+1,OFFSET(F416,-1,0)))","v":11},{"$f":"IF(AND($C416<=2,$C416<>0),0,IF($C416=3,OFFSET(G416,-1,0)+1,OFFSET(G416,-1,0)))","v":0},{"$f":"IF(AND($C416<=3,$C416<>0),0,IF($C416=4,OFFSET(H416,-1,0)+1,OFFSET(H416,-1,0)))","v":0},{"$f":"IF(AND($C416<=4,$C416<>0),0,IF(AND($C416=\"S\",$W416>0),OFFSET(I416,-1,0)+1,OFFSET(I416,-1,0)))","v":0},91,3,"F","Nível 2","Nível 2","1.11.",null,null,"VIDROS","-",null,null,null,null,""]
[3,3,3,2,1,11,1,0,0,2,7,"F","Nível 3","Nível 3","1.11.1.","SINAPI",null,"COZINHA, DESPENSA, CANTINA, DEP. MERENDA E SALA DE ESTUDOS","-",null,null,null,null,""]
["S",3,"S",0,1,11,1,0,0,0,0,"F","Serviço","Serviço","1.11.1.0.1.","SINAPI",72117,"VIDRO LISO COMUM TRANSPARENTE, ESPESSURA 4MM","M2",6,null,null,null,"Referência: AGETOP - 190102"]
[2,2,2,21,1,12,0,0,0,88,21,"F","Nível 2","Nível 2","1.12.",null,null,"REVESTIMENTO DE PAREDE","-",null,null,null,null,""]
[3,3,3,4,1,12,1,0,0,20,4,"F","Nível 3","Nível 3","1.12.1.","SINAPI",null,"GERAL","-",null,null,null,null,""]
["S",3,"S",0,1,12,1,0,0,0,0,"F","Serviço","Serviço","1.12.1.0.1.","SINAPI",87553,"EMBOÇO, PARA RECEBIMENTO DE CERÂMICA, EM ARGAMASSA TRAÇO 1:2:8, PREPARO MECÂNICO COM BETONEIRA 400L, APLICADO MANUALMENTE EM FACES INTERNAS DE PAREDES, PARA AMBIENTE COM ÁREA MAIOR QUE 10M2, ESPESSURA DE 10MM, COM EXECUÇÃO DE TALISCAS. AF_06/2014","M2",20.79,null,null,null,""]
["S",3,"S",0,1,12,1,0,0,0,0,"F","Serviço","Serviço","1.12.1.0.2.","SINAPI",87904,"CHAPISCO APLICADO EM ALVENARIA (COM PRESENÇA DE VÃOS) E ESTRUTURAS DE CONCRETO DE FACHADA, COM COLHER DE PEDREIRO.  ARGAMASSA TRAÇO 1:3 COM PREPARO MANUAL. AF_06/2014","M2",503.51,null,null,null,"Referência: AGETOP - 200101"]
["S",3,"S",0,1,12,1,0,0,0,0,"F","Serviço","Serviço","1.12.1.0.3.","SINAPI",87273,"REVESTIMENTO CERÂMICO PARA PAREDES INTERNAS COM PLACAS TIPO ESMALTADA EXTRA DE DIMENSÕES 33X45 CM APLICADAS EM AMBIENTES DE ÁREA MAIOR QUE 5 M² NA ALTURA INTEIRA DAS PAREDES. AF_06/2014","M2",24.6,null,null,null,""]
[3,3,3,3,1,12,2,0,0,16,3,"F","Nível 3","Nível 3","1.12.2.","SINAPI",null,"AMPLIAÇÃO PASSARELA M2 - SEC. XXI - REV. 2015","-",null,null,null,null,""]
["S",3,"S",0,1,12,2,0,0,0,0,"F","Serviço","Serviço","1.12.2.0.1.","SINAPI",87904,"CHAPISCO APLICADO EM ALVENARIA (COM PRESENÇA DE VÃOS) E ESTRUTURAS DE CONCRETO DE FACHADA, COM COLHER DE PEDREIRO.  ARGAMASSA TRAÇO 1:3 COM PREPARO MANUAL. AF_06/2014","M2",3,null,null,null,"Referência: AGETOP - 200101"]
["S",3,"S",0,1,12,2,0,0,0,0,"F","Serviço","Serviço","1.12.2.0.2.","SINAPI",87547,"MASSA ÚNICA, PARA RECEBIMENTO DE PINTURA, EM ARGAMASSA TRAÇO 1:2:8, PREPARO MECÂNICO COM BETONEIRA 400L, APLICADA MANUALMENTE EM FACES INTERNAS DE PAREDES, ESPESSURA DE 10MM, COM EXECUÇÃO DE TALISCAS. AF_06/2014","M2",3,null,null,null,""]
[{"$f":"CHOOSE(1+LOG(1+2*(ORÇAMENTO.Nivel=\"Nível 1\")+4*(ORÇAMENTO.Nivel=\"Nível 2\")+8*(ORÇAMENTO.Nivel=\"Nível 3\")+16*(ORÇAMENTO.Nivel=\"Nível 4\")+32*(ORÇAMENTO.Nivel=\"Serviço\"),2),0,1,2,3,4,\"S\")","v":3},{"$f":"IF(OR(C427=\"s\",C427=0),OFFSET(B427,-1,0),C427)","v":3},{"$f":"IF(OFFSET(C427,-1,0)=\"L\",1,IF(OFFSET(C427,-1,0)=1,2,IF(OR(A427=\"s\",A427=0),\"S\",IF(AND(OFFSET(C427,-1,0)=2,A427=4),3,IF(AND(OR(OFFSET(C427,-1,0)=\"s\",OFFSET(C427,-1,0)=0),A427<>\"s\",A427>OFFSET(B427,-1,0)),OFFSET(B427,-1,0),A427)))))","v":3},{"$f":"IF(OR(C427=\"S\",C427=0),0,IF(ISERROR(K427),J427,SMALL(J427:K427,1)))","v":3},{"$f":"IF($C427=1,OFFSET(E427,-1,0)+1,OFFSET(E427,-1,0))","v":1},{"$f":"IF($C427=1,0,IF($C427=2,OFFSET(F427,-1,0)+1,OFFSET(F427,-1,0)))","v":12},{"$f":"IF(AND($C427<=2,$C427<>0),0,IF($C427=3,OFFSET(G427,-1,0)+1,OFFSET(G427,-1,0)))","v":3},{"$f":"IF(AND($C427<=3,$C427<>0),0,IF($C427=4,OFFSET(H427,-1,0)+1,OFFSET(H427,-1,0)))","v":0},{"$f":"IF(AND($C427<=4,$C427<>0),0,IF(AND($C427=\"S\",$W427>0),OFFSET(I427,-1,0)+1,OFFSET(I427,-1,0)))","v":0},13,3,"F","Nível 3","Nível 3","1.12.3.","SINAPI",null,"PÁTIO MULTIUSO","-",null,null,null,null,""]
["S",3,"S",0,1,12,3,0,0,0,0,"F","Serviço","Serviço","1.12.3.0.1.","SINAPI",87904,"CHAPISCO APLICADO EM ALVENARIA (COM PRESENÇA DE VÃOS) E ESTRUTURAS DE CONCRETO DE FACHADA, COM COLHER DE PEDREIRO.  ARGAMASSA TRAÇO 1:3 COM PREPARO MANUAL. AF_06/2014","M2",2.66,null,null,null,"Referência: AGETOP - 200101"]
["S",3,"S",0,1,12,3,0,0,0,0,"F","Serviço","Serviço","1.12.3.0.2.","SINAPI",87547,"MASSA ÚNICA, PARA RECEBIMENTO DE PINTURA, EM ARGAMASSA TRAÇO 1:2:8, PREPARO MECÂNICO COM BETONEIRA 400L, APLICADA MANUALMENTE EM FACES INTERNAS DE PAREDES, ESPESSURA DE 10MM, COM EXECUÇÃO DE TALISCAS. AF_06/2014","M2",2.66,null,null,null,""]
[3,3,3,3,1,12,4,0,0,10,3,"F","Nível 3","Nível 3","1.12.4.","SINAPI",null,"COZINHA, DESPENSA, CANTINA, DEP. MERENDA E SALA DE ESTUDOS","-",null,null,null,null,""]
["S",3,"S",0,1,12,4,0,0,0,0,"F","Serviço","Serviço","1.12.4.0.1.","SINAPI",87904,"CHAPISCO APLICADO EM ALVENARIA (COM PRESENÇA DE VÃOS) E ESTRUTURAS DE CONCRETO DE FACHADA, COM COLHER DE PEDREIRO.  ARGAMASSA TRAÇO 1:3 COM PREPARO MANUAL. AF_06/2014","M2",7.68,null,null,null,"Referência: AGETOP - 200101"]
["S",3,"S",0,1,12,4,0,0,0,0,"F","Serviço","Serviço","1.12.4.0.2.","SINAPI",87547,"MASSA ÚNICA, PARA RECEBIMENTO DE PINTURA, EM ARGAMASSA TRAÇO 1:2:8, PREPARO MECÂNICO COM BETONEIRA 400L, APLICADA MANUALMENTE EM FACES INTERNAS DE PAREDES, ESPESSURA DE 10MM, COM EXECUÇÃO DE TALISCAS. AF_06/2014","M2",177.24,null,null,null,""]
[3,3,3,5,1,12,5,0,0,7,5,"F","Nível 3","Nível 3","1.12.5.","SINAPI",null,"VESTIÁRIO MASCULINO","-",null,null,null,null,""]
["S",3,"S",0,1,12,5,0,0,0,0,"F","Serviço","Serviço","1.12.5.0.1.","SINAPI",87904,"CHAPISCO APLICADO EM ALVENARIA (COM PRESENÇA DE VÃOS) E ESTRUTURAS DE CONCRETO DE FACHADA, COM COLHER DE PEDREIRO.  ARGAMASSA TRAÇO 1:3 COM PREPARO MANUAL. AF_06/2014","M2",14.2,null,null,null,"Referência: AGETOP - 200101"]
["S",3,"S",0,1,12,5,0,0,0,0,"F","Serviço","Serviço","1.12.5.0.2.","SINAPI",87547,"MASSA ÚNICA, PARA RECEBIMENTO DE PINTURA, EM ARGAMASSA TRAÇO 1:2:8, PREPARO MECÂNICO COM BETONEIRA 400L, APLICADA MANUALMENTE EM FACES INTERNAS DE PAREDES, ESPESSURA DE 10MM, COM EXECUÇÃO DE TALISCAS. AF_06/2014","M2",0.5,null,null,null,""]
["S",3,"S",0,1,12,5,0,0,0,0,"F","Serviço","Serviço","1.12.5.0.3.","SINAPI",87553,"EMBOÇO, PARA RECEBIMENTO DE CERÂMICA, EM ARGAMASSA TRAÇO 1:2:8, PREPARO MECÂNICO COM BETONEIRA 400L, APLICADO MANUALMENTE EM FACES INTERNAS DE PAREDES, PARA AMBIENTE COM ÁREA MAIOR QUE 10M2, ESPESSURA DE 10MM, COM EXECUÇÃO DE TALISCAS. AF_06/2014","M2",13.7,null,null,null,""]
["S",3,"S",0,1,12,5,0,0,0,0,"F","Serviço","Serviço","1.12.5.0.4.","SINAPI",87273,"REVESTIMENTO CERÂMICO PARA PAREDES INTERNAS COM PLACAS TIPO ESMALTADA EXTRA DE DIMENSÕES 33X45 CM APLICADAS EM AMBIENTES DE ÁREA MAIOR QUE 5 M² NA ALTURA INTEIRA DAS PAREDES. AF_06/2014","M2",13.7,null,null,null,""]
[3,3,3,2,1,12,6,0,0,2,{"$error":"#N/A"},"F","Nível 3","Nível 3","1.12.6.","SINAPI",null,"MURO","-",null,null,null,null,""]
["S",3,"S",0,1,12,6,0,0,0,0,"F","Serviço","Serviço","1.12.6.0.1.","SINAPI",87547,"MASSA ÚNICA, PARA RECEBIMENTO DE PINTURA, EM ARGAMASSA TRAÇO 1:2:8, PREPARO MECÂNICO COM BETONEIRA 400L, APLICADA MANUALMENTE EM FACES INTERNAS DE PAREDES, ESPESSURA DE 10MM, COM EXECUÇÃO DE TALISCAS. AF_06/2014","M2",2412.5500000000002,null,null,null,""]
[{"$f":"CHOOSE(1+LOG(1+2*(ORÇAMENTO.Nivel=\"Nível 1\")+4*(ORÇAMENTO.Nivel=\"Nível 2\")+8*(ORÇAMENTO.Nivel=\"Nível 3\")+16*(ORÇAMENTO.Nivel=\"Nível 4\")+32*(ORÇAMENTO.Nivel=\"Serviço\"),2),0,1,2,3,4,\"S\")","v":2},{"$f":"IF(OR(C440=\"s\",C440=0),OFFSET(B440,-1,0),C440)","v":2},{"$f":"IF(OFFSET(C440,-1,0)=\"L\",1,IF(OFFSET(C440,-1,0)=1,2,IF(OR(A440=\"s\",A440=0),\"S\",IF(AND(OFFSET(C440,-1,0)=2,A440=4),3,IF(AND(OR(OFFSET(C440,-1,0)=\"s\",OFFSET(C440,-1,0)=0),A440<>\"s\",A440>OFFSET(B440,-1,0)),OFFSET(B440,-1,0),A440)))))","v":2},{"$f":"IF(OR(C440=\"S\",C440=0),0,IF(ISERROR(K440),J440,SMALL(J440:K440,1)))","v":7},{"$f":"IF($C440=1,OFFSET(E440,-1,0)+1,OFFSET(E440,-1,0))","v":1},{"$f":"IF($C440=1,0,IF($C440=2,OFFSET(F440,-1,0)+1,OFFSET(F440,-1,0)))","v":13},{"$f":"IF(AND($C440<=2,$C440<>0),0,IF($C440=3,OFFSET(G440,-1,0)+1,OFFSET(G440,-1,0)))","v":0},{"$f":"IF(AND($C440<=3,$C440<>0),0,IF($C440=4,OFFSET(H440,-1,0)+1,OFFSET(H440,-1,0)))","v":0},{"$f":"IF(AND($C440<=4,$C440<>0),0,IF(AND($C440=\"S\",$W440>0),OFFSET(I440,-1,0)+1,OFFSET(I440,-1,0)))","v":0},67,7,"F","Nível 2","Nível 2","1.13.",null,null,"FORROS","-",null,null,null,null,""]
[3,3,3,3,1,13,1,0,0,6,3,"F","Nível 3","Nível 3","1.13.1.","SINAPI",null,"GERAL","-",null,null,null,null,""]
["S",3,"S",0,1,13,1,0,0,0,0,"F","Serviço","Serviço","1.13.1.0.1.","SINAPI",96116,"FORRO EM RÉGUAS DE PVC, FRISADO, PARA AMBIENTES COMERCIAIS, INCLUSIVE ESTRUTURA DE FIXAÇÃO. AF_05/2017_P","M2",201.06,null,null,null,"Referência: AGETOP - 210460"]
["S",3,"S",0,1,13,1,0,0,0,0,"F","Serviço","Serviço","1.13.1.0.2.","AGETOP",210461,"FORRO DE PVC SEM ESTRUTURA DE METALON (COM REPINTURA DA ESTRUTURA COM TINTA ALQUÍDICA D.F.)","m2    ",201.05,null,null,null,""]
[3,3,3,3,1,13,2,0,0,3,12,"F","Nível 3","Nível 3","1.13.2.","SINAPI",null,"COZINHA, DESPENSA, CANTINA, DEP. MERENDA E SALA DE ESTUDOS","-",null,null,null,null,""]
["S",3,"S",0,1,13,2,0,0,0,0,"F","Serviço","Serviço","1.13.2.0.1.","SINAPI",96116,"FORRO EM RÉGUAS DE PVC, FRISADO, PARA AMBIENTES COMERCIAIS, INCLUSIVE ESTRUTURA DE FIXAÇÃO. AF_05/2017_P","M2",35.450000000000003,null,null,null,"Referência: AGETOP - 210460"]
["S",3,"S",0,1,13,2,0,0,0,0,"F","Serviço","Serviço","1.13.2.0.2.","AGETOP",210461,"FORRO DE PVC SEM ESTRUTURA DE METALON (COM REPINTURA DA ESTRUTURA COM TINTA ALQUÍDICA D.F.)","m2    ",35.450000000000003,null,null,null,""]
[2,2,2,21,1,14,0,0,0,60,21,"F","Nível 2","Nível 2","1.14.",null,null,"REVESTIMENTO DE PISO","-",null,null,null,null,""]
[3,3,3,6,1,14,1,0,0,20,6,"F","Nível 3","Nível 3","1.14.1.",null,null,"GERAL","-",null,null,null,null,""]
[{"$f":"CHOOSE(1+LOG(1+2*(ORÇAMENTO.Nivel=\"Nível 1\")+4*(ORÇAMENTO.Nivel=\"Nível 2\")+8*(ORÇAMENTO.Nivel=\"Nível 3\")+16*(ORÇAMENTO.Nivel=\"Nível 4\")+32*(ORÇAMENTO.Nivel=\"Serviço\"),2),0,1,2,3,4,\"S\")","v":"S"},{"$f":"IF(OR(C449=\"s\",C449=0),OFFSET(B449,-1,0),C449)","v":3},{"$f":"IF(OFFSET(C449,-1,0)=\"L\",1,IF(OFFSET(C449,-1,0)=1,2,IF(OR(A449=\"s\",A449=0),\"S\",IF(AND(OFFSET(C449,-1,0)=2,A449=4),3,IF(AND(OR(OFFSET(C449,-1,0)=\"s\",OFFSET(C449,-1,0)=0),A449<>\"s\",A449>OFFSET(B449,-1,0)),OFFSET(B449,-1,0),A449)))))","v":"S"},{"$f":"IF(OR(C449=\"S\",C449=0),0,IF(ISERROR(K449),J449,SMALL(J449:K449,1)))","v":0},{"$f":"IF($C449=1,OFFSET(E449,-1,0)+1,OFFSET(E449,-1,0))","v":1},{"$f":"IF($C449=1,0,IF($C449=2,OFFSET(F449,-1,0)+1,OFFSET(F449,-1,0)))","v":14},{"$f":"IF(AND($C449<=2,$C449<>0),0,IF($C449=3,OFFSET(G449,-1,0)+1,OFFSET(G449,-1,0)))","v":1},{"$f":"IF(AND($C449<=3,$C449<>0),0,IF($C449=4,OFFSET(H449,-1,0)+1,OFFSET(H449,-1,0)))","v":0},{"$f":"IF(AND($C449<=4,$C449<>0),0,IF(AND($C449=\"S\",$W449>0),OFFSET(I449,-1,0)+1,OFFSET(I449,-1,0)))","v":0},0,0,"F","Serviço","Serviço","1.14.1.0.1.","SINAPI",84191,"PISO EM GRANILITE, MARMORITE OU GRANITINA ESPESSURA 8 MM, INCLUSO JUNTAS DE DILATACAO PLASTICAS","M2",536.51,null,null,null,"Referência: AGETOP - 221101"]
["S",3,"S",0,1,14,1,0,0,0,0,"F","Serviço","Serviço","1.14.1.0.2.","AGETOP",221104,"RASPAGEM E APLICAÇÃO RESINA ACRÍLICA DUAS DEMÃOS","m2    ",536.51,null,null,null,""]
["S",3,"S",0,1,14,1,0,0,0,0,"F","Serviço","Serviço","1.14.1.0.3.","SINAPI",87251,"REVESTIMENTO CERÂMICO PARA PISO COM PLACAS TIPO ESMALTADA EXTRA DE DIMENSÕES 45X45 CM APLICADA EM AMBIENTES DE ÁREA MAIOR QUE 10 M2. AF_06/2014","M2",4.58,null,null,null,""]
["S",3,"S",0,1,14,1,0,0,0,0,"F","Serviço","Serviço","1.14.1.0.4.","AGETOP",220102,"PISO CONCRETO DESEMPENADO ESPESSURA = 5 CM  1:2,5:3,5","m2    ",10.6,null,null,null,""]
["S",3,"S",0,1,14,1,0,0,0,0,"F","Serviço","Serviço","1.14.1.0.5.","AGETOP",221126,"PISO DE LADRILHO HIDRÁULICO COLORIDO MODELO TÁTIL ( ALERTA OU DIRECIONAL) SEM LASTRO","m2    ",23,null,null,null,""]
[3,3,3,2,1,14,2,0,0,14,2,"F","Nível 3","Nível 3","1.14.2.","SINAPI",null,"IMPLANTAÇÃO","-",null,null,null,null,""]
["S",3,"S",0,1,14,2,0,0,0,0,"F","Serviço","Serviço","1.14.2.0.1.","AGETOP",220102,"PISO CONCRETO DESEMPENADO ESPESSURA = 5 CM  1:2,5:3,5","m2    ",100.5,null,null,null,""]
[3,3,3,3,1,14,3,0,0,12,3,"F","Nível 3","Nível 3","1.14.3.","SINAPI",null,"PÁTIO MULTIUSO","-",null,null,null,null,""]
["S",3,"S",0,1,14,3,0,0,0,0,"F","Serviço","Serviço","1.14.3.0.1.","SINAPI",84191,"PISO EM GRANILITE, MARMORITE OU GRANITINA ESPESSURA 8 MM, INCLUSO JUNTAS DE DILATACAO PLASTICAS","M2",1.67,null,null,null,"Referência: AGETOP - 221101"]
["S",3,"S",0,1,14,3,0,0,0,0,"F","Serviço","Serviço","1.14.3.0.2.","AGETOP",221104,"RASPAGEM E APLICAÇÃO RESINA ACRÍLICA DUAS DEMÃOS","m2    ",122.37,null,null,null,""]
[3,3,3,3,1,14,4,0,0,9,3,"F","Nível 3","Nível 3","1.14.4.","SINAPI",null,"COZINHA, DESPENSA, CANTINA, DEP. MERENDA E SALA DE ESTUDOS","-",null,null,null,null,""]
["S",3,"S",0,1,14,4,0,0,0,0,"F","Serviço","Serviço","1.14.4.0.1.","SINAPI",84191,"PISO EM GRANILITE, MARMORITE OU GRANITINA ESPESSURA 8 MM, INCLUSO JUNTAS DE DILATACAO PLASTICAS","M2",76.08,null,null,null,"Referência: AGETOP - 221101"]
["S",3,"S",0,1,14,4,0,0,0,0,"F","Serviço","Serviço","1.14.4.0.2.","AGETOP",221104,"RASPAGEM E APLICAÇÃO RESINA ACRÍLICA DUAS DEMÃOS","m2    ",76.08,null,null,null,""]
[3,3,3,4,1,14,5,0,0,6,4,"F","Nível 3","Nível 3","1.14.5.","SINAPI",null,"BLOCO 01 E 02","-",null,null,null,null,""]
["S",3,"S",0,1,14,5,0,0,0,0,"F","Serviço","Serviço","1.14.5.0.1.","SINAPI",84191,"PISO EM GRANILITE, MARMORITE OU GRANITINA ESPESSURA 8 MM, INCLUSO JUNTAS DE DILATACAO PLASTICAS","M2",1335.08,null,null,null,"Referência: AGETOP - 221101"]
["S",3,"S",0,1,14,5,0,0,0,0,"F","Serviço","Serviço","1.14.5.0.2.","AGETOP",221104,"RASPAGEM E APLICAÇÃO RESINA ACRÍLICA DUAS DEMÃOS","m2    ",1335.08,null,null,null,""]
["S",3,"S",0,1,14,5,0,0,0,0,"F","Serviço","Serviço","1.14.5.0.3.","AGETOP",221126,"PISO DE LADRILHO HIDRÁULICO COLORIDO MODELO TÁTIL ( ALERTA OU DIRECIONAL) SEM LASTRO","m2    ",8.0500000000000007,null,null,null,""]
[3,3,3,2,1,14,6,0,0,2,{"$error":"#N/A"},"F","Nível 3","Nível 3","1.14.6.","SINAPI",null,"VESTIÁRIO MASCULINO","-",null,null,null,null,""]
["S",3,"S",0,1,14,6,0,0,{"$f":"IF(OR($C467=\"S\",$C467=0),0,MATCH(0,OFFSET($D467,1,$C467,ROW($C$742)-ROW($C467)),0))","v":0},{"$f":"IF(OR($C467=\"S\",$C467=0),0,MATCH(OFFSET($D467,0,$C467)+1,OFFSET($D467,1,$C467,ROW($C$742)-ROW($C467)),0))","v":0},"F","Serviço","Serviço","1.14.6.0.1.","SINAPI",87251,"REVESTIMENTO CERÂMICO PARA PISO COM PLACAS TIPO ESMALTADA EXTRA DE DIMENSÕES 45X45 CM APLICADA EM AMBIENTES DE ÁREA MAIOR QUE 10 M2. AF_06/2014","M2",21.3,null,null,null,""]
[{"$f":"CHOOSE(1+LOG(1+2*(ORÇAMENTO.Nivel=\"Nível 1\")+4*(ORÇAMENTO.Nivel=\"Nível 2\")+8*(ORÇAMENTO.Nivel=\"Nível 3\")+16*(ORÇAMENTO.Nivel=\"Nível 4\")+32*(ORÇAMENTO.Nivel=\"Serviço\"),2),0,1,2,3,4,\"S\")","v":2},{"$f":"IF(OR(C468=\"s\",C468=0),OFFSET(B468,-1,0),C468)","v":2},{"$f":"IF(OFFSET(C468,-1,0)=\"L\",1,IF(OFFSET(C468,-1,0)=1,2,IF(OR(A468=\"s\",A468=0),\"S\",IF(AND(OFFSET(C468,-1,0)=2,A468=4),3,IF(AND(OR(OFFSET(C468,-1,0)=\"s\",OFFSET(C468,-1,0)=0),A468<>\"s\",A468>OFFSET(B468,-1,0)),OFFSET(B468,-1,0),A468)))))","v":2},{"$f":"IF(OR(C468=\"S\",C468=0),0,IF(ISERROR(K468),J468,SMALL(J468:K468,1)))","v":8},{"$f":"IF($C468=1,OFFSET(E468,-1,0)+1,OFFSET(E468,-1,0))","v":1},{"$f":"IF($C468=1,0,IF($C468=2,OFFSET(F468,-1,0)+1,OFFSET(F468,-1,0)))","v":15},{"$f":"IF(AND($C468<=2,$C468<>0),0,IF($C468=3,OFFSET(G468,-1,0)+1,OFFSET(G468,-1,0)))","v":0},{"$f":"IF(AND($C468<=3,$C468<>0),0,IF($C468=4,OFFSET(H468,-1,0)+1,OFFSET(H468,-1,0)))","v":0},{"$f":"IF(AND($C468<=4,$C468<>0),0,IF(AND($C468=\"S\",$W468>0),OFFSET(I468,-1,0)+1,OFFSET(I468,-1,0)))","v":0},39,8,"F","Nível 2","Nível 2","1.15.",null,null,"FERRAGENS","-",null,null,null,null,""]
[3,3,3,4,1,15,1,0,0,7,4,"F","Nível 3","Nível 3","1.15.1.","SINAPI",null,"GERAL","-",null,null,null,null,""]
["S",3,"S",0,1,15,1,0,0,0,0,"F","Serviço","Serviço","1.15.1.0.1.","COMPOSIÇÃO","COMP 206_SEE","BANCO ARTICULADO PARA BANHO, EM ACO INOX POLIDO, 70* CM X 45* CM","UN ",1,null,null,null,""]
["S",3,"S",0,1,15,1,0,0,0,0,"F","Serviço","Serviço","1.15.1.0.2.","AGETOP",230176,"BARRA DE APOIO EM AÇO INOX - 80 CM ","un    ",6,null,null,null,""]
["S",3,"S",0,1,15,1,0,0,0,0,"F","Serviço","Serviço","1.15.1.0.3.","AGETOP",230174,"BARRA DE APOIO EM AÇO INOX - 40 CM","un    ",3,null,null,null,""]
[3,3,3,3,1,15,2,0,0,3,18,"F","Nível 3","Nível 3","1.15.2.","SINAPI",null,"VESTIÁRIO MASCULINO","-",null,null,null,null,""]
["S",3,"S",0,1,15,2,0,0,0,0,"F","Serviço","Serviço","1.15.2.0.1.","AGETOP",230176,"BARRA DE APOIO EM AÇO INOX - 80 CM ","un    ",3,null,null,null,""]
["S",3,"S",0,1,15,2,0,0,0,0,"F","Serviço","Serviço","1.15.2.0.2.","AGETOP",230174,"BARRA DE APOIO EM AÇO INOX - 40 CM","un    ",3,null,null,null,""]
[2,2,2,3,1,16,0,0,0,31,3,"F","Nível 2","Nível 2","1.16.",null,null,"ADMINISTRAÇÃO","-",null,null,null,null,""]
["S",2,"S",0,1,16,0,0,0,0,0,"F","Serviço","Serviço","1.16.0.0.1.","SINAPI",90778,"ENGENHEIRO CIVIL DE OBRA PLENO COM ENCARGOS COMPLEMENTARES","H",176,null,null,null,"Referência: AGETOP - 250101"]
["S",2,"S",0,1,16,0,0,0,0,0,"F","Serviço","Serviço","1.16.0.0.2.","SINAPI",90776,"ENCARREGADO GERAL COM ENCARGOS COMPLEMENTARES","H",880,null,null,null,"Referência: AGETOP - 250103"]
[2,2,2,21,1,17,0,0,0,28,21,"F","Nível 2","Nível 2","1.17.",null,null,"PINTURA","-",null,null,null,null,""]
[3,3,3,8,1,17,1,0,0,20,8,"F","Nível 3","Nível 3","1.17.1.",null,null,"GERAL","-",null,null,null,null,""]
["S",3,"S",0,1,17,1,0,0,0,0,"F","Serviço","Serviço","1.17.1.0.1.","SINAPI","74145/1","PINTURA ESMALTE FOSCO, DUAS DEMAOS, SOBRE SUPERFICIE METALICA, INCLUSO UMA DEMAO DE FUNDO ANTICORROSIVO. UTILIZACAO DE REVOLVER ( AR-COMPRIMIDO).","M2",1000,null,null,null,"Referência: AGETOP - 261602"]
[{"$f":"CHOOSE(1+LOG(1+2*(ORÇAMENTO.Nivel=\"Nível 1\")+4*(ORÇAMENTO.Nivel=\"Nível 2\")+8*(ORÇAMENTO.Nivel=\"Nível 3\")+16*(ORÇAMENTO.Nivel=\"Nível 4\")+32*(ORÇAMENTO.Nivel=\"Serviço\"),2),0,1,2,3,4,\"S\")","v":"S"},{"$f":"IF(OR(C482=\"s\",C482=0),OFFSET(B482,-1,0),C482)","v":3},{"$f":"IF(OFFSET(C482,-1,0)=\"L\",1,IF(OFFSET(C482,-1,0)=1,2,IF(OR(A482=\"s\",A482=0),\"S\",IF(AND(OFFSET(C482,-1,0)=2,A482=4),3,IF(AND(OR(OFFSET(C482,-1,0)=\"s\",OFFSET(C482,-1,0)=0),A482<>\"s\",A482>OFFSET(B482,-1,0)),OFFSET(B482,-1,0),A482)))))","v":"S"},{"$f":"IF(OR(C482=\"S\",C482=0),0,IF(ISERROR(K482),J482,SMALL(J482:K482,1)))","v":0},{"$f":"IF($C482=1,OFFSET(E482,-1,0)+1,OFFSET(E482,-1,0))","v":1},{"$f":"IF($C482=1,0,IF($C482=2,OFFSET(F482,-1,0)+1,OFFSET(F482,-1,0)))","v":17},{"$f":"IF(AND($C482<=2,$C482<>0),0,IF($C482=3,OFFSET(G482,-1,0)+1,OFFSET(G482,-1,0)))","v":1},{"$f":"IF(AND($C482<=3,$C482<>0),0,IF($C482=4,OFFSET(H482,-1,0)+1,OFFSET(H482,-1,0)))","v":0},{"$f":"IF(AND($C482<=4,$C482<>0),0,IF(AND($C482=\"S\",$W482>0),OFFSET(I482,-1,0)+1,OFFSET(I482,-1,0)))","v":0},0,0,"F","Serviço","Serviço","1.17.1.0.2.","SINAPI",88489,"APLICAÇÃO MANUAL DE PINTURA COM TINTA LÁTEX ACRÍLICA EM PAREDES, DUAS DEMÃOS. AF_06/2014","M2",4252,null,null,null,"Referência: AGETOP - 261001"]
["S",3,"S",0,1,17,1,0,0,0,0,"F","Serviço","Serviço","1.17.1.0.3.","AGETOP",261620,"LETREIRO MÉDIO A GRANDE PORTE EM PAREDE FEITO A PINCEL","m2    ",7.2,null,null,null,""]
["S",3,"S",0,1,17,1,0,0,0,0,"F","Serviço","Serviço","1.17.1.0.4.","SINAPI",88486,"APLICAÇÃO MANUAL DE PINTURA COM TINTA LÁTEX PVA EM TETO, DUAS DEMÃOS. AF_06/2014","M2",1215,null,null,null,"Referência: AGETOP - 261307"]
["S",3,"S",0,1,17,1,0,0,0,0,"F","Serviço","Serviço","1.17.1.0.5.","AGETOP",260104,"REMOCAO DE PINTURA ANTIGA A LATEX","m2    ",200,null,null,null,""]
["S",3,"S",0,1,17,1,0,0,0,0,"F","Serviço","Serviço","1.17.1.0.6.","SINAPI",88497,"APLICAÇÃO E LIXAMENTO DE MASSA LÁTEX EM PAREDES, DUAS DEMÃOS. AF_06/2014","M2",200,null,null,null,"Referência: AGETOP - 261300"]
["S",3,"S",0,1,17,1,0,0,0,0,"F","Serviço","Serviço","1.17.1.0.7.","AGETOP",261550,"PINT.ESMALTE SINT.PAREDES - 2 DEM.C/SELADOR","m2    ",2520,null,null,null,""]
[{"$f":"CHOOSE(1+LOG(1+2*(ORÇAMENTO.Nivel=\"Nível 1\")+4*(ORÇAMENTO.Nivel=\"Nível 2\")+8*(ORÇAMENTO.Nivel=\"Nível 3\")+16*(ORÇAMENTO.Nivel=\"Nível 4\")+32*(ORÇAMENTO.Nivel=\"Serviço\"),2),0,1,2,3,4,\"S\")","v":3},{"$f":"IF(OR(C488=\"s\",C488=0),OFFSET(B488,-1,0),C488)","v":3},{"$f":"IF(OFFSET(C488,-1,0)=\"L\",1,IF(OFFSET(C488,-1,0)=1,2,IF(OR(A488=\"s\",A488=0),\"S\",IF(AND(OFFSET(C488,-1,0)=2,A488=4),3,IF(AND(OR(OFFSET(C488,-1,0)=\"s\",OFFSET(C488,-1,0)=0),A488<>\"s\",A488>OFFSET(B488,-1,0)),OFFSET(B488,-1,0),A488)))))","v":3},{"$f":"IF(OR(C488=\"S\",C488=0),0,IF(ISERROR(K488),J488,SMALL(J488:K488,1)))","v":3},{"$f":"IF($C488=1,OFFSET(E488,-1,0)+1,OFFSET(E488,-1,0))","v":1},{"$f":"IF($C488=1,0,IF($C488=2,OFFSET(F488,-1,0)+1,OFFSET(F488,-1,0)))","v":17},{"$f":"IF(AND($C488<=2,$C488<>0),0,IF($C488=3,OFFSET(G488,-1,0)+1,OFFSET(G488,-1,0)))","v":2},{"$f":"IF(AND($C488<=3,$C488<>0),0,IF($C488=4,OFFSET(H488,-1,0)+1,OFFSET(H488,-1,0)))","v":0},{"$f":"IF(AND($C488<=4,$C488<>0),0,IF(AND($C488=\"S\",$W488>0),OFFSET(I488,-1,0)+1,OFFSET(I488,-1,0)))","v":0},12,3,"F","Nível 3","Nível 3","1.17.2.","AGETOP",null,"PÁTIO MULTIUSO","-",null,null,null,null,""]
[{"$f":"CHOOSE(1+LOG(1+2*(ORÇAMENTO.Nivel=\"Nível 1\")+4*(ORÇAMENTO.Nivel=\"Nível 2\")+8*(ORÇAMENTO.Nivel=\"Nível 3\")+16*(ORÇAMENTO.Nivel=\"Nível 4\")+32*(ORÇAMENTO.Nivel=\"Serviço\"),2),0,1,2,3,4,\"S\")","v":"S"},{"$f":"IF(OR(C489=\"s\",C489=0),OFFSET(B489,-1,0),C489)","v":3},{"$f":"IF(OFFSET(C489,-1,0)=\"L\",1,IF(OFFSET(C489,-1,0)=1,2,IF(OR(A489=\"s\",A489=0),\"S\",IF(AND(OFFSET(C489,-1,0)=2,A489=4),3,IF(AND(OR(OFFSET(C489,-1,0)=\"s\",OFFSET(C489,-1,0)=0),A489<>\"s\",A489>OFFSET(B489,-1,0)),OFFSET(B489,-1,0),A489)))))","v":"S"},{"$f":"IF(OR(C489=\"S\",C489=0),0,IF(ISERROR(K489),J489,SMALL(J489:K489,1)))","v":0},{"$f":"IF($C489=1,OFFSET(E489,-1,0)+1,OFFSET(E489,-1,0))","v":1},{"$f":"IF($C489=1,0,IF($C489=2,OFFSET(F489,-1,0)+1,OFFSET(F489,-1,0)))","v":17},{"$f":"IF(AND($C489<=2,$C489<>0),0,IF($C489=3,OFFSET(G489,-1,0)+1,OFFSET(G489,-1,0)))","v":2},{"$f":"IF(AND($C489<=3,$C489<>0),0,IF($C489=4,OFFSET(H489,-1,0)+1,OFFSET(H489,-1,0)))","v":0},{"$f":"IF(AND($C489<=4,$C489<>0),0,IF(AND($C489=\"S\",$W489>0),OFFSET(I489,-1,0)+1,OFFSET(I489,-1,0)))","v":0},0,0,"F","Serviço","Serviço","1.17.2.0.1.","SINAPI",88497,"APLICAÇÃO E LIXAMENTO DE MASSA LÁTEX EM PAREDES, DUAS DEMÃOS. AF_06/2014","M2",180,null,null,null,"Referência: AGETOP - 261300"]
[{"$f":"CHOOSE(1+LOG(1+2*(ORÇAMENTO.Nivel=\"Nível 1\")+4*(ORÇAMENTO.Nivel=\"Nível 2\")+8*(ORÇAMENTO.Nivel=\"Nível 3\")+16*(ORÇAMENTO.Nivel=\"Nível 4\")+32*(ORÇAMENTO.Nivel=\"Serviço\"),2),0,1,2,3,4,\"S\")","v":"S"},{"$f":"IF(OR(C490=\"s\",C490=0),OFFSET(B490,-1,0),C490)","v":3},{"$f":"IF(OFFSET(C490,-1,0)=\"L\",1,IF(OFFSET(C490,-1,0)=1,2,IF(OR(A490=\"s\",A490=0),\"S\",IF(AND(OFFSET(C490,-1,0)=2,A490=4),3,IF(AND(OR(OFFSET(C490,-1,0)=\"s\",OFFSET(C490,-1,0)=0),A490<>\"s\",A490>OFFSET(B490,-1,0)),OFFSET(B490,-1,0),A490)))))","v":"S"},{"$f":"IF(OR(C490=\"S\",C490=0),0,IF(ISERROR(K490),J490,SMALL(J490:K490,1)))","v":0},{"$f":"IF($C490=1,OFFSET(E490,-1,0)+1,OFFSET(E490,-1,0))","v":1},{"$f":"IF($C490=1,0,IF($C490=2,OFFSET(F490,-1,0)+1,OFFSET(F490,-1,0)))","v":17},{"$f":"IF(AND($C490<=2,$C490<>0),0,IF($C490=3,OFFSET(G490,-1,0)+1,OFFSET(G490,-1,0)))","v":2},{"$f":"IF(AND($C490<=3,$C490<>0),0,IF($C490=4,OFFSET(H490,-1,0)+1,OFFSET(H490,-1,0)))","v":0},{"$f":"IF(AND($C490<=4,$C490<>0),0,IF(AND($C490=\"S\",$W490>0),OFFSET(I490,-1,0)+1,OFFSET(I490,-1,0)))","v":0},0,0,"F","Serviço","Serviço","1.17.2.0.2.","SINAPI",88489,"APLICAÇÃO MANUAL DE PINTURA COM TINTA LÁTEX ACRÍLICA EM PAREDES, DUAS DEMÃOS. AF_06/2014","M2",226.58,null,null,null,"Referência: AGETOP - 261001"]
[{"$f":"CHOOSE(1+LOG(1+2*(ORÇAMENTO.Nivel=\"Nível 1\")+4*(ORÇAMENTO.Nivel=\"Nível 2\")+8*(ORÇAMENTO.Nivel=\"Nível 3\")+16*(ORÇAMENTO.Nivel=\"Nível 4\")+32*(ORÇAMENTO.Nivel=\"Serviço\"),2),0,1,2,3,4,\"S\")","v":3},{"$f":"IF(OR(C491=\"s\",C491=0),OFFSET(B491,-1,0),C491)","v":3},{"$f":"IF(OFFSET(C491,-1,0)=\"L\",1,IF(OFFSET(C491,-1,0)=1,2,IF(OR(A491=\"s\",A491=0),\"S\",IF(AND(OFFSET(C491,-1,0)=2,A491=4),3,IF(AND(OR(OFFSET(C491,-1,0)=\"s\",OFFSET(C491,-1,0)=0),A491<>\"s\",A491>OFFSET(B491,-1,0)),OFFSET(B491,-1,0),A491)))))","v":3},{"$f":"IF(OR(C491=\"S\",C491=0),0,IF(ISERROR(K491),J491,SMALL(J491:K491,1)))","v":7},{"$f":"IF($C491=1,OFFSET(E491,-1,0)+1,OFFSET(E491,-1,0))","v":1},{"$f":"IF($C491=1,0,IF($C491=2,OFFSET(F491,-1,0)+1,OFFSET(F491,-1,0)))","v":17},{"$f":"IF(AND($C491<=2,$C491<>0),0,IF($C491=3,OFFSET(G491,-1,0)+1,OFFSET(G491,-1,0)))","v":3},{"$f":"IF(AND($C491<=3,$C491<>0),0,IF($C491=4,OFFSET(H491,-1,0)+1,OFFSET(H491,-1,0)))","v":0},{"$f":"IF(AND($C491<=4,$C491<>0),0,IF(AND($C491=\"S\",$W491>0),OFFSET(I491,-1,0)+1,OFFSET(I491,-1,0)))","v":0},9,7,"F","Nível 3","Nível 3","1.17.3.","SINAPI",null,"COZINHA, DESPENSA, CANTINA, DEP. MERENDA E SALA DE ESTUDOS","-",null,null,null,null,""]
["S",3,"S",0,1,17,3,0,0,0,0,"F","Serviço","Serviço","1.17.3.0.1.","SINAPI","74145/1","PINTURA ESMALTE FOSCO, DUAS DEMAOS, SOBRE SUPERFICIE METALICA, INCLUSO UMA DEMAO DE FUNDO ANTICORROSIVO. UTILIZACAO DE REVOLVER ( AR-COMPRIMIDO).","M2",33.51,null,null,null,"Referência: AGETOP - 261602"]
["S",3,"S",0,1,17,3,0,0,0,0,"F","Serviço","Serviço","1.17.3.0.2.","SINAPI",88489,"APLICAÇÃO MANUAL DE PINTURA COM TINTA LÁTEX ACRÍLICA EM PAREDES, DUAS DEMÃOS. AF_06/2014","M2",244.38,null,null,null,"Referência: AGETOP - 261001"]
["S",3,"S",0,1,17,3,0,0,0,0,"F","Serviço","Serviço","1.17.3.0.3.","SINAPI",88489,"APLICAÇÃO MANUAL DE PINTURA COM TINTA LÁTEX ACRÍLICA EM PAREDES, DUAS DEMÃOS. AF_06/2014","M2",194.19,null,null,null,"Referência: AGETOP - 261001"]
["S",3,"S",0,1,17,3,0,0,0,0,"F","Serviço","Serviço","1.17.3.0.4.","SINAPI",88486,"APLICAÇÃO MANUAL DE PINTURA COM TINTA LÁTEX PVA EM TETO, DUAS DEMÃOS. AF_06/2014","M2",70.900000000000006,null,null,null,"Referência: AGETOP - 261307"]
["S",3,"S",0,1,17,3,0,0,0,0,"F","Serviço","Serviço","1.17.3.0.5.","AGETOP",260105,"REMOCAO DE PINTURA ANTIGA A OLEO OU ESMALTE","m2    ",56.56,null,null,null,""]
["S",3,"S",0,1,17,3,0,0,0,0,"F","Serviço","Serviço","1.17.3.0.6.","SINAPI","73924/3","PINTURA ESMALTE FOSCO, DUAS DEMAOS, SOBRE SUPERFICIE METALICA","M2",56.56,null,null,null,"Referência: AGETOP - 261503"]
[3,3,3,2,1,17,4,0,0,2,{"$error":"#N/A"},"F","Nível 3","Nível 3","1.17.4.","SINAPI",null,"VESTIÁRIO MASCULINO","-",null,null,null,null,""]
["S",3,"S",0,1,17,4,0,0,0,0,"F","Serviço","Serviço","1.17.4.0.1.","SINAPI","74145/1","PINTURA ESMALTE FOSCO, DUAS DEMAOS, SOBRE SUPERFICIE METALICA, INCLUSO UMA DEMAO DE FUNDO ANTICORROSIVO. UTILIZACAO DE REVOLVER ( AR-COMPRIMIDO).","M2",12,null,null,null,"Referência: AGETOP - 261602"]
[{"$f":"CHOOSE(1+LOG(1+2*(ORÇAMENTO.Nivel=\"Nível 1\")+4*(ORÇAMENTO.Nivel=\"Nível 2\")+8*(ORÇAMENTO.Nivel=\"Nível 3\")+16*(ORÇAMENTO.Nivel=\"Nível 4\")+32*(ORÇAMENTO.Nivel=\"Serviço\"),2),0,1,2,3,4,\"S\")","v":2},{"$f":"IF(OR(C500=\"s\",C500=0),OFFSET(B500,-1,0),C500)","v":2},{"$f":"IF(OFFSET(C500,-1,0)=\"L\",1,IF(OFFSET(C500,-1,0)=1,2,IF(OR(A500=\"s\",A500=0),\"S\",IF(AND(OFFSET(C500,-1,0)=2,A500=4),3,IF(AND(OR(OFFSET(C500,-1,0)=\"s\",OFFSET(C500,-1,0)=0),A500<>\"s\",A500>OFFSET(B500,-1,0)),OFFSET(B500,-1,0),A500)))))","v":2},{"$f":"IF(OR(C500=\"S\",C500=0),0,IF(ISERROR(K500),J500,SMALL(J500:K500,1)))","v":7},{"$f":"IF($C500=1,OFFSET(E500,-1,0)+1,OFFSET(E500,-1,0))","v":1},{"$f":"IF($C500=1,0,IF($C500=2,OFFSET(F500,-1,0)+1,OFFSET(F500,-1,0)))","v":18},{"$f":"IF(AND($C500<=2,$C500<>0),0,IF($C500=3,OFFSET(G500,-1,0)+1,OFFSET(G500,-1,0)))","v":0},{"$f":"IF(AND($C500<=3,$C500<>0),0,IF($C500=4,OFFSET(H500,-1,0)+1,OFFSET(H500,-1,0)))","v":0},{"$f":"IF(AND($C500<=4,$C500<>0),0,IF(AND($C500=\"S\",$W500>0),OFFSET(I500,-1,0)+1,OFFSET(I500,-1,0)))","v":0},7,190,"F","Nível 2","Nível 2","1.18.",null,null,"DIVERSOS","-",null,null,null,null,""]
[3,{"$f":"IF(OR(C501=\"s\",C501=0),OFFSET(B501,-1,0),C501)","v":3},{"$f":"IF(OFFSET(C501,-1,0)=\"L\",1,IF(OFFSET(C501,-1,0)=1,2,IF(OR(A501=\"s\",A501=0),\"S\",IF(AND(OFFSET(C501,-1,0)=2,A501=4),3,IF(AND(OR(OFFSET(C501,-1,0)=\"s\",OFFSET(C501,-1,0)=0),A501<>\"s\",A501>OFFSET(B501,-1,0)),OFFSET(B501,-1,0),A501)))))","v":3},{"$f":"IF(OR(C501=\"S\",C501=0),0,IF(ISERROR(K501),J501,SMALL(J501:K501,1)))","v":2},{"$f":"IF($C501=1,OFFSET(E501,-1,0)+1,OFFSET(E501,-1,0))","v":1},{"$f":"IF($C501=1,0,IF($C501=2,OFFSET(F501,-1,0)+1,OFFSET(F501,-1,0)))","v":18},{"$f":"IF(AND($C501<=2,$C501<>0),0,IF($C501=3,OFFSET(G501,-1,0)+1,OFFSET(G501,-1,0)))","v":1},{"$f":"IF(AND($C501<=3,$C501<>0),0,IF($C501=4,OFFSET(H501,-1,0)+1,OFFSET(H501,-1,0)))","v":0},{"$f":"IF(AND($C501<=4,$C501<>0),0,IF(AND($C501=\"S\",$W501>0),OFFSET(I501,-1,0)+1,OFFSET(I501,-1,0)))","v":0},6,2,"F","Nível 3","Nível 3","1.18.1.","SINAPI",null,"IMPLANTAÇÃO","-",null,null,null,null,""]
["S",3,"S",0,1,18,1,0,0,0,0,"F","Serviço","Serviço","1.18.1.0.1.","SINAPI",98504,"PLANTIO DE GRAMA EM PLACAS. AF_05/2018","M2",69.25,null,null,null,""]
[3,{"$f":"IF(OR(C503=\"s\",C503=0),OFFSET(B503,-1,0),C503)","v":3},{"$f":"IF(OFFSET(C503,-1,0)=\"L\",1,IF(OFFSET(C503,-1,0)=1,2,IF(OR(A503=\"s\",A503=0),\"S\",IF(AND(OFFSET(C503,-1,0)=2,A503=4),3,IF(AND(OR(OFFSET(C503,-1,0)=\"s\",OFFSET(C503,-1,0)=0),A503<>\"s\",A503>OFFSET(B503,-1,0)),OFFSET(B503,-1,0),A503)))))","v":3},{"$f":"IF(OR(C503=\"S\",C503=0),0,IF(ISERROR(K503),J503,SMALL(J503:K503,1)))","v":4},{"$f":"IF($C503=1,OFFSET(E503,-1,0)+1,OFFSET(E503,-1,0))","v":1},{"$f":"IF($C503=1,0,IF($C503=2,OFFSET(F503,-1,0)+1,OFFSET(F503,-1,0)))","v":18},{"$f":"IF(AND($C503<=2,$C503<>0),0,IF($C503=3,OFFSET(G503,-1,0)+1,OFFSET(G503,-1,0)))","v":2},{"$f":"IF(AND($C503<=3,$C503<>0),0,IF($C503=4,OFFSET(H503,-1,0)+1,OFFSET(H503,-1,0)))","v":0},{"$f":"IF(AND($C503<=4,$C503<>0),0,IF(AND($C503=\"S\",$W503>0),OFFSET(I503,-1,0)+1,OFFSET(I503,-1,0)))","v":0},4,30,"F","Nível 3","Nível 3","1.18.2.","SINAPI",null,"CANALETA COM GRELHA","-",null,null,null,null,""]
["S",{"$f":"IF(OR(C504=\"s\",C504=0),OFFSET(B504,-1,0),C504)","v":3},{"$f":"IF(OFFSET(C504,-1,0)=\"L\",1,IF(OFFSET(C504,-1,0)=1,2,IF(OR(A504=\"s\",A504=0),\"S\",IF(AND(OFFSET(C504,-1,0)=2,A504=4),3,IF(AND(OR(OFFSET(C504,-1,0)=\"s\",OFFSET(C504,-1,0)=0),A504<>\"s\",A504>OFFSET(B504,-1,0)),OFFSET(B504,-1,0),A504)))))","v":"S"},{"$f":"IF(OR(C504=\"S\",C504=0),0,IF(ISERROR(K504),J504,SMALL(J504:K504,1)))","v":0},{"$f":"IF($C504=1,OFFSET(E504,-1,0)+1,OFFSET(E504,-1,0))","v":1},{"$f":"IF($C504=1,0,IF($C504=2,OFFSET(F504,-1,0)+1,OFFSET(F504,-1,0)))","v":18},{"$f":"IF(AND($C504<=2,$C504<>0),0,IF($C504=3,OFFSET(G504,-1,0)+1,OFFSET(G504,-1,0)))","v":2},{"$f":"IF(AND($C504<=3,$C504<>0),0,IF($C504=4,OFFSET(H504,-1,0)+1,OFFSET(H504,-1,0)))","v":0},{"$f":"IF(AND($C504<=4,$C504<>0),0,IF(AND($C504=\"S\",$W504>0),OFFSET(I504,-1,0)+1,OFFSET(I504,-1,0)))","v":0},0,0,"F","Serviço","Serviço","1.18.2.0.1.","AGETOP",271417,"CANALETA CONCRETO DESEMPENADO 5 CM PD.GOINFRA","m     ",11.11,null,null,null,""]
["S",{"$f":"IF(OR(C505=\"s\",C505=0),OFFSET(B505,-1,0),C505)","v":3},{"$f":"IF(OFFSET(C505,-1,0)=\"L\",1,IF(OFFSET(C505,-1,0)=1,2,IF(OR(A505=\"s\",A505=0),\"S\",IF(AND(OFFSET(C505,-1,0)=2,A505=4),3,IF(AND(OR(OFFSET(C505,-1,0)=\"s\",OFFSET(C505,-1,0)=0),A505<>\"s\",A505>OFFSET(B505,-1,0)),OFFSET(B505,-1,0),A505)))))","v":"S"},{"$f":"IF(OR(C505=\"S\",C505=0),0,IF(ISERROR(K505),J505,SMALL(J505:K505,1)))","v":0},{"$f":"IF($C505=1,OFFSET(E505,-1,0)+1,OFFSET(E505,-1,0))","v":1},{"$f":"IF($C505=1,0,IF($C505=2,OFFSET(F505,-1,0)+1,OFFSET(F505,-1,0)))","v":18},{"$f":"IF(AND($C505<=2,$C505<>0),0,IF($C505=3,OFFSET(G505,-1,0)+1,OFFSET(G505,-1,0)))","v":2},{"$f":"IF(AND($C505<=3,$C505<>0),0,IF($C505=4,OFFSET(H505,-1,0)+1,OFFSET(H505,-1,0)))","v":0},{"$f":"IF(AND($C505<=4,$C505<>0),0,IF(AND($C505=\"S\",$W505>0),OFFSET(I505,-1,0)+1,OFFSET(I505,-1,0)))","v":0},0,0,"F","Serviço","Serviço","1.18.2.0.2.","AGETOP",180323,"GRELHA PADRÃO GOINFRA DE FERRO CHATO COM BERÇO (ESPAÇAMENTO ENTRE FACES = 1,5CM - NBR 9050 ACESSIBILIDADE)","m2    ",4.45,null,null,null,""]
["S",3,"S",0,1,18,2,0,0,0,0,"F","Serviço","Serviço","1.18.2.0.3.","AGETOP",270501,"LIMPEZA FINAL DE OBRA - (OBRAS CIVIS)","m2    ",545,null,null,null,""]
[1,1,1,186,2,0,0,0,0,235,186,"F","Nível 1","Nível 1","2.","SINAPI",null,"COZINHA / REFEITORIO PADRÃO 2009 MODIFICADO","-",null,null,null,null,""]
[2,2,2,2,2,1,0,0,0,185,2,"F","Nível 2","Nível 2","2.1.","AGETOP",null,"SERVIÇOS PRELIMINARES","-",null,null,null,null,""]
[{"$f":"CHOOSE(1+LOG(1+2*(ORÇAMENTO.Nivel=\"Nível 1\")+4*(ORÇAMENTO.Nivel=\"Nível 2\")+8*(ORÇAMENTO.Nivel=\"Nível 3\")+16*(ORÇAMENTO.Nivel=\"Nível 4\")+32*(ORÇAMENTO.Nivel=\"Serviço\"),2),0,1,2,3,4,\"S\")","v":"S"},2,"S",0,2,1,0,0,0,0,0,"F","Serviço","Serviço","2.1.0.0.1.","AGETOP",20701,"LOCAÇÃO DA OBRA, EXECUÇÃO DE GABARITO SEM REAPROVEITAMENTO, INCLUSO PINTURA (FACE INTERNA DO RIPÃO 15CM) E PIQUETE COM TESTEMUNHA","m2    ",139.75,null,null,null,""]
[2,2,2,3,2,2,0,0,0,183,3,"F","Nível 2","Nível 2","2.2.","AGETOP",null,"TRANSPORTES","-",null,null,null,null,""]
["S",2,"S",0,2,2,0,0,0,0,0,"F","Serviço","Serviço","2.2.0.0.1.","SINAPI",72900,"TRANSPORTE DE ENTULHO COM CAMINHAO BASCULANTE 6 M3, RODOVIA PAVIMENTADA, DMT 0,5 A 1,0 KM","M3",9.7799999999999994,null,null,null,""]
["S",2,"S",0,2,2,0,0,0,0,0,"F","Serviço","Serviço","2.2.0.0.2.","SINAPI",72897,"CARGA MANUAL DE ENTULHO EM CAMINHAO BASCULANTE 6 M3","M3",9.7799999999999994,null,null,null,""]
[2,2,2,2,2,3,0,0,0,180,2,"F","Nível 2","Nível 2","2.3.","AGETOP",null,"SERVIÇO EM TERRA","-",null,null,null,null,""]
["S",2,"S",0,2,3,0,0,0,0,0,"F","Serviço","Serviço","2.3.0.0.1.","AGETOP",41002,"APILOAMENTO","m2    ",139.75,null,null,null,""]
[2,2,2,20,2,4,0,0,0,178,20,"F","Nível 2","Nível 2","2.4.","AGETOP",null,"FUNDAÇÕES E SONDAGENS","-",null,null,null,null,""]
[3,3,3,9,2,4,1,0,0,19,9,"F","Nível 3","Nível 3","2.4.1.","SINAPI",null,"ESTACAS E BLOCOS","-",null,null,null,null,""]
["S",3,"S",0,2,4,1,0,0,0,0,"F","Serviço","Serviço","2.4.1.0.1.","SINAPI",98230,"ESTACA BROCA DE CONCRETO, DIÂMETRO DE 30 CM, PROFUNDIDADE DE ATÉ 3 M, ESCAVAÇÃO MANUAL COM TRADO CONCHA, NÃO ARMADA. AF_03/2018","M",101.5,null,null,null,"Referência: AGETOP - 50302"]
["S",3,"S",0,2,4,1,0,0,0,0,"F","Serviço","Serviço","2.4.1.0.2.","SINAPI",96522,"ESCAVAÇÃO MANUAL PARA BLOCO DE COROAMENTO OU SAPATA, SEM PREVISÃO DE FÔRMA. AF_06/2017","M3",5.19,null,null,null,"Referência: AGETOP - 50901"]
["S",3,"S",0,2,4,1,0,0,0,0,"F","Serviço","Serviço","2.4.1.0.3.","SINAPI",94963,"CONCRETO FCK = 15MPA, TRAÇO 1:3,4:3,5 (CIMENTO/ AREIA MÉDIA/ BRITA 1)  - PREPARO MECÂNICO COM BETONEIRA 400 L. AF_07/2016","M3",3.4,null,null,null,""]
["S",3,"S",0,2,4,1,0,0,0,0,"F","Serviço","Serviço","2.4.1.0.4.","SINAPI","74157/4","LANCAMENTO/APLICACAO MANUAL DE CONCRETO EM FUNDACOES","M3",3.4,null,null,null,"Referência: AGETOP - 51026"]
["S",3,"S",0,2,4,1,0,0,0,0,"F","Serviço","Serviço","2.4.1.0.5.","AGETOP",60191,"FORMA DE TABUA CINTA BALDRAME U=8 VEZES","m2    ",23.7,null,null,null,""]
["S",3,"S",0,2,4,1,0,0,0,0,"F","Serviço","Serviço","2.4.1.0.6.","SINAPI",96543,"ARMAÇÃO DE BLOCO, VIGA BALDRAME E SAPATA UTILIZANDO AÇO CA-60 DE 5 MM - MONTAGEM. AF_06/2017","KG",98.2,null,null,null,"Referência: AGETOP - 52014"]
["S",3,"S",0,2,4,1,0,0,0,0,"F","Serviço","Serviço","2.4.1.0.7.","SINAPI",96546,"ARMAÇÃO DE BLOCO, VIGA BALDRAME OU SAPATA UTILIZANDO AÇO CA-50 DE 10 MM - MONTAGEM. AF_06/2017","KG",226.54,null,null,null,"Referência: AGETOP - 52005"]
["S",3,"S",0,2,4,1,0,0,0,0,"F","Serviço","Serviço","2.4.1.0.8.","SINAPI",96547,"ARMAÇÃO DE BLOCO, VIGA BALDRAME OU SAPATA UTILIZANDO AÇO CA-50 DE 12,5 MM - MONTAGEM. AF_06/2017","KG",240,null,null,null,""]
[3,3,3,8,2,4,2,0,0,10,8,"F","Nível 3","Nível 3","2.4.2.","SINAPI",null,"VIGAS BALDRAMES","-",null,null,null,null,""]
["S",3,"S",0,2,4,2,0,0,0,0,"F","Serviço","Serviço","2.4.2.0.1.","AGETOP",60191,"FORMA DE TABUA CINTA BALDRAME U=8 VEZES","m2    ",41.5,null,null,null,""]
["S",3,"S",0,2,4,2,0,0,0,0,"F","Serviço","Serviço","2.4.2.0.2.","SINAPI",94964,"CONCRETO FCK = 20MPA, TRAÇO 1:2,7:3 (CIMENTO/ AREIA MÉDIA/ BRITA 1)  - PREPARO MECÂNICO COM BETONEIRA 400 L. AF_07/2016","M3",2.4,null,null,null,""]
["S",3,"S",0,2,4,2,0,0,0,0,"F","Serviço","Serviço","2.4.2.0.3.","SINAPI","74157/4","LANCAMENTO/APLICACAO MANUAL DE CONCRETO EM FUNDACOES","M3",2.4,null,null,null,"Referência: AGETOP - 51026"]
["S",3,"S",0,2,4,2,0,0,0,0,"F","Serviço","Serviço","2.4.2.0.4.","SINAPI",96544,"ARMAÇÃO DE BLOCO, VIGA BALDRAME OU SAPATA UTILIZANDO AÇO CA-50 DE 6,3 MM - MONTAGEM. AF_06/2017","KG",47,null,null,null,"Referência: AGETOP - 52003"]
["S",3,"S",0,2,4,2,0,0,0,0,"F","Serviço","Serviço","2.4.2.0.5.","SINAPI",96545,"ARMAÇÃO DE BLOCO, VIGA BALDRAME OU SAPATA UTILIZANDO AÇO CA-50 DE 8 MM - MONTAGEM. AF_06/2017","KG",49,null,null,null,"Referência: AGETOP - 52004"]
["S",3,"S",0,2,4,2,0,0,0,0,"F","Serviço","Serviço","2.4.2.0.6.","SINAPI",96546,"ARMAÇÃO DE BLOCO, VIGA BALDRAME OU SAPATA UTILIZANDO AÇO CA-50 DE 10 MM - MONTAGEM. AF_06/2017","KG",38,null,null,null,"Referência: AGETOP - 52005"]
["S",3,"S",0,2,4,2,0,0,0,0,"F","Serviço","Serviço","2.4.2.0.7.","SINAPI",96543,"ARMAÇÃO DE BLOCO, VIGA BALDRAME E SAPATA UTILIZANDO AÇO CA-60 DE 5 MM - MONTAGEM. AF_06/2017","KG",72,null,null,null,"Referência: AGETOP - 52014"]
[3,3,3,2,2,4,3,0,0,2,{"$error":"#N/A"},"F","Nível 3","Nível 3","2.4.3.","SINAPI",null,"OUTROS","-",null,null,null,null,""]
["S",3,"S",0,2,4,3,0,0,0,0,"F","Serviço","Serviço","2.4.3.0.1.","AGETOP",50101,"SONDAGENS P/INTERIOR - (OBRAS CIVIS)","m     ",28,null,null,null,""]
[2,2,2,20,2,5,0,0,0,{"$f":"IF(OR($C535=\"S\",$C535=0),0,MATCH(0,OFFSET($D535,1,$C535,ROW($C$742)-ROW($C535)),0))","v":158},{"$f":"IF(OR($C535=\"S\",$C535=0),0,MATCH(OFFSET($D535,0,$C535)+1,OFFSET($D535,1,$C535,ROW($C$742)-ROW($C535)),0))","v":20},"F","Nível 2","Nível 2","2.5.","AGETOP",null,"ESTRUTURA","-",null,null,null,null,""]
[3,3,3,8,2,5,1,0,0,19,8,"F","Nível 3","Nível 3","2.5.1.","AGETOP",null,"PILAR","-",null,null,null,null,""]
["S",3,"S",0,2,5,1,0,0,0,0,"F","Serviço","Serviço","2.5.1.0.1.","SINAPI",92426,"MONTAGEM E DESMONTAGEM DE FÔRMA DE PILARES RETANGULARES E ESTRUTURAS SIMILARES COM ÁREA MÉDIA DAS SEÇÕES MENOR OU IGUAL A 0,25 M², PÉ-DIREITO SIMPLES, EM CHAPA DE MADEIRA COMPENSADA RESINADA, 8 UTILIZAÇÕES. AF_12/2015","M2",59.6,null,null,null,""]
["S",3,"S",0,2,5,1,0,0,0,0,"F","Serviço","Serviço","2.5.1.0.2.","SINAPI",94964,"CONCRETO FCK = 20MPA, TRAÇO 1:2,7:3 (CIMENTO/ AREIA MÉDIA/ BRITA 1)  - PREPARO MECÂNICO COM BETONEIRA 400 L. AF_07/2016","M3",2.5,null,null,null,""]
["S",3,"S",0,2,5,1,0,0,0,0,"F","Serviço","Serviço","2.5.1.0.3.","SINAPI",92873,"LANÇAMENTO COM USO DE BALDES, ADENSAMENTO E ACABAMENTO DE CONCRETO EM ESTRUTURAS. AF_12/2015","M3",2.5,null,null,null,"Referência: AGETOP - 60801"]
["S",3,"S",0,2,5,1,0,0,0,0,"F","Serviço","Serviço","2.5.1.0.4.","SINAPI",92776,"ARMAÇÃO DE PILAR OU VIGA DE UMA ESTRUTURA CONVENCIONAL DE CONCRETO ARMADO EM UMA EDIFICAÇÃO TÉRREA OU SOBRADO UTILIZANDO AÇO CA-50 DE 6,3 MM - MONTAGEM. AF_12/2015","KG",42,null,null,null,"Referência: AGETOP - 60303"]
["S",3,"S",0,2,5,1,0,0,0,0,"F","Serviço","Serviço","2.5.1.0.5.","SINAPI",92777,"ARMAÇÃO DE PILAR OU VIGA DE UMA ESTRUTURA CONVENCIONAL DE CONCRETO ARMADO EM UMA EDIFICAÇÃO TÉRREA OU SOBRADO UTILIZANDO AÇO CA-50 DE 8,0 MM - MONTAGEM. AF_12/2015","KG",64,null,null,null,"Referência: AGETOP - 60304"]
["S",3,"S",0,2,5,1,0,0,0,0,"F","Serviço","Serviço","2.5.1.0.6.","SINAPI",92778,"ARMAÇÃO DE PILAR OU VIGA DE UMA ESTRUTURA CONVENCIONAL DE CONCRETO ARMADO EM UMA EDIFICAÇÃO TÉRREA OU SOBRADO UTILIZANDO AÇO CA-50 DE 10,0 MM - MONTAGEM. AF_12/2015","KG",165.46,null,null,null,"Referência: AGETOP - 60305"]
["S",3,"S",0,2,5,1,0,0,0,0,"F","Serviço","Serviço","2.5.1.0.7.","SINAPI",92775,"ARMAÇÃO DE PILAR OU VIGA DE UMA ESTRUTURA CONVENCIONAL DE CONCRETO ARMADO EM UMA EDIFICAÇÃO TÉRREA OU SOBRADO UTILIZANDO AÇO CA-60 DE 5,0 MM - MONTAGEM. AF_12/2015","KG",22.8,null,null,null,"Referência: AGETOP - 60314"]
[3,3,3,9,2,5,2,0,0,11,9,"F","Nível 3","Nível 3","2.5.2.",null,null,"VIGA DE COBERTURA","-",null,null,null,null,""]
["S",3,"S",0,2,5,2,0,0,0,0,"F","Serviço","Serviço","2.5.2.0.1.","SINAPI",92464,"MONTAGEM E DESMONTAGEM DE FÔRMA DE VIGA, ESCORAMENTO METÁLICO, PÉ-DIREITO SIMPLES, EM CHAPA DE MADEIRA RESINADA, 8 UTILIZAÇÕES. AF_12/2015","M2",40.9,null,null,null,"Referência: AGETOP - 60209"]
["S",3,"S",0,2,5,2,0,0,0,0,"F","Serviço","Serviço","2.5.2.0.2.","SINAPI",94964,"CONCRETO FCK = 20MPA, TRAÇO 1:2,7:3 (CIMENTO/ AREIA MÉDIA/ BRITA 1)  - PREPARO MECÂNICO COM BETONEIRA 400 L. AF_07/2016","M3",2.4,null,null,null,""]
["S",3,"S",0,2,5,2,0,0,0,0,"F","Serviço","Serviço","2.5.2.0.3.","SINAPI",92873,"LANÇAMENTO COM USO DE BALDES, ADENSAMENTO E ACABAMENTO DE CONCRETO EM ESTRUTURAS. AF_12/2015","M3",2.4,null,null,null,"Referência: AGETOP - 60801"]
["S",3,"S",0,2,5,2,0,0,0,0,"F","Serviço","Serviço","2.5.2.0.4.","SINAPI",92776,"ARMAÇÃO DE PILAR OU VIGA DE UMA ESTRUTURA CONVENCIONAL DE CONCRETO ARMADO EM UMA EDIFICAÇÃO TÉRREA OU SOBRADO UTILIZANDO AÇO CA-50 DE 6,3 MM - MONTAGEM. AF_12/2015","KG",18,null,null,null,"Referência: AGETOP - 60303"]
["S",3,"S",0,2,5,2,0,0,0,0,"F","Serviço","Serviço","2.5.2.0.5.","SINAPI",92777,"ARMAÇÃO DE PILAR OU VIGA DE UMA ESTRUTURA CONVENCIONAL DE CONCRETO ARMADO EM UMA EDIFICAÇÃO TÉRREA OU SOBRADO UTILIZANDO AÇO CA-50 DE 8,0 MM - MONTAGEM. AF_12/2015","KG",35,null,null,null,"Referência: AGETOP - 60304"]
["S",3,"S",0,2,5,2,0,0,0,0,"F","Serviço","Serviço","2.5.2.0.6.","SINAPI",92778,"ARMAÇÃO DE PILAR OU VIGA DE UMA ESTRUTURA CONVENCIONAL DE CONCRETO ARMADO EM UMA EDIFICAÇÃO TÉRREA OU SOBRADO UTILIZANDO AÇO CA-50 DE 10,0 MM - MONTAGEM. AF_12/2015","KG",89,null,null,null,"Referência: AGETOP - 60305"]
["S",3,"S",0,2,5,2,0,0,0,0,"F","Serviço","Serviço","2.5.2.0.7.","SINAPI",92779,"ARMAÇÃO DE PILAR OU VIGA DE UMA ESTRUTURA CONVENCIONAL DE CONCRETO ARMADO EM UMA EDIFICAÇÃO TÉRREA OU SOBRADO UTILIZANDO AÇO CA-50 DE 12,5 MM - MONTAGEM. AF_12/2015","KG",24,null,null,null,""]
["S",3,"S",0,2,5,2,0,0,0,0,"F","Serviço","Serviço","2.5.2.0.8.","SINAPI",92775,"ARMAÇÃO DE PILAR OU VIGA DE UMA ESTRUTURA CONVENCIONAL DE CONCRETO ARMADO EM UMA EDIFICAÇÃO TÉRREA OU SOBRADO UTILIZANDO AÇO CA-60 DE 5,0 MM - MONTAGEM. AF_12/2015","KG",57,null,null,null,"Referência: AGETOP - 60314"]
[3,3,3,2,2,5,3,0,0,2,{"$error":"#N/A"},"F","Nível 3","Nível 3","2.5.3.",null,null,"LAJE","-",null,null,null,null,""]
["S",3,"S",0,2,5,3,0,0,0,0,"F","Serviço","Serviço","2.5.3.0.1.","SINAPI","74202/1","LAJE PRE-MOLDADA P/FORRO, SOBRECARGA 100KG/M2, VAOS ATE 3,50M/E=8CM, C/LAJOTAS E CAP.C/CONC FCK=20MPA, 3CM, INTER-EIXO 38CM, C/ESCORAMENTO (REAPR.3X) E FERRAGEM NEGATIVA","M2",40.75,null,null,null,""]
[2,2,2,28,2,6,0,0,0,138,28,"F","Nível 2","Nível 2","2.6.",null,null,"INSTALAÇÕES ELÉTRICAS","-",null,null,null,null,""]
["S",2,"S",0,2,6,0,0,0,0,0,"F","Serviço","Serviço","2.6.0.0.1.","AGETOP",70421,"BUCHA E ARRUELA METALICA DIAM. 3/4\"","PR    ",3,null,null,null,""]
["S",2,"S",0,2,6,0,0,0,0,0,"F","Serviço","Serviço","2.6.0.0.2.","SINAPI",92868,"CAIXA RETANGULAR 4\" X 2\" MÉDIA (1,30 M DO PISO), METÁLICA, INSTALADA EM PAREDE - FORNECIMENTO E INSTALAÇÃO. AF_12/2015","UN",26,null,null,null,"Referência: AGETOP - 70691"]
["S",2,"S",0,2,6,0,0,0,0,0,"F","Serviço","Serviço","2.6.0.0.3.","SINAPI",92866,"CAIXA SEXTAVADA 3\" X 3\", METÁLICA, INSTALADA EM LAJE - FORNECIMENTO E INSTALAÇÃO. AF_12/2015","UN",10,null,null,null,"Referência: AGETOP - 70680"]
["S",2,"S",0,2,6,0,0,0,0,0,"F","Serviço","Serviço","2.6.0.0.4.","SINAPI",91902,"CURVA 90 GRAUS PARA ELETRODUTO, PVC, ROSCÁVEL, DN 25 MM (3/4\"), PARA CIRCUITOS TERMINAIS, INSTALADA EM LAJE - FORNECIMENTO E INSTALAÇÃO. AF_12/2015","UN",6,null,null,null,"Referência: AGETOP - 71141"]
["S",2,"S",0,2,6,0,0,0,0,0,"F","Serviço","Serviço","2.6.0.0.5.","SINAPI",97585,"LUMINÁRIA TIPO CALHA, DE SOBREPOR, COM 2 LÂMPADAS TUBULARES DE 18 W - FORNECIMENTO E INSTALAÇÃO. AF_11/2017","UN",2,null,null,null,""]
["S",2,"S",0,2,6,0,0,0,0,0,"F","Serviço","Serviço","2.6.0.0.6.","SINAPI",97586,"LUMINÁRIA TIPO CALHA, DE SOBREPOR, COM 2 LÂMPADAS TUBULARES DE 36 W - FORNECIMENTO E INSTALAÇÃO. AF_11/2017","UN",14,null,null,null,""]
["S",2,"S",0,2,6,0,0,0,0,0,"F","Serviço","Serviço","2.6.0.0.7.","SINAPI",97584,"LUMINÁRIA TIPO CALHA, DE SOBREPOR, COM 1 LÂMPADA TUBULAR DE 36 W - FORNECIMENTO E INSTALAÇÃO. AF_11/2017","UN",2,null,null,null,""]
["S",2,"S",0,2,6,0,0,0,0,0,"F","Serviço","Serviço","2.6.0.0.8.","SINAPI",91884,"LUVA PARA ELETRODUTO, PVC, ROSCÁVEL, DN 25 MM (3/4\"), PARA CIRCUITOS TERMINAIS, INSTALADA EM PAREDE - FORNECIMENTO E INSTALAÇÃO. AF_12/2015","UN",3,null,null,null,"Referência: AGETOP - 71741"]
["S",2,"S",0,2,6,0,0,0,0,0,"F","Serviço","Serviço","2.6.0.0.9.","SINAPI",91927,"CABO DE COBRE FLEXÍVEL ISOLADO, 2,5 MM², ANTI-CHAMA 0,6/1,0 KV, PARA CIRCUITOS TERMINAIS - FORNECIMENTO E INSTALAÇÃO. AF_12/2015","M",723.31000000000006,null,null,null,"Referência: AGETOP - 70581"]
["S",2,"S",0,2,6,0,0,0,0,0,"F","Serviço","Serviço","2.6.0.0.10.","SINAPI",91931,"CABO DE COBRE FLEXÍVEL ISOLADO, 6 MM², ANTI-CHAMA 0,6/1,0 KV, PARA CIRCUITOS TERMINAIS - FORNECIMENTO E INSTALAÇÃO. AF_12/2015","M",60.8,null,null,null,"Referência: AGETOP - 70583"]
["S",2,"S",0,2,6,0,0,0,0,0,"F","Serviço","Serviço","2.6.0.0.11.","SINAPI",93654,"DISJUNTOR MONOPOLAR TIPO DIN, CORRENTE NOMINAL DE 16A - FORNECIMENTO E INSTALAÇÃO. AF_04/2016","UN",11,null,null,null,""]
["S",2,"S",0,2,6,0,0,0,0,0,"F","Serviço","Serviço","2.6.0.0.12.","SINAPI",93656,"DISJUNTOR MONOPOLAR TIPO DIN, CORRENTE NOMINAL DE 25A - FORNECIMENTO E INSTALAÇÃO. AF_04/2016","UN",1,null,null,null,""]
["S",2,"S",0,2,6,0,0,0,0,0,"F","Serviço","Serviço","2.6.0.0.13.","SINAPI",93673,"DISJUNTOR TRIPOLAR TIPO DIN, CORRENTE NOMINAL DE 50A - FORNECIMENTO E INSTALAÇÃO. AF_04/2016","UN",1,null,null,null,"Referência: AGETOP - 71174"]
["S",2,"S",0,2,6,0,0,0,0,0,"F","Serviço","Serviço","2.6.0.0.14.","AGETOP",71456,"INTERRUPTOR DIFERENCIAL RESIDUAL (D.R.) TETRAPOLAR DE 40A-30mA","Un    ",1,null,null,null,""]
["S",2,"S",0,2,6,0,0,0,0,0,"F","Serviço","Serviço","2.6.0.0.15.","SINAPI",91844,"ELETRODUTO FLEXÍVEL CORRUGADO, PVC, DN 25 MM (3/4\"), PARA CIRCUITOS TERMINAIS, INSTALADO EM LAJE - FORNECIMENTO E INSTALAÇÃO. AF_12/2015","M",96.82,null,null,null,""]
["S",2,"S",0,2,6,0,0,0,0,0,"F","Serviço","Serviço","2.6.0.0.16.","SINAPI",91846,"ELETRODUTO FLEXÍVEL CORRUGADO, PVC, DN 32 MM (1\"), PARA CIRCUITOS TERMINAIS, INSTALADO EM LAJE - FORNECIMENTO E INSTALAÇÃO. AF_12/2015","M",10.1,null,null,null,""]
["S",2,"S",0,2,6,0,0,0,0,0,"F","Serviço","Serviço","2.6.0.0.17.","SINAPI","73798/1","DUTO ESPIRAL FLEXIVEL SINGELO PEAD D=50MM(2\") REVESTIDO COM PVC COM FIO GUIA DE ACO GALVANIZADO, LANCADO DIRETO NO SOLO, INCL CONEXOES","M",31.1,null,null,null,"Referência: AGETOP - 71197"]
["S",2,"S",0,2,6,0,0,0,0,0,"F","Serviço","Serviço","2.6.0.0.18.","COMPOSIÇÃO","COMP 387_SEE","LÂMPADA LED TUBULAR 18W ","UN ",29,null,null,null,""]
["S",2,"S",0,2,6,0,0,0,0,0,"F","Serviço","Serviço","2.6.0.0.19.","SINAPI",97611,"LÂMPADA COMPACTA FLUORESCENTE DE 15 W, BASE E27 - FORNECIMENTO E INSTALAÇÃO. AF_11/2017","UN",2,null,null,null,"Referência: AGETOP - 71567"]
["S",2,"S",0,2,6,0,0,0,0,0,"F","Serviço","Serviço","2.6.0.0.20.","SINAPI",92000,"TOMADA BAIXA DE EMBUTIR (1 MÓDULO), 2P+T 10 A, INCLUINDO SUPORTE E PLACA - FORNECIMENTO E INSTALAÇÃO. AF_12/2015","UN",3,null,null,null,"Referência: AGETOP - 72578"]
["S",2,"S",0,2,6,0,0,0,0,0,"F","Serviço","Serviço","2.6.0.0.21.","SINAPI",91996,"TOMADA MÉDIA DE EMBUTIR (1 MÓDULO), 2P+T 10 A, INCLUINDO SUPORTE E PLACA - FORNECIMENTO E INSTALAÇÃO. AF_12/2015","UN",14,null,null,null,"Referência: AGETOP - 72578"]
["S",2,"S",0,2,6,0,0,0,0,0,"F","Serviço","Serviço","2.6.0.0.22.","SINAPI",91992,"TOMADA ALTA DE EMBUTIR (1 MÓDULO), 2P+T 10 A, INCLUINDO SUPORTE E PLACA - FORNECIMENTO E INSTALAÇÃO. AF_12/2015","UN",1,null,null,null,""]
["S",2,"S",0,2,6,0,0,0,0,0,"F","Serviço","Serviço","2.6.0.0.23.","SINAPI",91955,"INTERRUPTOR PARALELO (1 MÓDULO), 10A/250V, INCLUINDO SUPORTE E PLACA - FORNECIMENTO E INSTALAÇÃO. AF_12/2015","UN",4,null,null,null,"Referência: AGETOP - 71431"]
["S",2,"S",0,2,6,0,0,0,0,0,"F","Serviço","Serviço","2.6.0.0.24.","SINAPI",91953,"INTERRUPTOR SIMPLES (1 MÓDULO), 10A/250V, INCLUINDO SUPORTE E PLACA - FORNECIMENTO E INSTALAÇÃO. AF_12/2015","UN",5,null,null,null,"Referência: AGETOP - 71440"]
["S",2,"S",0,2,6,0,0,0,0,0,"F","Serviço","Serviço","2.6.0.0.25.","SINAPI",91959,"INTERRUPTOR SIMPLES (2 MÓDULOS), 10A/250V, INCLUINDO SUPORTE E PLACA - FORNECIMENTO E INSTALAÇÃO. AF_12/2015","UN",1,null,null,null,"Referência: AGETOP - 71441"]
["S",2,"S",0,2,6,0,0,0,0,0,"F","Serviço","Serviço","2.6.0.0.26.","SINAPI",96986,"HASTE DE ATERRAMENTO 3/4  PARA SPDA - FORNECIMENTO E INSTALAÇÃO. AF_12/2017","UN",3,null,null,null,""]
["S",2,"S",0,2,6,0,0,0,0,0,"F","Serviço","Serviço","2.6.0.0.27.","SINAPI","74131/4","QUADRO DE DISTRIBUICAO DE ENERGIA DE EMBUTIR, EM CHAPA METALICA, PARA 18 DISJUNTORES TERMOMAGNETICOS MONOPOLARES, COM BARRAMENTO TRIFASICO E NEUTRO, FORNECIMENTO E INSTALACAO","UN",1,null,null,null,""]
[2,2,2,60,2,7,0,0,0,110,60,"F","Nível 2","Nível 2","2.7.",null,null,"INSTALAÇÕES HIDROSSANITÁRIAS","-",null,null,null,null,""]
["S",2,"S",0,2,7,0,0,0,0,0,"F","Serviço","Serviço","2.7.0.0.1.","AGETOP",80502,"VASO SANITARIO","Un    ",1,null,null,null,""]
["S",2,"S",0,2,7,0,0,0,0,0,"F","Serviço","Serviço","2.7.0.0.2.","AGETOP",80510,"ANEL DE VEDAÇÃO PARA VASO SANITÁRIO","Un    ",1,null,null,null,""]
["S",2,"S",0,2,7,0,0,0,0,0,"F","Serviço","Serviço","2.7.0.0.3.","AGETOP",80513,"TUBO PARA VÁLVULA DE DESCARGA ( CURTO 1.1/4\" )","Un    ",1,null,null,null,""]
["S",2,"S",0,2,7,0,0,0,0,0,"F","Serviço","Serviço","2.7.0.0.4.","AGETOP",80514,"TUBO DE LIGACAO PVC CROMADO 1.1/2\" / ESPUDE  - (ENTRADA)","Un    ",1,null,null,null,""]
["S",2,"S",0,2,7,0,0,0,0,0,"F","Serviço","Serviço","2.7.0.0.5.","AGETOP",80517,"VÁLVULA DE DESCARGA DUPLO ACIONAMENTO COM ACABAMENTO CROMADO ANTIVANDALISMO","Un    ",1,null,null,null,""]
["S",2,"S",0,2,7,0,0,0,0,0,"F","Serviço","Serviço","2.7.0.0.6.","AGETOP",80520,"CONJUNTO DE FIXACAO P/VASO SANITARIO (PAR)","CJ    ",1,null,null,null,""]
["S",2,"S",0,2,7,0,0,0,0,0,"F","Serviço","Serviço","2.7.0.0.7.","AGETOP",80526,"ASSENTO EM POLIPROPILENO COM SISTEMA DE FECHAMENTO SUAVE PARA VASO SANITÁRIO","Un    ",1,null,null,null,""]
["S",2,"S",0,2,7,0,0,0,0,0,"F","Serviço","Serviço","2.7.0.0.8.","SINAPI",95544,"PAPELEIRA DE PAREDE EM METAL CROMADO SEM TAMPA, INCLUSO FIXAÇÃO. AF_10/2016","UN",1,null,null,null,""]
["S",2,"S",0,2,7,0,0,0,0,0,"F","Serviço","Serviço","2.7.0.0.9.","COMPOSIÇÃO","COMP 209_SEE","TOALHEIRO PLÁSTICO TIPO DISPENSER PARA PAPEL TOALHA INTERFOLHADO","UN ",1,null,null,null,""]
["S",2,"S",0,2,7,0,0,0,0,0,"F","Serviço","Serviço","2.7.0.0.10.","AGETOP",80542,"LAVATÓRIO MÉDIO SEM COLUNA","Un    ",2,null,null,null,""]
["S",2,"S",0,2,7,0,0,0,0,0,"F","Serviço","Serviço","2.7.0.0.11.","AGETOP",80550,"FIXACAO P/LAVATORIO (PAR)","PAR   ",2,null,null,null,""]
["S",2,"S",0,2,7,0,0,0,0,0,"F","Serviço","Serviço","2.7.0.0.12.","SINAPI",86885,"ENGATE FLEXÍVEL EM PLÁSTICO BRANCO, 1/2\" X 40CM - FORNECIMENTO E INSTALAÇÃO. AF_12/2013","UN",2,null,null,null,""]
["S",2,"S",0,2,7,0,0,0,0,0,"F","Serviço","Serviço","2.7.0.0.13.","SINAPI",86883,"SIFÃO DO TIPO FLEXÍVEL EM PVC 1\u0094 X 1.1/2\u0094 - FORNECIMENTO E INSTALAÇÃO. AF_12/2013","UN",2,null,null,null,""]
["S",2,"S",0,2,7,0,0,0,0,0,"F","Serviço","Serviço","2.7.0.0.14.","SINAPI",86906,"TORNEIRA CROMADA DE MESA, 1/2\" OU 3/4\", PARA LAVATÓRIO, PADRÃO POPULAR - FORNECIMENTO E INSTALAÇÃO. AF_12/2013","UN",2,null,null,null,""]
["S",2,"S",0,2,7,0,0,0,0,0,"F","Serviço","Serviço","2.7.0.0.15.","AGETOP",80580,"VALVULA P/LAVATORIO OU BEBEDOURO METALICO DIAMETRO 1\"","Un    ",2,null,null,null,""]
["S",2,"S",0,2,7,0,0,0,{"$f":"IF(OR($C599=\"S\",$C599=0),0,MATCH(0,OFFSET($D599,1,$C599,ROW($C$742)-ROW($C599)),0))","v":0},{"$f":"IF(OR($C599=\"S\",$C599=0),0,MATCH(OFFSET($D599,0,$C599)+1,OFFSET($D599,1,$C599,ROW($C$742)-ROW($C599)),0))","v":0},"F","Serviço","Serviço","2.7.0.0.16.","SINAPI",86911,"TORNEIRA CROMADA LONGA, DE PAREDE, 1/2\" OU 3/4\", PARA PIA DE COZINHA, PADRÃO POPULAR - FORNECIMENTO E INSTALAÇÃO. AF_12/2013","UN",5,null,null,null,""]
["S",2,"S",0,2,7,0,0,0,0,0,"F","Serviço","Serviço","2.7.0.0.17.","AGETOP",80671,"SIFAO PVC P/PIA 1.1/2\" X 2\"","Un    ",5,null,null,null,""]
["S",2,"S",0,2,7,0,0,0,0,0,"F","Serviço","Serviço","2.7.0.0.18.","SINAPI",86878,"VÁLVULA EM METAL CROMADO TIPO AMERICANA 3.1/2\" X 1.1/2\" PARA PIA - FORNECIMENTO E INSTALAÇÃO. AF_12/2013","UN",5,null,null,null,""]
["S",2,"S",0,2,7,0,0,0,0,0,"F","Serviço","Serviço","2.7.0.0.19.","AGETOP",80687,"CUBA INOX 35X40X15CM E=0,6MM-AÇO 304 (CUBA Nº 3)","Un    ",4,null,null,null,""]
["S",2,"S",0,2,7,0,0,0,0,0,"F","Serviço","Serviço","2.7.0.0.20.","AGETOP",80693,"TANQUE (PANELAO) INOX 60 X 70 X 40 CM CH.18","Un    ",1,null,null,null,""]
["S",2,"S",0,2,7,0,0,0,0,0,"F","Serviço","Serviço","2.7.0.0.21.","AGETOP",80819,"SIFÃO METÁLICO PARA TANQUE DE 1 1/4\" X 1 1/2\"","un    ",1,null,null,null,""]
["S",2,"S",0,2,7,0,0,0,0,0,"F","Serviço","Serviço","2.7.0.0.22.","AGETOP",80830,"VALVULA P/TANQUE METALICA DIAM.1\" S/LADRAO","Un    ",1,null,null,null,""]
["S",2,"S",0,2,7,0,0,0,0,0,"F","Serviço","Serviço","2.7.0.0.23.","AGETOP",81846,"CAIXA DE GORDURA E INSPEÇÃO EM PVC/ABS 19 LITROS COM TAMPA E PORTA TAMPA E CESTO DE LIMPEZA REMOVÍVEL","un    ",1,null,null,null,""]
["S",2,"S",0,2,7,0,0,0,0,0,"F","Serviço","Serviço","2.7.0.0.24.","SINAPI",94495,"REGISTRO DE GAVETA BRUTO, LATÃO, ROSCÁVEL, 1\u0094, INSTALADO EM RESERVAÇÃO DE ÁGUA DE EDIFICAÇÃO QUE POSSUA RESERVATÓRIO DE FIBRA/FIBROCIMENTO \u0096 FORNECIMENTO E INSTALAÇÃO. AF_06/2016","UN",1,null,null,null,"Referência: AGETOP - 80903"]
["S",2,"S",0,2,7,0,0,0,0,0,"F","Serviço","Serviço","2.7.0.0.25.","SINAPI",89353,"REGISTRO DE GAVETA BRUTO, LATÃO, ROSCÁVEL, 3/4\", FORNECIDO E INSTALADO EM RAMAL DE ÁGUA. AF_12/2014","UN",4,null,null,null,"Referência: AGETOP - 80902"]
["S",2,"S",0,2,7,0,0,0,0,0,"F","Serviço","Serviço","2.7.0.0.26.","SINAPI",95141,"ADAPTADOR COM FLANGES LIVRES, PVC, SOLDÁVEL LONGO, DN  25 MM X 3/4 , INSTALADO EM RESERVAÇÃO DE ÁGUA DE EDIFICAÇÃO QUE POSSUA RESERVATÓRIO DE FIBRA/FIBROCIMENTO    FORNECIMENTO E INSTALAÇÃO. AF_06/2016","UN",14,null,null,null,""]
["S",2,"S",0,2,7,0,0,0,0,0,"F","Serviço","Serviço","2.7.0.0.27.","SINAPI",94785,"ADAPTADOR COM FLANGES LIVRES, PVC, SOLDÁVEL LONGO, DN 32 MM X 1 , INSTALADO EM RESERVAÇÃO DE ÁGUA DE EDIFICAÇÃO QUE POSSUA RESERVATÓRIO DE FIBRA/FIBROCIMENTO   FORNECIMENTO E INSTALAÇÃO. AF_06/2016","UN",2,null,null,null,""]
["S",2,"S",0,2,7,0,0,0,0,0,"F","Serviço","Serviço","2.7.0.0.28.","AGETOP",81504,"SOLUCAO LIMPADORA 1000 CM3","Un    ",5,null,null,null,""]
["S",2,"S",0,2,7,0,0,0,0,0,"F","Serviço","Serviço","2.7.0.0.29.","AGETOP",81663,"CORPO CX. SIFONADA DIAM. 150 X 150 X 50","Un    ",2,null,null,null,""]
["S",2,"S",0,2,7,0,0,0,0,0,"F","Serviço","Serviço","2.7.0.0.30.","SINAPI",89708,"CAIXA SIFONADA, PVC, DN 150 X 185 X 75 MM, JUNTA ELÁSTICA, FORNECIDA E INSTALADA EM RAMAL DE DESCARGA OU EM RAMAL DE ESGOTO SANITÁRIO. AF_12/2014","UN",2,null,null,null,""]
["S",2,"S",0,2,7,0,0,0,0,0,"F","Serviço","Serviço","2.7.0.0.31.","AGETOP",81771,"GRELHA QUADRADA BRANCA DIAM. 150 MM","Un    ",2,null,null,null,""]
["S",2,"S",0,2,7,0,0,0,0,0,"F","Serviço","Serviço","2.7.0.0.32.","AGETOP",81885,"TERMINAL DE VENTILACAO DIAMETRO 50 MM","Un    ",1,null,null,null,""]
["S",2,"S",0,2,7,0,0,0,0,0,"F","Serviço","Serviço","2.7.0.0.33.","AGETOP",81831,"CAIXA DE INSPEÇÃO - ALVENARIA DE 1/2 VEZ COM REVESTIMENTO INTERNO EM REBOCO PAULISTA A-14 (COM ADIÇÃO DE IMPERMEABILIZANTE)","m2    ",3,null,null,null,""]
["S",2,"S",0,2,7,0,0,0,0,0,"F","Serviço","Serviço","2.7.0.0.34.","AGETOP",81825,"CAIXA DE PASSAGEM 60 X 60 CM SEM TAMPA","Un    ",5,null,null,null,""]
["S",2,"S",0,2,7,0,0,0,0,0,"F","Serviço","Serviço","2.7.0.0.35.","AGETOP",81826,"TAMPA EM CONCRETO ARMADO 25 MPA E=5CM PARA A CAIXA DE PASSAGEM 60X60CM","Un    ",5,null,null,null,""]
["S",2,"S",0,2,7,0,0,0,0,0,"F","Serviço","Serviço","2.7.0.0.36.","SINAPI",89402,"TUBO, PVC, SOLDÁVEL, DN 25MM, INSTALADO EM RAMAL DE DISTRIBUIÇÃO DE ÁGUA - FORNECIMENTO E INSTALAÇÃO. AF_12/2014","M",25,null,null,null,"Referência: AGETOP - 81003"]
["S",2,"S",0,2,7,0,0,0,0,0,"F","Serviço","Serviço","2.7.0.0.37.","SINAPI",89403,"TUBO, PVC, SOLDÁVEL, DN 32MM, INSTALADO EM RAMAL DE DISTRIBUIÇÃO DE ÁGUA - FORNECIMENTO E INSTALAÇÃO. AF_12/2014","M",20,null,null,null,"Referência: AGETOP - 81004"]
["S",2,"S",0,2,7,0,0,0,0,0,"F","Serviço","Serviço","2.7.0.0.38.","SINAPI",89617,"TE, PVC, SOLDÁVEL, DN 25MM, INSTALADO EM PRUMADA DE ÁGUA - FORNECIMENTO E INSTALAÇÃO. AF_12/2014","UN",3,null,null,null,""]
["S",2,"S",0,2,7,0,0,0,0,0,"F","Serviço","Serviço","2.7.0.0.39.","SINAPI",89620,"TE, PVC, SOLDÁVEL, DN 32MM, INSTALADO EM PRUMADA DE ÁGUA - FORNECIMENTO E INSTALAÇÃO. AF_12/2014","UN",3,null,null,null,"Referência: AGETOP - 81403"]
["S",2,"S",0,2,7,0,0,0,0,0,"F","Serviço","Serviço","2.7.0.0.40.","SINAPI",89622,"TÊ DE REDUÇÃO, PVC, SOLDÁVEL, DN 32MM X 25MM, INSTALADO EM PRUMADA DE ÁGUA - FORNECIMENTO E INSTALAÇÃO. AF_12/2014","UN",2,null,null,null,"Referência: AGETOP - 81421"]
["S",2,"S",0,2,7,0,0,0,0,0,"F","Serviço","Serviço","2.7.0.0.41.","SINAPI",89802,"JOELHO 45 GRAUS, PVC, SERIE NORMAL, ESGOTO PREDIAL, DN 50 MM, JUNTA ELÁSTICA, FORNECIDO E INSTALADO EM PRUMADA DE ESGOTO SANITÁRIO OU VENTILAÇÃO. AF_12/2014","UN",7,null,null,null,""]
["S",2,"S",0,2,7,0,0,0,0,0,"F","Serviço","Serviço","2.7.0.0.42.","SINAPI",89724,"JOELHO 90 GRAUS, PVC, SERIE NORMAL, ESGOTO PREDIAL, DN 40 MM, JUNTA SOLDÁVEL, FORNECIDO E INSTALADO EM RAMAL DE DESCARGA OU RAMAL DE ESGOTO SANITÁRIO. AF_12/2014","UN",12,null,null,null,""]
["S",2,"S",0,2,7,0,0,0,0,0,"F","Serviço","Serviço","2.7.0.0.43.","SINAPI",89731,"JOELHO 90 GRAUS, PVC, SERIE NORMAL, ESGOTO PREDIAL, DN 50 MM, JUNTA ELÁSTICA, FORNECIDO E INSTALADO EM RAMAL DE DESCARGA OU RAMAL DE ESGOTO SANITÁRIO. AF_12/2014","UN",3,null,null,null,""]
["S",2,"S",0,2,7,0,0,0,0,0,"F","Serviço","Serviço","2.7.0.0.44.","AGETOP",81973,"JUNCAO SIMPLES DIAM. 100 X 50 MM","Un    ",1,null,null,null,""]
["S",2,"S",0,2,7,0,0,0,0,0,"F","Serviço","Serviço","2.7.0.0.45.","SINAPI",89834,"JUNÇÃO SIMPLES, PVC, SERIE NORMAL, ESGOTO PREDIAL, DN 100 X 100 MM, JUNTA ELÁSTICA, FORNECIDO E INSTALADO EM PRUMADA DE ESGOTO SANITÁRIO OU VENTILAÇÃO. AF_12/2014","UN",1,null,null,null,""]
["S",2,"S",0,2,7,0,0,0,0,0,"F","Serviço","Serviço","2.7.0.0.46.","AGETOP",81981,"JUNÇÃO DUPLA DIAMETRO 75 MM","Un    ",1,null,null,null,""]
["S",2,"S",0,2,7,0,0,0,0,0,"F","Serviço","Serviço","2.7.0.0.47.","SINAPI",89753,"LUVA SIMPLES, PVC, SERIE NORMAL, ESGOTO PREDIAL, DN 50 MM, JUNTA ELÁSTICA, FORNECIDO E INSTALADO EM RAMAL DE DESCARGA OU RAMAL DE ESGOTO SANITÁRIO. AF_12/2014","UN",8,null,null,null,"Referência: AGETOP - 82002"]
["S",2,"S",0,2,7,0,0,0,0,0,"F","Serviço","Serviço","2.7.0.0.48.","SINAPI",89778,"LUVA SIMPLES, PVC, SERIE NORMAL, ESGOTO PREDIAL, DN 100 MM, JUNTA ELÁSTICA, FORNECIDO E INSTALADO EM RAMAL DE DESCARGA OU RAMAL DE ESGOTO SANITÁRIO. AF_12/2014","UN",2,null,null,null,"Referência: AGETOP - 82004"]
["S",2,"S",0,2,7,0,0,0,0,0,"F","Serviço","Serviço","2.7.0.0.49.","AGETOP",82051,"PORTA GRELHA QUADRADA BRANCO DIAM. 150 MM","Un    ",2,null,null,null,""]
["S",2,"S",0,2,7,0,0,0,0,0,"F","Serviço","Serviço","2.7.0.0.50.","AGETOP",82103,"REDUCAO EXCENTRICA 100 X 50 MM","Un    ",1,null,null,null,""]
["S",2,"S",0,2,7,0,0,0,0,0,"F","Serviço","Serviço","2.7.0.0.51.","AGETOP",82233,"TE SANITARIO DIAMETRO 100 X 50 MM","Un    ",1,null,null,null,""]
["S",2,"S",0,2,7,0,0,0,0,0,"F","Serviço","Serviço","2.7.0.0.52.","SINAPI",89711,"TUBO PVC, SERIE NORMAL, ESGOTO PREDIAL, DN 40 MM, FORNECIDO E INSTALADO EM RAMAL DE DESCARGA OU RAMAL DE ESGOTO SANITÁRIO. AF_12/2014","M",14,null,null,null,"Referência: AGETOP - 82301"]
["S",2,"S",0,2,7,0,0,0,0,0,"F","Serviço","Serviço","2.7.0.0.53.","SINAPI",89712,"TUBO PVC, SERIE NORMAL, ESGOTO PREDIAL, DN 50 MM, FORNECIDO E INSTALADO EM RAMAL DE DESCARGA OU RAMAL DE ESGOTO SANITÁRIO. AF_12/2014","M",26,null,null,null,"Referência: AGETOP - 82302"]
["S",2,"S",0,2,7,0,0,0,0,0,"F","Serviço","Serviço","2.7.0.0.54.","AGETOP",82374,"TUBO FERRO GALVANIZADO DIAM.3/4\"","m     ",10,null,null,null,""]
["S",2,"S",0,2,7,0,0,0,0,0,"F","Serviço","Serviço","2.7.0.0.55.","SINAPI",83635,"EXTINTOR INCENDIO TP PO QUIMICO 6KG - FORNECIMENTO E INSTALACAO","UN",1,null,null,null,""]
["S",2,"S",0,2,7,0,0,0,0,0,"F","Serviço","Serviço","2.7.0.0.56.","SINAPI",96702,"BUCHA DE REDUÇÃO, PPR, 32 X 25, CLASSE PN 25, INSTALADO EM PRUMADA DE ÁGUA \u0096 FORNECIMENTO E INSTALAÇÃO . AF_06/2015","UN",25,null,null,null,""]
["S",2,"S",0,2,7,0,0,0,0,0,"F","Serviço","Serviço","2.7.0.0.57.","SINAPI",94672,"JOELHO 90 GRAUS COM BUCHA DE LATÃO, PVC, SOLDÁVEL, DN  25 MM, X 3/4\u0094 INSTALADO EM RESERVAÇÃO DE ÁGUA DE EDIFICAÇÃO QUE POSSUA RESERVATÓRIO DE FIBRA/FIBROCIMENTO   FORNECIMENTO E INSTALAÇÃO. AF_06/2016","UN",6,null,null,null,""]
["S",2,"S",0,2,7,0,0,0,0,0,"F","Serviço","Serviço","2.7.0.0.58.","SINAPI",89362,"JOELHO 90 GRAUS, PVC, SOLDÁVEL, DN 25MM, INSTALADO EM RAMAL OU SUB-RAMAL DE ÁGUA - FORNECIMENTO E INSTALAÇÃO. AF_12/2014","UN",6,null,null,null,"Referência: AGETOP - 81321"]
["S",2,"S",0,2,7,0,0,0,0,0,"F","Serviço","Serviço","2.7.0.0.59.","SINAPI",89546,"BUCHA DE REDUÇÃO LONGA, PVC, SERIE R, ÁGUA PLUVIAL, DN 50 X 40 MM, JUNTA ELÁSTICA, FORNECIDO E INSTALADO EM RAMAL DE ENCAMINHAMENTO. AF_12/2014","UN",6,null,null,null,""]
[2,2,2,5,2,8,0,0,0,50,5,"F","Nível 2","Nível 2","2.8.","AGETOP",91045,"ALVENARIAS E DIVISÓRIAS","Un    ",null,null,null,null,""]
["S",2,"S",0,2,8,0,0,0,0,0,"F","Serviço","Serviço","2.8.0.0.1.","SINAPI","73937/1","COBOGO DE CONCRETO (ELEMENTO VAZADO), 7X50X50CM, ASSENTADO COM ARGAMASSA TRACO 1:4 (CIMENTO E AREIA)","M2",16.3,null,null,null,"Referência: AGETOP - 100501"]
["S",2,"S",0,2,8,0,0,0,0,0,"F","Serviço","Serviço","2.8.0.0.2.","SINAPI",72132,"ALVENARIA EM TIJOLO CERAMICO MACICO 5X10X20CM 1/2 VEZ (ESPESSURA 10CM), ASSENTADO COM ARGAMASSA TRACO 1:2:8 (CIMENTO, CAL E AREIA)","M2",17.11,null,null,null,""]
["S",2,"S",0,2,8,0,0,0,0,0,"F","Serviço","Serviço","2.8.0.0.3.","SINAPI",87489,"ALVENARIA DE VEDAÇÃO DE BLOCOS CERÂMICOS FURADOS NA VERTICAL DE 9X19X39CM (ESPESSURA 9CM) DE PAREDES COM ÁREA LÍQUIDA MAIOR OU IGUAL A 6M² COM VÃOS E ARGAMASSA DE ASSENTAMENTO COM PREPARO EM BETONEIRA. AF_06/2014","M2",142.08000000000001,null,null,null,""]
["S",2,"S",0,2,8,0,0,0,0,0,"F","Serviço","Serviço","2.8.0.0.4.","SINAPI",93202,"FIXAÇÃO (ENCUNHAMENTO) DE ALVENARIA DE VEDAÇÃO COM TIJOLO MACIÇO. AF_03/2016","M",27,null,null,null,"Referência: AGETOP - 100204"]
[2,2,2,2,2,9,0,0,0,45,2,"F","Nível 2","Nível 2","2.9.",null,null,"IMPERMEABILIZAÇÃO","-",null,null,null,null,""]
["S",2,"S",0,2,9,0,0,0,0,0,"F","Serviço","Serviço","2.9.0.0.1.","SINAPI",98562,"IMPERMEABILIZAÇÃO DE FLOREIRA OU VIGA BALDRAME COM ARGAMASSA DE CIMENTO E AREIA, COM ADITIVO IMPERMEABILIZANTE, E = 2 CM. AF_06/2018","M2",43.03,null,null,null,"Referência: AGETOP - 120902"]
[2,2,2,2,2,10,0,0,0,43,2,"F","Nível 2","Nível 2","2.10.",null,null,"ESTRUTURAS METÁLICAS","-",null,null,null,null,""]
["S",2,"S",0,2,10,0,0,0,0,0,"F","Serviço","Serviço","2.10.0.0.1.","AGETOP",150103,"ESTRUTURA METÁLICA CONVENCIONAL EM AÇO DO TIPO USI SAC-300 COM FUNDO ANTICORROSIVO","Kg    ",1956.5,null,null,null,""]
[2,2,2,6,2,11,0,0,0,41,6,"F","Nível 2","Nível 2","2.11.",null,null,"COBERTURAS","-",null,null,null,null,""]
[3,3,3,5,2,11,1,0,0,5,22,"F","Nível 3","Nível 3","2.11.1.",null,null,"CERÂMICA","-",null,null,null,null,""]
["S",3,"S",0,2,11,1,0,0,0,0,"F","Serviço","Serviço","2.11.1.0.1.","SINAPI",94445,"TELHAMENTO COM TELHA CERÂMICA CAPA-CANAL, TIPO PLAN, COM ATÉ 2 ÁGUAS, INCLUSO TRANSPORTE VERTICAL. AF_07/2019","M2",182.07,null,null,null,"Referência: AGETOP - 160401"]
["S",3,"S",0,2,11,1,0,0,0,0,"F","Serviço","Serviço","2.11.1.0.2.","SINAPI",94221,"CUMEEIRA PARA TELHA CERÂMICA EMBOÇADA COM ARGAMASSA TRAÇO 1:2:9 (CIMENTO, CAL E AREIA) PARA TELHADOS COM ATÉ 2 ÁGUAS, INCLUSO TRANSPORTE VERTICAL. AF_07/2019","M",17.68,null,null,null,""]
["S",3,"S",0,2,11,1,0,0,0,0,"F","Serviço","Serviço","2.11.1.0.3.","SINAPI",94224,"EMBOÇAMENTO COM ARGAMASSA TRAÇO 1:2:9 (CIMENTO, CAL E AREIA). AF_07/2019","M",20.399999999999999,null,null,null,"Referência: AGETOP - 160403"]
["S",3,"S",0,2,11,1,0,0,0,0,"F","Serviço","Serviço","2.11.1.0.4.","SINAPI",94224,"EMBOÇAMENTO COM ARGAMASSA TRAÇO 1:2:9 (CIMENTO, CAL E AREIA). AF_07/2019","M",35.36,null,null,null,"Referência: AGETOP - 160403"]
[2,2,2,5,2,12,0,0,0,35,5,"F","Nível 2","Nível 2","2.12.",null,null,"ESQUADRIAS METÁLICAS","-",null,null,null,null,""]
[{"$f":"CHOOSE(1+LOG(1+2*(ORÇAMENTO.Nivel=\"Nível 1\")+4*(ORÇAMENTO.Nivel=\"Nível 2\")+8*(ORÇAMENTO.Nivel=\"Nível 3\")+16*(ORÇAMENTO.Nivel=\"Nível 4\")+32*(ORÇAMENTO.Nivel=\"Serviço\"),2),0,1,2,3,4,\"S\")","v":"S"},2,"S",0,2,12,0,0,0,0,0,"F","Serviço","Serviço","2.12.0.0.1.","SINAPI",94570,"JANELA DE ALUMÍNIO DE CORRER, 2 FOLHAS, FIXAÇÃO COM PARAFUSO SOBRE CONTRAMARCO (EXCLUSIVE CONTRAMARCO), COM VIDROS PADRONIZADA. AF_07/2016","M2",5.52,null,null,null,""]
["S",2,"S",0,2,12,0,0,0,0,0,"F","Serviço","Serviço","2.12.0.0.2.","SINAPI","74136/3","PORTA DE ACO CHAPA 24, DE ENROLAR, RAIADA, LARGA COM ACABAMENTO GALVANIZADO NATURAL","M2",5.74,null,null,null,"Referência: AGETOP - 180303"]
["S",2,"S",0,2,12,0,0,0,0,0,"F","Serviço","Serviço","2.12.0.0.3.","SINAPI","73933/4","PORTA DE FERRO DE ABRIR TIPO BARRA CHATA, COM REQUADRO E GUARNICAO COMPLETA","M2",8.64,null,null,null,""]
["S",2,"S",0,2,12,0,0,0,0,0,"F","Serviço","Serviço","2.12.0.0.4.","AGETOP",180307,"PORTAO /CHAPA TRAPEZ / TUBO DE ACO PT-5 C/FERRAGEM","m2    ",4,null,null,null,""]
[2,2,2,2,2,13,0,0,0,{"$f":"IF(OR($C663=\"S\",$C663=0),0,MATCH(0,OFFSET($D663,1,$C663,ROW($C$742)-ROW($C663)),0))","v":30},{"$f":"IF(OR($C663=\"S\",$C663=0),0,MATCH(OFFSET($D663,0,$C663)+1,OFFSET($D663,1,$C663,ROW($C$742)-ROW($C663)),0))","v":2},"F","Nível 2","Nível 2","2.13.",null,null,"VIDROS","-",null,null,null,null,""]
["S",2,"S",0,2,13,0,0,0,0,0,"F","Serviço","Serviço","2.13.0.0.1.","SINAPI",72117,"VIDRO LISO COMUM TRANSPARENTE, ESPESSURA 4MM","M2",5.52,null,null,null,"Referência: AGETOP - 190102"]
[2,2,2,4,2,14,0,0,0,28,4,"F","Nível 2","Nível 2","2.14.",null,null,"REVESTIMENTO DE PAREDE","-",52038270,null,null,null,""]
["S",2,"S",0,2,14,0,0,0,0,0,"F","Serviço","Serviço","2.14.0.0.1.","SINAPI",87553,"EMBOÇO, PARA RECEBIMENTO DE CERÂMICA, EM ARGAMASSA TRAÇO 1:2:8, PREPARO MECÂNICO COM BETONEIRA 400L, APLICADO MANUALMENTE EM FACES INTERNAS DE PAREDES, PARA AMBIENTE COM ÁREA MAIOR QUE 10M2, ESPESSURA DE 10MM, COM EXECUÇÃO DE TALISCAS. AF_06/2014","M2",186.65,null,null,null,""]
["S",2,"S",0,2,14,0,0,0,0,0,"F","Serviço","Serviço","2.14.0.0.2.","SINAPI",87904,"CHAPISCO APLICADO EM ALVENARIA (COM PRESENÇA DE VÃOS) E ESTRUTURAS DE CONCRETO DE FACHADA, COM COLHER DE PEDREIRO.  ARGAMASSA TRAÇO 1:3 COM PREPARO MANUAL. AF_06/2014","M2",284.16000000000003,null,null,null,"Referência: AGETOP - 200101"]
["S",2,"S",0,2,14,0,0,0,0,0,"F","Serviço","Serviço","2.14.0.0.3.","SINAPI",87273,"REVESTIMENTO CERÂMICO PARA PAREDES INTERNAS COM PLACAS TIPO ESMALTADA EXTRA DE DIMENSÕES 33X45 CM APLICADAS EM AMBIENTES DE ÁREA MAIOR QUE 5 M² NA ALTURA INTEIRA DAS PAREDES. AF_06/2014","M2",127.56500000000001,null,null,null,""]
[2,2,2,3,2,15,0,0,0,24,3,"F","Nível 2","Nível 2","2.15.",null,null,"FORROS","-",null,null,null,null,""]
["S",2,"S",0,2,15,0,0,0,0,0,"F","Serviço","Serviço","2.15.0.0.1.","SINAPI",87884,"CHAPISCO APLICADO NO TETO, COM ROLO PARA TEXTURA ACRÍLICA. ARGAMASSA INDUSTRIALIZADA COM PREPARO MANUAL. AF_06/2014","M2",40.75,null,null,null,"Referência: AGETOP - 210102"]
["S",2,"S",0,2,15,0,0,0,0,0,"F","Serviço","Serviço","2.15.0.0.2.","SINAPI",90408,"MASSA ÚNICA, PARA RECEBIMENTO DE PINTURA, EM ARGAMASSA TRAÇO 1:2:8, PREPARO MECÂNICO COM BETONEIRA 400L, APLICADA MANUALMENTE EM TETO, ESPESSURA DE 10MM, COM EXECUÇÃO DE TALISCAS. AF_03/2015","M2",40.75,null,null,null,"Referência: AGETOP - 210401"]
[2,2,2,8,2,16,0,0,0,21,8,"F","Nível 2","Nível 2","2.16.",null,null,"REVESTIMENTO DE PISO","-",null,null,null,null,""]
[3,3,3,2,2,16,1,0,0,7,2,"F","Nível 3","Nível 3","2.16.1.",null,null,"LASTRO","-",null,null,null,null,""]
["S",3,"S",0,2,16,1,0,0,0,0,"F","Serviço","Serviço","2.16.1.0.1.","AGETOP",220101,"LASTRO DE CONCRETO REGULARIZADO IMPERMEABILIZADO 1:3:6 ESP=5CM (BASE)","m2    ",139.75,null,null,null,""]
[3,3,3,3,2,16,2,0,0,5,3,"F","Nível 3","Nível 3","2.16.2.",null,null,"GRANITINA","-",null,null,null,null,""]
["S",3,"S",0,2,16,2,0,0,0,0,"F","Serviço","Serviço","2.16.2.0.1.","SINAPI",84191,"PISO EM GRANILITE, MARMORITE OU GRANITINA ESPESSURA 8 MM, INCLUSO JUNTAS DE DILATACAO PLASTICAS","M2",144.74029999999999,null,null,null,"Referência: AGETOP - 221101"]
["S",3,"S",0,2,16,2,0,0,0,0,"F","Serviço","Serviço","2.16.2.0.2.","AGETOP",221104,"RASPAGEM E APLICAÇÃO RESINA ACRÍLICA DUAS DEMÃOS","m2    ",144.74029999999999,null,null,null,""]
[3,3,3,2,2,16,3,0,0,2,{"$error":"#N/A"},"F","Nível 3","Nível 3","2.16.3.",null,null,"PASSEIO (CALÇADA)","-",null,null,null,null,""]
["S",3,"S",0,2,16,3,0,0,0,0,"F","Serviço","Serviço","2.16.3.0.1.","AGETOP",220100,"PASSEIO PROTECAO EM CONC.DESEMPEN.5 CM 1:2,5:3,5 ( INCLUSO ESPELHO DE 30CM/ESCAVAÇÃO/REATERRO/APILOAMENTO/ATERRO INTERNO)","m2    ",35.04,null,null,null,""]
[2,2,2,2,2,17,0,0,0,13,2,"F","Nível 2","Nível 2","2.17.",null,null,"MARCENARIA","-",null,null,null,null,""]
["S",2,"S",0,2,17,0,0,0,0,0,"F","Serviço","Serviço","2.17.0.0.1.","AGETOP",240209,"PRATELEIRA EST.CAIBRO 4+1 TABUAS APARELHADAS E ENVERNIZADAS","m     ",3.2,null,null,null,""]
[2,2,2,8,2,18,0,0,0,11,8,"F","Nível 2","Nível 2","2.18.",null,null,"PINTURA","-",null,null,null,null,""]
[3,3,3,7,2,18,1,0,0,7,24,"F","Nível 3","Nível 3","2.18.1.",null,null,"ESMALTE SINTÉTICO","-",null,null,null,null,""]
["S",3,"S",0,2,18,1,0,0,0,0,"F","Serviço","Serviço","2.18.1.0.1.","SINAPI",88497,"APLICAÇÃO E LIXAMENTO DE MASSA LÁTEX EM PAREDES, DUAS DEMÃOS. AF_06/2014","M2",128,null,null,null,"Referência: AGETOP - 261300"]
["S",3,"S",0,2,18,1,0,0,0,0,"F","Serviço","Serviço","2.18.1.0.2.","SINAPI",88486,"APLICAÇÃO MANUAL DE PINTURA COM TINTA LÁTEX PVA EM TETO, DUAS DEMÃOS. AF_06/2014","M2",40.75,null,null,null,"Referência: AGETOP - 261307"]
["S",3,"S",0,2,18,1,0,0,0,0,"F","Serviço","Serviço","2.18.1.0.3.","AGETOP",261550,"PINT.ESMALTE SINT.PAREDES - 2 DEM.C/SELADOR","m2    ",87.25,null,null,null,""]
["S",3,"S",0,2,18,1,0,0,0,0,"F","Serviço","Serviço","2.18.1.0.4.","SINAPI",88489,"APLICAÇÃO MANUAL DE PINTURA COM TINTA LÁTEX ACRÍLICA EM PAREDES, DUAS DEMÃOS. AF_06/2014","M2",87.25,null,null,null,"Referência: AGETOP - 261001"]
["S",3,"S",0,2,18,1,0,0,0,0,"F","Serviço","Serviço","2.18.1.0.5.","SINAPI","74145/1","PINTURA ESMALTE FOSCO, DUAS DEMAOS, SOBRE SUPERFICIE METALICA, INCLUSO UMA DEMAO DE FUNDO ANTICORROSIVO. UTILIZACAO DE REVOLVER ( AR-COMPRIMIDO).","M2",87.25,null,null,null,"Referência: AGETOP - 261602"]
["S",3,"S",0,2,18,1,0,0,0,0,"F","Serviço","Serviço","2.18.1.0.6.","SINAPI","74145/1","PINTURA ESMALTE FOSCO, DUAS DEMAOS, SOBRE SUPERFICIE METALICA, INCLUSO UMA DEMAO DE FUNDO ANTICORROSIVO. UTILIZACAO DE REVOLVER ( AR-COMPRIMIDO).","M2",364.14,null,null,null,"Referência: AGETOP - 261602"]
[2,2,2,3,2,19,0,0,0,3,{"$error":"#N/A"},"F","Nível 2","Nível 2","2.19.",null,null,"DIVERSOS","-",null,null,null,null,""]
["S",2,"S",0,2,19,0,0,0,0,0,"F","Serviço","Serviço","2.19.0.0.1.","AGETOP",270501,"LIMPEZA FINAL DE OBRA - (OBRAS CIVIS)","m2    ",139.75,null,null,null,""]
["S",2,"S",0,2,19,0,0,0,0,0,"F","Serviço","Serviço","2.19.0.0.2.","AGETOP",271608,"BANCADA DE GRANITO C/ESPELHO","m2    ",6.8250000000000002,null,null,null,""]
[1,1,1,49,3,0,0,0,0,49,{"$error":"#N/A"},"F","Nível 1","Nível 1","3.","AGETOP",null,"PASSARELA M2 - SEC. XXI - REV. 2015","-",null,null,null,null,""]
[2,2,2,2,3,1,0,0,0,48,2,"F","Nível 2","Nível 2","3.1.","AGETOP",null,"SERVIÇOS PRELIMINARES","-",null,null,null,null,""]
[{"$f":"CHOOSE(1+LOG(1+2*(ORÇAMENTO.Nivel=\"Nível 1\")+4*(ORÇAMENTO.Nivel=\"Nível 2\")+8*(ORÇAMENTO.Nivel=\"Nível 3\")+16*(ORÇAMENTO.Nivel=\"Nível 4\")+32*(ORÇAMENTO.Nivel=\"Serviço\"),2),0,1,2,3,4,\"S\")","v":"S"},2,"S",0,3,1,0,0,0,0,0,"F","Serviço","Serviço","3.1.0.0.1.","SINAPI",99059,"LOCACAO CONVENCIONAL DE OBRA, UTILIZANDO GABARITO DE TÁBUAS CORRIDAS PONTALETADAS A CADA 2,00M -  2 UTILIZAÇÕES. AF_10/2018","M",20.16,null,null,null,""]
[{"$f":"CHOOSE(1+LOG(1+2*(ORÇAMENTO.Nivel=\"Nível 1\")+4*(ORÇAMENTO.Nivel=\"Nível 2\")+8*(ORÇAMENTO.Nivel=\"Nível 3\")+16*(ORÇAMENTO.Nivel=\"Nível 4\")+32*(ORÇAMENTO.Nivel=\"Serviço\"),2),0,1,2,3,4,\"S\")","v":2},2,2,3,3,2,0,0,0,46,3,"F","Nível 2","Nível 2","3.2.","AGETOP",null,"TRANSPORTES","-",null,null,null,null,""]
[{"$f":"CHOOSE(1+LOG(1+2*(ORÇAMENTO.Nivel=\"Nível 1\")+4*(ORÇAMENTO.Nivel=\"Nível 2\")+8*(ORÇAMENTO.Nivel=\"Nível 3\")+16*(ORÇAMENTO.Nivel=\"Nível 4\")+32*(ORÇAMENTO.Nivel=\"Serviço\"),2),0,1,2,3,4,\"S\")","v":"S"},2,"S",0,3,2,0,0,0,0,0,"F","Serviço","Serviço","3.2.0.0.1.","SINAPI",72900,"TRANSPORTE DE ENTULHO COM CAMINHAO BASCULANTE 6 M3, RODOVIA PAVIMENTADA, DMT 0,5 A 1,0 KM","M3",1.41,null,null,null,""]
[{"$f":"CHOOSE(1+LOG(1+2*(ORÇAMENTO.Nivel=\"Nível 1\")+4*(ORÇAMENTO.Nivel=\"Nível 2\")+8*(ORÇAMENTO.Nivel=\"Nível 3\")+16*(ORÇAMENTO.Nivel=\"Nível 4\")+32*(ORÇAMENTO.Nivel=\"Serviço\"),2),0,1,2,3,4,\"S\")","v":"S"},2,"S",0,3,2,0,0,0,0,0,"F","Serviço","Serviço","3.2.0.0.2.","SINAPI",72897,"CARGA MANUAL DE ENTULHO EM CAMINHAO BASCULANTE 6 M3","M3",1.41,null,null,null,""]
[2,2,2,3,3,3,0,0,0,43,3,"F","Nível 2","Nível 2","3.3.","AGETOP",null,"SERVIÇO EM TERRA","-",null,null,null,null,""]
["S",2,"S",0,3,3,0,0,0,0,0,"F","Serviço","Serviço","3.3.0.0.1.","AGETOP",41140,"REGULARIZAÇÃO DO TERRENO SEM APILOAMENTO COM TRANSPORTE MANUAL DA TERRA ESCAVADA ","m2    ",20.16,null,null,null,""]
["S",2,"S",0,3,3,0,0,0,0,0,"F","Serviço","Serviço","3.3.0.0.2.","SINAPI","74005/1","COMPACTACAO MECANICA, SEM CONTROLE DO GC (C/COMPACTADOR PLACA 400 KG)","M3",4.03,null,null,null,"Referência: AGETOP - 41009"]
[2,2,2,19,3,4,0,0,0,40,19,"F","Nível 2","Nível 2","3.4.","AGETOP",null,"FUNDAÇÕES E SONDAGENS","-",null,null,null,null,""]
[3,3,3,4,3,4,1,0,0,18,4,"F","Nível 3","Nível 3","3.4.1.","SINAPI",null,"ESTACAS","-",null,null,null,null,""]
["S",3,"S",0,3,4,1,0,0,0,0,"F","Serviço","Serviço","3.4.1.0.1.","SINAPI",98228,"ESTACA BROCA DE CONCRETO, DIÃMETRO DE 20 CM, PROFUNDIDADE DE ATÉ 3 M, ESCAVAÇÃO MANUAL COM TRADO CONCHA, NÃO ARMADA. AF_03/2018","M",8,null,null,null,""]
["S",3,"S",0,3,4,1,0,0,0,0,"F","Serviço","Serviço","3.4.1.0.2.","SINAPI",95577,"MONTAGEM DE ARMADURA LONGITUDINAL DE ESTACAS DE SEÇÃO CIRCULAR, DIÂMETRO = 10,0 MM. AF_11/2016","KG",22.68,null,null,null,"Referência: AGETOP - 52005"]
["S",3,"S",0,3,4,1,0,0,0,0,"F","Serviço","Serviço","3.4.1.0.3.","SINAPI",95584,"MONTAGEM DE ARMADURA TRANSVERSAL DE ESTACAS DE SEÇÃO CIRCULAR, DIÂMETRO = 6,3 MM. AF_11/2016","KG",9.5,null,null,null,"Referência: AGETOP - 52003"]
[3,3,3,7,3,4,2,0,0,14,7,"F","Nível 3","Nível 3","3.4.2.","SINAPI",null,"BLOCO","-",null,null,null,null,""]
["S",3,"S",0,3,4,2,0,0,0,0,"F","Serviço","Serviço","3.4.2.0.1.","SINAPI",96522,"ESCAVAÇÃO MANUAL PARA BLOCO DE COROAMENTO OU SAPATA, SEM PREVISÃO DE FÔRMA. AF_06/2017","M3",0.5,null,null,null,"Referência: AGETOP - 50901"]
["S",3,"S",0,3,4,2,0,0,0,0,"F","Serviço","Serviço","3.4.2.0.2.","SINAPI",96619,"LASTRO DE CONCRETO MAGRO, APLICADO EM BLOCOS DE COROAMENTO OU SAPATAS, ESPESSURA DE 5 CM. AF_08/2017","M2",0.05,null,null,null,""]
["S",3,"S",0,3,4,2,0,0,0,0,"F","Serviço","Serviço","3.4.2.0.3.","SINAPI",96547,"ARMAÇÃO DE BLOCO, VIGA BALDRAME OU SAPATA UTILIZANDO AÇO CA-50 DE 12,5 MM - MONTAGEM. AF_06/2017","KG",11.2,null,null,null,""]
["S",3,"S",0,3,4,2,0,0,0,0,"F","Serviço","Serviço","3.4.2.0.4.","SINAPI",96543,"ARMAÇÃO DE BLOCO, VIGA BALDRAME E SAPATA UTILIZANDO AÇO CA-60 DE 5 MM - MONTAGEM. AF_06/2017","KG",9.98,null,null,null,"Referência: AGETOP - 52014"]
["S",3,"S",0,3,4,2,0,0,0,0,"F","Serviço","Serviço","3.4.2.0.5.","SINAPI",94965,"CONCRETO FCK = 25MPA, TRAÇO 1:2,3:2,7 (CIMENTO/ AREIA MÉDIA/ BRITA 1)  - PREPARO MECÂNICO COM BETONEIRA 400 L. AF_07/2016","M3",0.45,null,null,null,""]
["S",3,"S",0,3,4,2,0,0,0,0,"F","Serviço","Serviço","3.4.2.0.6.","SINAPI","74157/4","LANCAMENTO/APLICACAO MANUAL DE CONCRETO EM FUNDACOES","M3",0.45,null,null,null,"Referência: AGETOP - 51026"]
[3,3,3,7,3,4,3,0,0,7,{"$error":"#N/A"},"F","Nível 3","Nível 3","3.4.3.","SINAPI",null,"RADIER","-",null,null,null,null,""]
["S",3,"S",0,3,4,3,0,0,0,0,"F","Serviço","Serviço","3.4.3.0.1.","SINAPI",97086,"FABRICAÇÃO, MONTAGEM E DESMONTAGEM DE FORMA PARA RADIER, EM MADEIRA SERRADA, 4 UTILIZAÇÕES. AF_09/2017","M2",1.4,null,null,null,""]
["S",3,"S",0,3,4,3,0,0,0,0,"F","Serviço","Serviço","3.4.3.0.2.","SINAPI",97084,"COMPACTAÇÃO MECÂNICA DE SOLO PARA EXECUÇÃO DE RADIER, COM COMPACTADOR DE SOLOS TIPO PLACA VIBRATÓRIA. AF_09/2017","M2",20.16,null,null,null,""]
["S",3,"S",0,3,4,3,0,0,0,0,"F","Serviço","Serviço","3.4.3.0.3.","AGETOP",220101,"LASTRO DE CONCRETO REGULARIZADO IMPERMEABILIZADO 1:3:6 ESP=5CM (BASE)","m2    ",20.16,null,null,null,""]
["S",3,"S",0,3,4,3,0,0,0,0,"F","Serviço","Serviço","3.4.3.0.4.","SINAPI",96543,"ARMAÇÃO DE BLOCO, VIGA BALDRAME E SAPATA UTILIZANDO AÇO CA-60 DE 5 MM - MONTAGEM. AF_06/2017","KG",42.48,null,null,null,"Referência: AGETOP - 52014"]
["S",3,"S",0,3,4,3,0,0,0,0,"F","Serviço","Serviço","3.4.3.0.5.","SINAPI",94965,"CONCRETO FCK = 25MPA, TRAÇO 1:2,3:2,7 (CIMENTO/ AREIA MÉDIA/ BRITA 1)  - PREPARO MECÂNICO COM BETONEIRA 400 L. AF_07/2016","M3",1.41,null,null,null,""]
["S",3,"S",0,3,4,3,0,0,0,0,"F","Serviço","Serviço","3.4.3.0.6.","SINAPI","74157/4","LANCAMENTO/APLICACAO MANUAL DE CONCRETO EM FUNDACOES","M3",1.41,null,null,null,"Referência: AGETOP - 51026"]
[2,2,2,5,3,5,0,0,0,21,5,"F","Nível 2","Nível 2","3.5.","AGETOP",null,"ESTRUTURA","-",null,null,null,null,""]
[3,3,3,4,3,5,1,0,0,4,9,"F","Nível 3","Nível 3","3.5.1.","AGETOP",null,"PILARES","-",null,null,null,null,""]
["S",3,"S",0,3,5,1,0,0,0,0,"F","Serviço","Serviço","3.5.1.0.1.","SINAPI",92426,"MONTAGEM E DESMONTAGEM DE FÔRMA DE PILARES RETANGULARES E ESTRUTURAS SIMILARES COM ÁREA MÉDIA DAS SEÇÕES MENOR OU IGUAL A 0,25 M², PÉ-DIREITO SIMPLES, EM CHAPA DE MADEIRA COMPENSADA RESINADA, 8 UTILIZAÇÕES. AF_12/2015","M2",1.28,null,null,null,""]
["S",3,"S",0,3,5,1,0,0,0,0,"F","Serviço","Serviço","3.5.1.0.2.","SINAPI",94965,"CONCRETO FCK = 25MPA, TRAÇO 1:2,3:2,7 (CIMENTO/ AREIA MÉDIA/ BRITA 1)  - PREPARO MECÂNICO COM BETONEIRA 400 L. AF_07/2016","M3",0.11,null,null,null,""]
["S",3,"S",0,3,5,1,0,0,0,0,"F","Serviço","Serviço","3.5.1.0.3.","SINAPI",92873,"LANÇAMENTO COM USO DE BALDES, ADENSAMENTO E ACABAMENTO DE CONCRETO EM ESTRUTURAS. AF_12/2015","M3",0.11,null,null,null,"Referência: AGETOP - 60801"]
[2,2,2,2,3,6,0,0,0,16,2,"F","Nível 2","Nível 2","3.6.",null,null,"ESTRUTURAS METÁLICAS","-",null,null,null,null,""]
["S",2,"S",0,3,6,0,0,{"$f":"IF(AND($C727<=4,$C727<>0),0,IF(AND($C727=\"S\",$W727>0),OFFSET(I727,-1,0)+1,OFFSET(I727,-1,0)))","v":0},{"$f":"IF(OR($C727=\"S\",$C727=0),0,MATCH(0,OFFSET($D727,1,$C727,ROW($C$742)-ROW($C727)),0))","v":0},{"$f":"IF(OR($C727=\"S\",$C727=0),0,MATCH(OFFSET($D727,0,$C727)+1,OFFSET($D727,1,$C727,ROW($C$742)-ROW($C727)),0))","v":0},"F","Serviço","Serviço","3.6.0.0.1.","AGETOP",150204,"ESTRUTURA METÁLICA CONVENCIONAL EM AÇO DO TIPO MR-250 / ASTM A36 COM FUNDO ANTICORROSIVO","Kg    ",369.88,null,null,null,""]
[2,2,2,5,3,7,0,0,0,14,5,"F","Nível 2","Nível 2","3.7.",null,null,"COBERTURAS","-",null,null,null,null,""]
[3,3,3,2,3,7,1,0,0,4,2,"F","Nível 3","Nível 3","3.7.1.",null,null,"METÁLICA","-",null,null,null,null,""]
["S",{"$f":"IF(OR(C730=\"s\",C730=0),OFFSET(B730,-1,0),C730)","v":3},{"$f":"IF(OFFSET(C730,-1,0)=\"L\",1,IF(OFFSET(C730,-1,0)=1,2,IF(OR(A730=\"s\",A730=0),\"S\",IF(AND(OFFSET(C730,-1,0)=2,A730=4),3,IF(AND(OR(OFFSET(C730,-1,0)=\"s\",OFFSET(C730,-1,0)=0),A730<>\"s\",A730>OFFSET(B730,-1,0)),OFFSET(B730,-1,0),A730)))))","v":"S"},{"$f":"IF(OR(C730=\"S\",C730=0),0,IF(ISERROR(K730),J730,SMALL(J730:K730,1)))","v":0},{"$f":"IF($C730=1,OFFSET(E730,-1,0)+1,OFFSET(E730,-1,0))","v":3},{"$f":"IF($C730=1,0,IF($C730=2,OFFSET(F730,-1,0)+1,OFFSET(F730,-1,0)))","v":7},{"$f":"IF(AND($C730<=2,$C730<>0),0,IF($C730=3,OFFSET(G730,-1,0)+1,OFFSET(G730,-1,0)))","v":1},{"$f":"IF(AND($C730<=3,$C730<>0),0,IF($C730=4,OFFSET(H730,-1,0)+1,OFFSET(H730,-1,0)))","v":0},0,0,0,"F","Serviço","Serviço","3.7.1.0.1.","AGETOP",160967,"COBERTURA COM TELHA CHAPA GALVANIZADA  TRAPEZOIDAL 0,5 MM COM ACESSÓRIOS","m2    ",25.92,null,null,null,""]
[3,3,3,2,3,7,2,0,0,2,{"$error":"#N/A"},"F","Nível 3","Nível 3","3.7.2.",null,null,"CALHA E RUFO","-",null,null,null,null,""]
["S",3,"S",0,3,7,2,0,0,0,0,"F","Serviço","Serviço","3.7.2.0.1.","SINAPI",94228,"CALHA EM CHAPA DE AÇO GALVANIZADO NÚMERO 24, DESENVOLVIMENTO DE 50 CM, INCLUSO TRANSPORTE VERTICAL. AF_07/2019","M",7.2,null,null,null,"Referência: AGETOP - 160601"]
[2,2,2,4,3,8,0,0,0,9,4,"F","Nível 2","Nível 2","3.8.",null,null,"REVESTIMENTO DE PISO","-",null,null,null,null,""]
[3,3,3,3,3,8,1,0,0,3,{"$error":"#N/A"},"F","Nível 3","Nível 3","3.8.1.",null,null,"GRANITINA","-",null,null,null,null,""]
["S",3,"S",0,3,8,1,0,0,0,0,"F","Serviço","Serviço","3.8.1.0.1.","SINAPI",84191,"PISO EM GRANILITE, MARMORITE OU GRANITINA ESPESSURA 8 MM, INCLUSO JUNTAS DE DILATACAO PLASTICAS","M2",20.41,null,null,null,"Referência: AGETOP - 221101"]
["S",3,"S",0,3,8,1,0,0,0,0,"F","Serviço","Serviço","3.8.1.0.2.","AGETOP",221104,"RASPAGEM E APLICAÇÃO RESINA ACRÍLICA DUAS DEMÃOS","m2    ",20.41,null,null,null,""]
[2,2,2,3,3,9,0,0,0,5,3,"F","Nível 2","Nível 2","3.9.",null,null,"PINTURA","-",null,null,null,null,""]
[{"$f":"CHOOSE(1+LOG(1+2*(ORÇAMENTO.Nivel=\"Nível 1\")+4*(ORÇAMENTO.Nivel=\"Nível 2\")+8*(ORÇAMENTO.Nivel=\"Nível 3\")+16*(ORÇAMENTO.Nivel=\"Nível 4\")+32*(ORÇAMENTO.Nivel=\"Serviço\"),2),0,1,2,3,4,\"S\")","v":3},3,3,2,3,9,1,0,0,2,{"$error":"#N/A"},"F","Nível 3","Nível 3","3.9.1.","AGETOP",null,"ESTRUTURA METÁLICA","-",null,null,null,null,""]
[{"$f":"CHOOSE(1+LOG(1+2*(ORÇAMENTO.Nivel=\"Nível 1\")+4*(ORÇAMENTO.Nivel=\"Nível 2\")+8*(ORÇAMENTO.Nivel=\"Nível 3\")+16*(ORÇAMENTO.Nivel=\"Nível 4\")+32*(ORÇAMENTO.Nivel=\"Serviço\"),2),0,1,2,3,4,\"S\")","v":"S"},3,"S",0,3,9,1,0,0,0,0,"F","Serviço","Serviço","3.9.1.0.1.","SINAPI","74145/1","PINTURA ESMALTE FOSCO, DUAS DEMAOS, SOBRE SUPERFICIE METALICA, INCLUSO UMA DEMAO DE FUNDO ANTICORROSIVO. UTILIZACAO DE REVOLVER ( AR-COMPRIMIDO).","M2",32.61,null,null,null,"Referência: AGETOP - 261602"]
[{"$f":"CHOOSE(1+LOG(1+2*(ORÇAMENTO.Nivel=\"Nível 1\")+4*(ORÇAMENTO.Nivel=\"Nível 2\")+8*(ORÇAMENTO.Nivel=\"Nível 3\")+16*(ORÇAMENTO.Nivel=\"Nível 4\")+32*(ORÇAMENTO.Nivel=\"Serviço\"),2),0,1,2,3,4,\"S\")","v":2},2,2,2,3,10,0,0,0,2,{"$error":"#N/A"},"F","Nível 2","Nível 2","3.10.",null,null,"DIVERSOS","-",null,null,null,null,""]
[{"$f":"CHOOSE(1+LOG(1+2*(ORÇAMENTO.Nivel=\"Nível 1\")+4*(ORÇAMENTO.Nivel=\"Nível 2\")+8*(ORÇAMENTO.Nivel=\"Nível 3\")+16*(ORÇAMENTO.Nivel=\"Nível 4\")+32*(ORÇAMENTO.Nivel=\"Serviço\"),2),0,1,2,3,4,\"S\")","v":"S"},2,"S",0,3,10,0,0,0,0,0,"F","Serviço","Serviço","3.10.0.0.1.","AGETOP",270501,"LIMPEZA FINAL DE OBRA - (OBRAS CIVIS)","m2    ",20.16,null,null,null,""]
[-1,null,-1,null,0,0,0,0,0,null,null,"F"]
[null,null,null,null,null,null,null,null,null,null,null,"F",null,null,null,null,null,"OBS: OS QUANTITATIVOS DE MATERIAIS  DAS INSTALAÇÕES HIDROSSANITÁRIAS, ELÉTRICAS E ESPECIAIS SÃO FORNECIDOS PELOS PROFISSIONAIS RESPONSÁVEIS PELOS RESPECTIVOS PROJETOS.",null,null,"VALOR TOTAL"]
[null,null,null,null,null,null,null,null,null,null,null,"F",null,null,null,null,null,null,null,null,"VALOR BDI (26,44%)"]
[null,null,null,null,null,null,null,null,null,null,null,"F",null,null,null,null,null,null,null,null,"TOTAL ORÇAMENTO"]
[null,null,null,null,null,null,null,null,null,null,null,"F"]
[null,null,null,null,null,null,null,null,null,null,null,"F",null,null,null,null,null,null,null,null,"CUSTO POR M2 ³"]
[null,null,null,null,null,null,null,null,null,null,null,"F",null,null,null,null,null,null,null,null,"MATERIAL S/ BDI"]
[null,null,null,null,null,null,null,null,null,null,null,"F",null,null,null,null,null,null,null,null,"MÃO DE OBRA S/ BDI"]
[null,null,null,null,null,null,null,null,null,null,null,"F"]
[null,null,null,null,null,null,null,null,null,null,null,"F",null,null,null,null,"(1) Conforme previsto pelo DECRETO Nº 7.983, DE 8 DE ABRIL DE 2013, os preços adotados são aqueles constantes dos sistemas de referência indicados. Justifica-se o uso dos preços destas composições de custos unitários devido ao seu valor ser menor à mediana de seus correspondentes na tabela SINAPI;"]
[null,null,null,null,null,null,null,null,null,null,null,"F",null,null,null,null,"(2) Optou-se pelo uso das composições de custos da AGETOP para itens não presentes na SINAPI;"]
[null,null,null,null,null,null,null,null,null,null,null,"F",null,null,null,null,"(3) Para itens da AGETOP, os vidros não estão inclusos nas esquadrias e já foram considerados os custos de contramarco para as esquadrias de alumínio;"]
[null,null,null,null,null,null,null,null,null,null,null,"F",null,null,null,null,"(4) Nos casos em que houver execução de granitina e omissão do item AGETOP 221102, considerou-se que o quantitativo para o rodapé, de altura igual a 7cm, foi incorporado na área de piso;"]
[null,null,null,null,null,null,null,null,null,null,null,"F",null,null,null,null,"(5) O custo unitário aproximado por metro quadrado é calculado dividindo-se o valor total do orçamento pela área total de construção."]
[null,null,null,null,null,null,null,null,null,null,null,"F"]
[null,null,null,null,null,null,null,null,null,null,null,"F"]
[]
[null,null,null,null,null,null,null,null,null,null,null,null,null,null,"SOMATÓRIO DE SERVIÇOS"]
[null,null,null,null,null,null,null,null,null,null,null,null,null,null,"ITEM","DESCRIÇÃO DOS SERVIÇOS",null,null,"PREÇO SEM BDI",null,null,"PREÇO COM BDI",null,"PARTICIPAÇÃO ( % )"]
[null,null,null,null,null,null,null,null,null,null,null,null,null,null,"a.","SERVIÇOS PRELIMINARES",null,null,{"$f":"SUMIF($R$19:$R$742,$P761,$W$19:$W$742)","v":0},null,null,{"$f":"ROUND(S761*(1+BDI.Taxa),2)","v":0},null,{"$f":"IFERROR(ROUND($V761*100/$W$745,2),0)","v":0}]
[null,null,null,null,null,null,null,null,null,null,null,null,null,null,"b.","TRANSPORTES",null,null,0,null,null,0,null,{"$f":"IFERROR(ROUND($V762*100/$W$745,2),0)","v":0}]
[null,null,null,null,null,null,null,null,null,null,null,null,null,null,"c.","SERVIÇO EM TERRA",null,null,0,null,null,0,null,0]
[null,null,null,null,null,null,null,null,null,null,null,null,null,null,"d.","FUNDAÇÕES E SONDAGENS",null,null,0,null,null,0,null,0]
[null,null,null,null,null,null,null,null,null,null,null,null,null,null,"e.","ESTRUTURA",null,null,0,null,null,0,null,0]
[null,null,null,null,null,null,null,null,null,null,null,null,null,null,"f.","INSTALAÇÕES ELÉTRICAS",null,null,0,null,null,0,null,0]
[null,null,null,null,null,null,null,null,null,null,null,null,null,null,"g.","INSTALAÇÕES HIDROSSANITÁRIAS",null,null,0,null,null,0,null,0]
[null,null,null,null,null,null,null,null,null,null,null,null,null,null,"h","INSTALAÇÕES ESPECIAIS",null,null,0,null,null,0,null,0]
[null,null,null,null,null,null,null,null,null,null,null,null,null,null,"i.","ALVENARIAS E DIVISÓRIAS",null,null,0,null,null,0,null,0]
[null,null,null,null,null,null,null,null,null,null,null,null,null,null,"j.","ALVENARIA AUTO-PORTANTE",null,null,0,null,null,0,null,0]
[null,null,null,null,null,null,null,null,null,null,null,null,null,null,"k.","IMPERMEABILIZAÇÃO",null,null,0,null,null,0,null,0]
[null,null,null,null,null,null,null,null,null,null,null,null,null,null,"l.","ISOLAMENTO TÉRMICO E ACÚSTICO",null,null,0,null,null,0,null,0]
[null,null,null,null,null,null,null,null,null,null,null,null,null,null,"m.","ESTRUTURA DE MADEIRA",null,null,0,null,null,0,null,0]
[null,null,null,null,null,null,null,null,null,null,null,null,null,null,"n.","ESTRUTURAS METÁLICAS",null,null,0,null,null,0,null,0]
[null,null,null,null,null,null,null,null,null,null,null,null,null,null,"o.","COBERTURAS",null,null,0,null,null,0,null,0]
[null,null,null,null,null,null,null,null,null,null,null,null,null,null,"p.","ESQUADRIAS DE MADEIRA",null,null,0,null,null,0,null,0]
[null,null,null,null,null,null,null,null,null,null,null,null,null,null,"q.","ESQUADRIAS METÁLICAS",null,null,0,null,null,{"$f":"ROUND(S777*(1+BDI.Taxa),2)","v":0},null,0]
[null,null,null,null,null,null,null,null,null,null,null,null,null,null,"r.","VIDROS",null,null,0,null,null,0,null,0]
[null,null,null,null,null,null,null,null,null,null,null,null,null,null,"s.","REVESTIMENTO DE PAREDE",null,null,0,null,null,0,null,0]
[null,null,null,null,null,null,null,null,null,null,null,null,null,null,"t.","FORROS",null,null,0,null,null,0,null,0]
[null,null,null,null,null,null,null,null,null,null,null,null,null,null,"u.","REVESTIMENTO DE PISO",null,null,0,null,null,0,null,0]
[null,null,null,null,null,null,null,null,null,null,null,null,null,null,"v.","FERRAGENS",null,null,0,null,null,0,null,0]
[null,null,null,null,null,null,null,null,null,null,null,null,null,null,"w.","MARCENARIA",null,null,0,null,null,0,null,0]
[null,null,null,null,null,null,null,null,null,null,null,null,null,null,"x.","ADMINISTRAÇÃO",null,null,0,null,null,0,null,0]
[null,null,null,null,null,null,null,null,null,null,null,null,null,null,"y.","PINTURA",null,null,0,null,null,{"$f":"ROUND(S785*(1+BDI.Taxa),2)","v":0},null,0]
[null,null,null,null,null,null,null,null,null,null,null,null,null,null,"z.","DIVERSOS",null,null,0,null,null,{"$f":"IF(S786>0,IF((SUM(V761:W785)+ROUND(S786*(1+BDI.Taxa),2))<>V788,V788-SUM(V761:W785),ROUND(S786*(1+BDI.Taxa),2)),0)","v":0},null,{"$f":"IF(S786>0,IF((SUM(X761:X785)+IFERROR(ROUND($V786*100/$W$745,2),0))<>X788,X788-SUM(X761:X785),IFERROR(ROUND($V786*100/$W$745,2),0)),0)","v":0}]
[null,null,null,null,null,null,null,null,null,null,null,null,null,null,"TOTAL GERAL DO ORÇAMENTO (R$)",null,null,null,{"$f":"SUM(S761:U786)","v":0},null,null,{"$f":"SUM(V761:W786)","v":0},null,{"$f":"SUM(X761:X786)","v":0}]
[null,null,null,null,null,null,null,null,null,null,null,null,null,null,null,null,null,null,{"$f":"$W$743","v":0},null,null,{"$f":"$W$745","v":0},null,100]
[null,null,null,null,null,null,null,null,null,null,null,null,null,null,null,null,null,null,"(TOTAL SEM BDI)",null,null,"(TOTAL COM BDI)",null,"(ARRED porcentagem)"]
[null,null,null,null,null,null,null,null,null,null,null,null,null,null,null,null,null,null,{"$f":"IF(AND(S787=S788,S787>0),\"OK\",\"ERRO\")","v":"ERRO"},null,null,{"$f":"IF(AND(V787=V788,V787>0),\"OK\",\"ERRO\")","v":"ERRO"},null,{"$f":"IF(X787=100,\"OK\",\"ERRO\")","v":"ERRO"}]
[]
[]
[null,null,null,null,null,null,null,null,null,null,null,null,null,null,"RESUMO GERAL DO ORÇAMENTO"]
[null,null,null,null,null,null,null,null,null,null,null,null,null,null,"ITEM","DESCRIÇÃO DOS SERVIÇOS",null,null,"PREÇO SEM BDI",null,null,"PREÇO COM BDI",null,"PARTICIPAÇÃO ( % )"]
[null,null,null,null,null,null,null,null,null,null,null,null,null,null,"1.",{"$f":"IFERROR(VLOOKUP(O795,$O$19:$W$742,4,FALSE),\"\")","v":"REFORMA"},null,null,{"$f":"IF(P796=\"\",$S$816-SUM(OFFSET($S$794:S794,0,0,COUNTA($S$794:S794),1)),SUMIF($R$19:$R$742,$P795,$W$19:$W$742))","v":0},null,null,{"$f":"IF(P796=\"\",$V$816-SUM(OFFSET($V$794:V794,0,0,COUNTA($V$794:V794),1)),ROUND(S795*(1+BDI.Taxa),2))","v":0},null,{"$f":"IF(P796=\"\",$X$816-SUM(OFFSET($X$794:X794,0,0,COUNTA($X$794:X794),1)),ROUND(V795*100/ORÇAMENTO.Totalorçamento,2))","v":{"$error":"#DIV/0!"}}]
[null,null,null,null,null,null,null,null,null,null,null,null,null,null,"2.","COZINHA / REFEITORIO PADRÃO 2009 MODIFICADO",null,null,{"$f":"IF(P797=\"\",$S$816-SUM(OFFSET($S$794:S795,0,0,COUNTA($S$794:S795),1)),SUMIF($R$19:$R$742,$P796,$W$19:$W$742))","v":0},null,null,{"$f":"IF(P797=\"\",$V$816-SUM(OFFSET($V$794:V795,0,0,COUNTA($V$794:V795),1)),ROUND(S796*(1+BDI.Taxa),2))","v":0},null,{"$f":"IF(P797=\"\",$X$816-SUM(OFFSET($X$794:X795,0,0,COUNTA($X$794:X795),1)),ROUND(V796*100/ORÇAMENTO.Totalorçamento,2))","v":{"$error":"#DIV/0!"}}]
[null,null,null,null,null,null,null,null,null,null,null,null,null,null,"3.","PASSARELA M2 - SEC. XXI - REV. 2015",null,null,{"$f":"IF(P798=\"\",$S$816-SUM(OFFSET($S$794:S796,0,0,COUNTA($S$794:S796),1)),SUMIF($R$19:$R$742,$P797,$W$19:$W$742))","v":0},null,null,{"$f":"IF(P798=\"\",$V$816-SUM(OFFSET($V$794:V796,0,0,COUNTA($V$794:V796),1)),ROUND(S797*(1+BDI.Taxa),2))","v":0},null,{"$f":"IF(P798=\"\",$X$816-SUM(OFFSET($X$794:X796,0,0,COUNTA($X$794:X796),1)),ROUND(V797*100/ORÇAMENTO.Totalorçamento,2))","v":{"$error":"#DIV/0!"}}]
[null,null,null,null,null,null,null,null,null,null,null,null,null,null,"4.","",null,null,{"$f":"IF(P799=\"\",$S$816-SUM(OFFSET($S$794:S797,0,0,COUNTA($S$794:S797),1)),SUMIF($R$19:$R$742,$P798,$W$19:$W$742))","v":0},null,null,{"$f":"IF(P799=\"\",$V$816-SUM(OFFSET($V$794:V797,0,0,COUNTA($V$794:V797),1)),ROUND(S798*(1+BDI.Taxa),2))","v":0},null,{"$f":"IF(P799=\"\",$X$816-SUM(OFFSET($X$794:X797,0,0,COUNTA($X$794:X797),1)),ROUND(V798*100/ORÇAMENTO.Totalorçamento,2))","v":{"$error":"#DIV/0!"}}]
[null,null,null,null,null,null,null,null,null,null,null,null,null,null,"5.","",null,null,{"$f":"IF(P800=\"\",$S$816-SUM(OFFSET($S$794:S798,0,0,COUNTA($S$794:S798),1)),SUMIF($R$19:$R$742,$P799,$W$19:$W$742))","v":0},null,null,{"$f":"IF(P800=\"\",$V$816-SUM(OFFSET($V$794:V798,0,0,COUNTA($V$794:V798),1)),ROUND(S799*(1+BDI.Taxa),2))","v":0},null,{"$f":"IF(P800=\"\",$X$816-SUM(OFFSET($X$794:X798,0,0,COUNTA($X$794:X798),1)),ROUND(V799*100/ORÇAMENTO.Totalorçamento,2))","v":{"$error":"#DIV/0!"}}]
[null,null,null,null,null,null,null,null,null,null,null,null,null,null,"6.","",null,null,{"$f":"IF(P801=\"\",$S$816-SUM(OFFSET($S$794:S799,0,0,COUNTA($S$794:S799),1)),SUMIF($R$19:$R$742,$P800,$W$19:$W$742))","v":0},null,null,{"$f":"IF(P801=\"\",$V$816-SUM(OFFSET($V$794:V799,0,0,COUNTA($V$794:V799),1)),ROUND(S800*(1+BDI.Taxa),2))","v":0},null,{"$f":"IF(P801=\"\",$X$816-SUM(OFFSET($X$794:X799,0,0,COUNTA($X$794:X799),1)),ROUND(V800*100/ORÇAMENTO.Totalorçamento,2))","v":{"$error":"#DIV/0!"}}]
[null,null,null,null,null,null,null,null,null,null,null,null,null,null,"7.","",null,null,{"$f":"IF(P802=\"\",$S$816-SUM(OFFSET($S$794:S800,0,0,COUNTA($S$794:S800),1)),SUMIF($R$19:$R$742,$P801,$W$19:$W$742))","v":0},null,null,{"$f":"IF(P802=\"\",$V$816-SUM(OFFSET($V$794:V800,0,0,COUNTA($V$794:V800),1)),ROUND(S801*(1+BDI.Taxa),2))","v":0},null,{"$f":"IF(P802=\"\",$X$816-SUM(OFFSET($X$794:X800,0,0,COUNTA($X$794:X800),1)),ROUND(V801*100/ORÇAMENTO.Totalorçamento,2))","v":{"$error":"#DIV/0!"}}]
[null,null,null,null,null,null,null,null,null,null,null,null,null,null,"8.","",null,null,{"$f":"IF(P803=\"\",$S$816-SUM(OFFSET($S$794:S801,0,0,COUNTA($S$794:S801),1)),SUMIF($R$19:$R$742,$P802,$W$19:$W$742))","v":0},null,null,{"$f":"IF(P803=\"\",$V$816-SUM(OFFSET($V$794:V801,0,0,COUNTA($V$794:V801),1)),ROUND(S802*(1+BDI.Taxa),2))","v":0},null,{"$f":"IF(P803=\"\",$X$816-SUM(OFFSET($X$794:X801,0,0,COUNTA($X$794:X801),1)),ROUND(V802*100/ORÇAMENTO.Totalorçamento,2))","v":{"$error":"#DIV/0!"}}]
[null,null,null,null,null,null,null,null,null,null,null,null,null,null,"9.","",null,null,{"$f":"IF(P804=\"\",$S$816-SUM(OFFSET($S$794:S802,0,0,COUNTA($S$794:S802),1)),SUMIF($R$19:$R$742,$P803,$W$19:$W$742))","v":0},null,null,{"$f":"IF(P804=\"\",$V$816-SUM(OFFSET($V$794:V802,0,0,COUNTA($V$794:V802),1)),ROUND(S803*(1+BDI.Taxa),2))","v":0},null,{"$f":"IF(P804=\"\",$X$816-SUM(OFFSET($X$794:X802,0,0,COUNTA($X$794:X802),1)),ROUND(V803*100/ORÇAMENTO.Totalorçamento,2))","v":{"$error":"#DIV/0!"}}]
[null,null,null,null,null,null,null,null,null,null,null,null,null,null,"10.","",null,null,{"$f":"IF(P805=\"\",$S$816-SUM(OFFSET($S$794:S803,0,0,COUNTA($S$794:S803),1)),SUMIF($R$19:$R$742,$P804,$W$19:$W$742))","v":0},null,null,{"$f":"IF(P805=\"\",$V$816-SUM(OFFSET($V$794:V803,0,0,COUNTA($V$794:V803),1)),ROUND(S804*(1+BDI.Taxa),2))","v":0},null,{"$f":"IF(P805=\"\",$X$816-SUM(OFFSET($X$794:X803,0,0,COUNTA($X$794:X803),1)),ROUND(V804*100/ORÇAMENTO.Totalorçamento,2))","v":{"$error":"#DIV/0!"}}]
[null,null,null,null,null,null,null,null,null,null,null,null,null,null,"11.","",null,null,{"$f":"IF(P806=\"\",$S$816-SUM(OFFSET($S$794:S804,0,0,COUNTA($S$794:S804),1)),SUMIF($R$19:$R$742,$P805,$W$19:$W$742))","v":0},null,null,{"$f":"IF(P806=\"\",$V$816-SUM(OFFSET($V$794:V804,0,0,COUNTA($V$794:V804),1)),ROUND(S805*(1+BDI.Taxa),2))","v":0},null,{"$f":"IF(P806=\"\",$X$816-SUM(OFFSET($X$794:X804,0,0,COUNTA($X$794:X804),1)),ROUND(V805*100/ORÇAMENTO.Totalorçamento,2))","v":{"$error":"#DIV/0!"}}]
[null,null,null,null,null,null,null,null,null,null,null,null,null,null,"12.","",null,null,{"$f":"IF(P807=\"\",$S$816-SUM(OFFSET($S$794:S805,0,0,COUNTA($S$794:S805),1)),SUMIF($R$19:$R$742,$P806,$W$19:$W$742))","v":0},null,null,{"$f":"IF(P807=\"\",$V$816-SUM(OFFSET($V$794:V805,0,0,COUNTA($V$794:V805),1)),ROUND(S806*(1+BDI.Taxa),2))","v":0},null,{"$f":"IF(P807=\"\",$X$816-SUM(OFFSET($X$794:X805,0,0,COUNTA($X$794:X805),1)),ROUND(V806*100/ORÇAMENTO.Totalorçamento,2))","v":{"$error":"#DIV/0!"}}]
[null,null,null,null,null,null,null,null,null,null,null,null,null,null,"13.","",null,null,{"$f":"IF(P808=\"\",$S$816-SUM(OFFSET($S$794:S806,0,0,COUNTA($S$794:S806),1)),SUMIF($R$19:$R$742,$P807,$W$19:$W$742))","v":0},null,null,{"$f":"IF(P808=\"\",$V$816-SUM(OFFSET($V$794:V806,0,0,COUNTA($V$794:V806),1)),ROUND(S807*(1+BDI.Taxa),2))","v":0},null,{"$f":"IF(P808=\"\",$X$816-SUM(OFFSET($X$794:X806,0,0,COUNTA($X$794:X806),1)),ROUND(V807*100/ORÇAMENTO.Totalorçamento,2))","v":{"$error":"#DIV/0!"}}]
[null,null,null,null,null,null,null,null,null,null,null,null,null,null,"14.","",null,null,{"$f":"IF(P809=\"\",$S$816-SUM(OFFSET($S$794:S807,0,0,COUNTA($S$794:S807),1)),SUMIF($R$19:$R$742,$P808,$W$19:$W$742))","v":0},null,null,{"$f":"IF(P809=\"\",$V$816-SUM(OFFSET($V$794:V807,0,0,COUNTA($V$794:V807),1)),ROUND(S808*(1+BDI.Taxa),2))","v":0},null,{"$f":"IF(P809=\"\",$X$816-SUM(OFFSET($X$794:X807,0,0,COUNTA($X$794:X807),1)),ROUND(V808*100/ORÇAMENTO.Totalorçamento,2))","v":{"$error":"#DIV/0!"}}]
[null,null,null,null,null,null,null,null,null,null,null,null,null,null,"15.","",null,null,{"$f":"IF(P810=\"\",$S$816-SUM(OFFSET($S$794:S808,0,0,COUNTA($S$794:S808),1)),SUMIF($R$19:$R$742,$P809,$W$19:$W$742))","v":0},null,null,{"$f":"IF(P810=\"\",$V$816-SUM(OFFSET($V$794:V808,0,0,COUNTA($V$794:V808),1)),ROUND(S809*(1+BDI.Taxa),2))","v":0},null,{"$f":"IF(P810=\"\",$X$816-SUM(OFFSET($X$794:X808,0,0,COUNTA($X$794:X808),1)),ROUND(V809*100/ORÇAMENTO.Totalorçamento,2))","v":{"$error":"#DIV/0!"}}]
[null,null,null,null,null,null,null,null,null,null,null,null,null,null,"16.","",null,null,{"$f":"IF(P811=\"\",$S$816-SUM(OFFSET($S$794:S809,0,0,COUNTA($S$794:S809),1)),SUMIF($R$19:$R$742,$P810,$W$19:$W$742))","v":0},null,null,{"$f":"IF(P811=\"\",$V$816-SUM(OFFSET($V$794:V809,0,0,COUNTA($V$794:V809),1)),ROUND(S810*(1+BDI.Taxa),2))","v":0},null,{"$f":"IF(P811=\"\",$X$816-SUM(OFFSET($X$794:X809,0,0,COUNTA($X$794:X809),1)),ROUND(V810*100/ORÇAMENTO.Totalorçamento,2))","v":{"$error":"#DIV/0!"}}]
[null,null,null,null,null,null,null,null,null,null,null,null,null,null,"17.","",null,null,{"$f":"IF(P812=\"\",$S$816-SUM(OFFSET($S$794:S810,0,0,COUNTA($S$794:S810),1)),SUMIF($R$19:$R$742,$P811,$W$19:$W$742))","v":0},null,null,{"$f":"IF(P812=\"\",$V$816-SUM(OFFSET($V$794:V810,0,0,COUNTA($V$794:V810),1)),ROUND(S811*(1+BDI.Taxa),2))","v":0},null,{"$f":"IF(P812=\"\",$X$816-SUM(OFFSET($X$794:X810,0,0,COUNTA($X$794:X810),1)),ROUND(V811*100/ORÇAMENTO.Totalorçamento,2))","v":{"$error":"#DIV/0!"}}]
[null,null,null,null,null,null,null,null,null,null,null,null,null,null,"18.","",null,null,{"$f":"IF(P813=\"\",$S$816-SUM(OFFSET($S$794:S811,0,0,COUNTA($S$794:S811),1)),SUMIF($R$19:$R$742,$P812,$W$19:$W$742))","v":0},null,null,{"$f":"IF(P813=\"\",$V$816-SUM(OFFSET($V$794:V811,0,0,COUNTA($V$794:V811),1)),ROUND(S812*(1+BDI.Taxa),2))","v":0},null,{"$f":"IF(P813=\"\",$X$816-SUM(OFFSET($X$794:X811,0,0,COUNTA($X$794:X811),1)),ROUND(V812*100/ORÇAMENTO.Totalorçamento,2))","v":{"$error":"#DIV/0!"}}]
[null,null,null,null,null,null,null,null,null,null,null,null,null,null,"19.","",null,null,{"$f":"IF(P814=\"\",$S$816-SUM(OFFSET($S$794:S812,0,0,COUNTA($S$794:S812),1)),SUMIF($R$19:$R$742,$P813,$W$19:$W$742))","v":0},null,null,{"$f":"IF(P814=\"\",$V$816-SUM(OFFSET($V$794:V812,0,0,COUNTA($V$794:V812),1)),ROUND(S813*(1+BDI.Taxa),2))","v":0},null,{"$f":"IF(P814=\"\",$X$816-SUM(OFFSET($X$794:X812,0,0,COUNTA($X$794:X812),1)),ROUND(V813*100/ORÇAMENTO.Totalorçamento,2))","v":{"$error":"#DIV/0!"}}]
[null,null,null,null,null,null,null,null,null,null,null,null,null,null,"20.","",null,null,{"$f":"IF(P815=\"\",$S$816-SUM(OFFSET($S$794:S813,0,0,COUNTA($S$794:S813),1)),SUMIF($R$19:$R$742,$P814,$W$19:$W$742))","v":0},null,null,{"$f":"IF(P815=\"\",$V$816-SUM(OFFSET($V$794:V813,0,0,COUNTA($V$794:V813),1)),ROUND(S814*(1+BDI.Taxa),2))","v":0},null,{"$f":"IF(P815=\"\",$X$816-SUM(OFFSET($X$794:X813,0,0,COUNTA($X$794:X813),1)),ROUND(V814*100/ORÇAMENTO.Totalorçamento,2))","v":{"$error":"#DIV/0!"}}]
[null,null,null,null,null,null,null,null,null,null,null,null,null,null,"TOTAL GERAL DO ORÇAMENTO (R$)",null,null,null,{"$f":"SUM(S795:U814)","v":0},null,null,{"$f":"SUM(V795:W814)","v":0},null,{"$f":"SUM(X795:X814)","v":{"$error":"#DIV/0!"}}]
[null,null,null,null,null,null,null,null,null,null,null,null,null,null,null,null,null,null,{"$f":"$W$743","v":0},null,null,{"$f":"$W$745","v":0},null,100]
[null,null,null,null,null,null,null,null,null,null,null,null,null,null,null,null,null,null,"(TOTAL SEM BDI)",null,null,"(TOTAL COM BDI)",null,"(ARRED porcentagem)"]
[null,null,null,null,null,null,null,null,null,null,null,null,null,null,null,null,null,null,{"$f":"IF(AND(S815=S816,S815>0),\"OK\",\"ERRO\")","v":"ERRO"},null,null,{"$f":"IF(AND(V815=V816,V815>0),\"OK\",\"ERRO\")","v":"ERRO"},null,{"$f":"IF(AND(X815=100,S795<>0),\"OK\",\"ERRO\")","v":{"$error":"#DIV/0!"}}]

{"sheet":"Resumo ","index":1,"n_rows":39,"n_cols":9,"rows_kept":39,"cut":false,"hidden":false,"merged":[[42,3,42,7],[11,1,11,2],[12,1,12,2],[15,2,15,3],[16,2,16,3],[14,1,14,8],[17,2,17,3],[23,2,23,3],[18,2,18,3],[19,2,19,3],[20,2,20,3],[41,3,41,7],[24,2,24,3],[26,2,26,3],[27,2,27,3],[38,1,38,8],[1,1,1,8],[2,6,2,8],[3,6,3,8],[4,1,4,8],[5,6,5,8],[6,6,6,8],[7,1,7,8],[8,6,8,8],[9,6,9,8],[13,1,13,8],[0,1,0,8],[36,1,36,5],[2,1,2,5],[3,1,3,5],[5,1,5,5],[6,1,6,5],[8,1,8,5],[9,1,9,5],[11,3,11,5],[12,3,12,5],[10,1,10,8],[11,6,11,8],[12,6,12,8],[25,2,25,3],[21,2,21,3],[22,2,22,3],[13,0,14,0],[34,2,34,3],[35,2,35,3],[31,2,31,3],[32,2,32,3],[33,2,33,3],[28,2,28,3],[29,2,29,3],[30,2,30,3]]}
[]
[]
[null,"UNIDADE ESCOLAR",null,null,null,null,"CÓDIGO INEP"]
[null,{"$f":"Orçamento!$O$4","v":"CENTRO DE ENSINO EM PERÍODO INTEGRAL PROFESSOR JOAQUIM CARVALHO FERREIRA"},null,null,null,null,{"$f":"Orçamento!V4","v":52033589}]
[]
[null,"OBRA",null,null,null,null,"CIDADE"]
[null,{"$f":"Orçamento!$O$7","v":"REFORMA E AMPLIAÇÃO"},null,null,null,null,{"$f":"Orçamento!$V$7","v":"GOIÂNIA"}]
[]
[null,"ENDEREÇO",null,null,null,null,"CRE"]
[null,{"$f":"Orçamento!$R$10","v":"AV FERNÃO DIAS PAES LEME S/Nº 32, CAPUAVA, CEP:74450-200"},null,null,null,null,{"$f":"Orçamento!$O$10","v":"GOIÂNIA"}]
[]
[null,"REFERÊNCIA",null,"DATA",null,null,"ÁREA TOTAL CONSTRUÍDA (M²)"]
[null,{"$f":"CONCATENATE(\"AGETOP E SINAPI - \",Orçamento!$T$10)","v":"AGETOP E SINAPI - DESONERADA"},null,{"$f":"Orçamento!$S$7","v":"2020-03-25"},null,null,{"$f":"Orçamento!$V$13","v":2969.6299999999997}]
["FILTRO"]
[null,"RESUMO GERAL DO ORÇAMENTO"]
["↓","ITEM","DESCRIÇÃO DOS SERVIÇOS",null,"UNID","QUANT","PREÇO SEM BDI","PREÇO COM BDI","PARTICIP. (%)"]
[{"$f":"IF(E17>0,\"F\",\"\")","v":"F"},"1.",{"$f":"Orçamento!$P795","v":"REFORMA"},null,"UN ",1,{"$f":"IFERROR(Orçamento!S795,\"-\")","v":0},{"$f":"IFERROR(Orçamento!V795,\"\")","v":0},{"$f":"Orçamento!X795","v":{"$error":"#DIV/0!"}}]
[{"$f":"IF(E18>0,\"F\",\"\")","v":"F"},"2.",{"$f":"Orçamento!$P796","v":"COZINHA / REFEITORIO PADRÃO 2009 MODIFICADO"},null,"UN ",1,{"$f":"IFERROR(Orçamento!S796,\"-\")","v":0},{"$f":"IFERROR(Orçamento!V796,\"\")","v":0},{"$f":"Orçamento!X796","v":{"$error":"#DIV/0!"}}]
["F","3.",{"$f":"Orçamento!$P797","v":"PASSARELA M2 - SEC. XXI - REV. 2015"},null,"UN ",1,{"$f":"IFERROR(Orçamento!S797,\"-\")","v":0},{"$f":"IFERROR(Orçamento!V797,\"\")","v":0},{"$f":"Orçamento!X797","v":{"$error":"#DIV/0!"}}]
["","4.",{"$f":"Orçamento!$P798","v":""},null,null,null,{"$f":"IFERROR(Orçamento!S798,\"-\")","v":0},{"$f":"IFERROR(Orçamento!V798,\"\")","v":0},{"$f":"Orçamento!X798","v":{"$error":"#DIV/0!"}}]
["","5.",{"$f":"Orçamento!$P799","v":""},null,null,null,{"$f":"IFERROR(Orçamento!S799,\"-\")","v":0},{"$f":"IFERROR(Orçamento!V799,\"\")","v":0},{"$f":"Orçamento!X799","v":{"$error":"#DIV/0!"}}]
["","6.",{"$f":"Orçamento!$P800","v":""},null,null,null,{"$f":"IFERROR(Orçamento!S800,\"-\")","v":0},{"$f":"IFERROR(Orçamento!V800,\"\")","v":0},{"$f":"Orçamento!X800","v":{"$error":"#DIV/0!"}}]
["","7.",{"$f":"Orçamento!$P801","v":""},null,null,null,{"$f":"IFERROR(Orçamento!S801,\"-\")","v":0},{"$f":"IFERROR(Orçamento!V801,\"\")","v":0},{"$f":"Orçamento!X801","v":{"$error":"#DIV/0!"}}]
["","8.",{"$f":"Orçamento!$P802","v":""},null,null,null,{"$f":"IFERROR(Orçamento!S802,\"-\")","v":0},{"$f":"IFERROR(Orçamento!V802,\"\")","v":0},{"$f":"Orçamento!X802","v":{"$error":"#DIV/0!"}}]
["","9.",{"$f":"Orçamento!$P803","v":""},null,null,null,{"$f":"IFERROR(Orçamento!S803,\"-\")","v":0},{"$f":"IFERROR(Orçamento!V803,\"\")","v":0},{"$f":"Orçamento!X803","v":{"$error":"#DIV/0!"}}]
["","10.",{"$f":"Orçamento!$P804","v":""},null,null,null,{"$f":"IFERROR(Orçamento!S804,\"-\")","v":0},{"$f":"IFERROR(Orçamento!V804,\"\")","v":0},{"$f":"Orçamento!X804","v":{"$error":"#DIV/0!"}}]
["","11.",{"$f":"Orçamento!$P805","v":""},null,null,null,{"$f":"IFERROR(Orçamento!S805,\"-\")","v":0},{"$f":"IFERROR(Orçamento!V805,\"\")","v":0},{"$f":"Orçamento!X805","v":{"$error":"#DIV/0!"}}]
["","12.",{"$f":"Orçamento!$P806","v":""},null,null,null,{"$f":"IFERROR(Orçamento!S806,\"-\")","v":0},{"$f":"IFERROR(Orçamento!V806,\"\")","v":0},{"$f":"Orçamento!X806","v":{"$error":"#DIV/0!"}}]
["","13.",{"$f":"Orçamento!$P807","v":""},null,null,null,{"$f":"IFERROR(Orçamento!S807,\"-\")","v":0},{"$f":"IFERROR(Orçamento!V807,\"\")","v":0},{"$f":"Orçamento!X807","v":{"$error":"#DIV/0!"}}]
["","14.",{"$f":"Orçamento!$P808","v":""},null,null,null,{"$f":"IFERROR(Orçamento!S808,\"-\")","v":0},{"$f":"IFERROR(Orçamento!V808,\"\")","v":0},{"$f":"Orçamento!X808","v":{"$error":"#DIV/0!"}}]
["","15.",{"$f":"Orçamento!$P809","v":""},null,null,null,{"$f":"IFERROR(Orçamento!S809,\"-\")","v":0},{"$f":"IFERROR(Orçamento!V809,\"\")","v":0},{"$f":"Orçamento!X809","v":{"$error":"#DIV/0!"}}]
["","16.",{"$f":"Orçamento!$P810","v":""},null,null,null,{"$f":"IFERROR(Orçamento!S810,\"-\")","v":0},{"$f":"IFERROR(Orçamento!V810,\"\")","v":0},{"$f":"Orçamento!X810","v":{"$error":"#DIV/0!"}}]
["","17.",{"$f":"Orçamento!$P811","v":""},null,null,null,{"$f":"IFERROR(Orçamento!S811,\"-\")","v":0},{"$f":"IFERROR(Orçamento!V811,\"\")","v":0},{"$f":"Orçamento!X811","v":{"$error":"#DIV/0!"}}]
["","18.",{"$f":"Orçamento!$P812","v":""},null,null,null,{"$f":"IFERROR(Orçamento!S812,\"-\")","v":0},{"$f":"IFERROR(Orçamento!V812,\"\")","v":0},{"$f":"Orçamento!X812","v":{"$error":"#DIV/0!"}}]
["","19.",{"$f":"Orçamento!$P813","v":""},null,null,null,{"$f":"IFERROR(Orçamento!S813,\"-\")","v":0},{"$f":"IFERROR(Orçamento!V813,\"\")","v":0},{"$f":"Orçamento!X813","v":{"$error":"#DIV/0!"}}]
["","20.",{"$f":"Orçamento!$P814","v":""},null,null,null,{"$f":"IFERROR(Orçamento!S814,\"-\")","v":0},{"$f":"IFERROR(Orçamento!V814,\"\")","v":0},{"$f":"Orçamento!X814","v":{"$error":"#DIV/0!"}}]
["F","TOTAL GERAL DO ORÇAMENTO (R$)",null,null,null,null,{"$f":"SUM(G17:G36)","v":0},{"$f":"SUM(H17:H36)","v":0},{"$f":"SUM(I17:I36)","v":{"$error":"#DIV/0!"}}]
["F"]
["F"]

{"sheet":"Somatório","index":2,"n_rows":45,"n_cols":6,"rows_kept":45,"cut":false,"hidden":false,"merged":[[0,1,0,5],[14,1,14,5],[2,1,2,3],[2,4,2,5],[3,1,3,3],[3,4,3,5],[5,1,5,3],[5,4,5,5],[6,1,6,3],[6,4,6,5],[8,1,8,3],[8,4,8,5],[1,1,1,5],[4,1,4,5],[7,1,7,5],[10,1,10,5],[9,1,9,3],[9,4,9,5],[11,1,11,2],[11,4,11,5],[12,1,12,2],[12,4,12,5],[13,0,14,0],[42,1,42,2],[44,1,44,5],[47,3,47,5],[48,3,48,5],[13,1,13,5]]}
[]
[]
[null,"UNIDADE ESCOLAR",null,null,"CÓDIGO INEP"]
[null,{"$f":"Orçamento!$O$4","v":"CENTRO DE ENSINO EM PERÍODO INTEGRAL PROFESSOR JOAQUIM CARVALHO FERREIRA"},null,null,{"$f":"Orçamento!V4","v":52033589}]
[]
[null,"OBRA",null,null,"CIDADE"]
[null,{"$f":"Orçamento!$O$7","v":"REFORMA E AMPLIAÇÃO"},null,null,{"$f":"Orçamento!$V$7","v":"GOIÂNIA"}]
[]
[null,"ENDEREÇO",null,null,"CRE"]
[null,{"$f":"Orçamento!$R$10","v":"AV FERNÃO DIAS PAES LEME S/Nº 32, CAPUAVA, CEP:74450-200"},null,null,{"$f":"Orçamento!$O$10","v":"GOIÂNIA"}]
[]
[null,"REFERÊNCIA",null,"DATA","ÁREA TOTAL CONSTRUÍDA (M²)"]
[null,{"$f":"CONCATENATE(\"AGETOP E SINAPI - \",Orçamento!$T$10)","v":"AGETOP E SINAPI - DESONERADA"},null,{"$f":"Orçamento!$S$7","v":"2020-03-25"},{"$f":"Orçamento!$V$13","v":2969.6299999999997}]
["FILTRO"]
[null,"SOMATÓRIO DE SERVIÇOS"]
["↓","ITEM","DESCRIÇÃO DOS SERVIÇOS","PREÇO SEM BDI (R$)","PREÇO COM BDI (R$)","PARTIC.  ( % )"]
[{"$f":"IF(D17>0,\"F\",\"\")","v":""},"a.",{"$f":"Orçamento!P761","v":"SERVIÇOS PRELIMINARES"},{"$f":"Orçamento!S761","v":0},{"$f":"Orçamento!V761","v":0},{"$f":"Orçamento!X761","v":0}]
[{"$f":"IF(D18>0,\"F\",\"\")","v":""},"b.",{"$f":"Orçamento!P762","v":"TRANSPORTES"},{"$f":"Orçamento!S762","v":0},{"$f":"Orçamento!V762","v":0},{"$f":"Orçamento!X762","v":0}]
["","c.",{"$f":"Orçamento!P763","v":"SERVIÇO EM TERRA"},{"$f":"Orçamento!S763","v":0},{"$f":"Orçamento!V763","v":0},{"$f":"Orçamento!X763","v":0}]
["","d.",{"$f":"Orçamento!P764","v":"FUNDAÇÕES E SONDAGENS"},{"$f":"Orçamento!S764","v":0},{"$f":"Orçamento!V764","v":0},{"$f":"Orçamento!X764","v":0}]
["","e.",{"$f":"Orçamento!P765","v":"ESTRUTURA"},{"$f":"Orçamento!S765","v":0},{"$f":"Orçamento!V765","v":0},{"$f":"Orçamento!X765","v":0}]
["","f.",{"$f":"Orçamento!P766","v":"INSTALAÇÕES ELÉTRICAS"},{"$f":"Orçamento!S766","v":0},{"$f":"Orçamento!V766","v":0},{"$f":"Orçamento!X766","v":0}]
["","g.",{"$f":"Orçamento!P767","v":"INSTALAÇÕES HIDROSSANITÁRIAS"},{"$f":"Orçamento!S767","v":0},{"$f":"Orçamento!V767","v":0},{"$f":"Orçamento!X767","v":0}]
["","h.",{"$f":"Orçamento!P768","v":"INSTALAÇÕES ESPECIAIS"},{"$f":"Orçamento!S768","v":0},{"$f":"Orçamento!V768","v":0},{"$f":"Orçamento!X768","v":0}]
["","i.",{"$f":"Orçamento!P769","v":"ALVENARIAS E DIVISÓRIAS"},{"$f":"Orçamento!S769","v":0},{"$f":"Orçamento!V769","v":0},{"$f":"Orçamento!X769","v":0}]
["","j.",{"$f":"Orçamento!P770","v":"ALVENARIA AUTO-PORTANTE"},{"$f":"Orçamento!S770","v":0},{"$f":"Orçamento!V770","v":0},{"$f":"Orçamento!X770","v":0}]
["","k.",{"$f":"Orçamento!P771","v":"IMPERMEABILIZAÇÃO"},{"$f":"Orçamento!S771","v":0},{"$f":"Orçamento!V771","v":0},{"$f":"Orçamento!X771","v":0}]
["","l.",{"$f":"Orçamento!P772","v":"ISOLAMENTO TÉRMICO E ACÚSTICO"},{"$f":"Orçamento!S772","v":0},{"$f":"Orçamento!V772","v":0},{"$f":"Orçamento!X772","v":0}]
["","m.",{"$f":"Orçamento!P773","v":"ESTRUTURA DE MADEIRA"},{"$f":"Orçamento!S773","v":0},{"$f":"Orçamento!V773","v":0},{"$f":"Orçamento!X773","v":0}]
["","n.",{"$f":"Orçamento!P774","v":"ESTRUTURAS METÁLICAS"},{"$f":"Orçamento!S774","v":0},{"$f":"Orçamento!V774","v":0},{"$f":"Orçamento!X774","v":0}]
["","o.",{"$f":"Orçamento!P775","v":"COBERTURAS"},{"$f":"Orçamento!S775","v":0},{"$f":"Orçamento!V775","v":0},{"$f":"Orçamento!X775","v":0}]
["","p.",{"$f":"Orçamento!P776","v":"ESQUADRIAS DE MADEIRA"},{"$f":"Orçamento!S776","v":0},{"$f":"Orçamento!V776","v":0},{"$f":"Orçamento!X776","v":0}]
["","q.",{"$f":"Orçamento!P777","v":"ESQUADRIAS METÁLICAS"},{"$f":"Orçamento!S777","v":0},{"$f":"Orçamento!V777","v":0},{"$f":"Orçamento!X777","v":0}]
["","r.",{"$f":"Orçamento!P778","v":"VIDROS"},{"$f":"Orçamento!S778","v":0},{"$f":"Orçamento!V778","v":0},{"$f":"Orçamento!X778","v":0}]
["","s.",{"$f":"Orçamento!P779","v":"REVESTIMENTO DE PAREDE"},{"$f":"Orçamento!S779","v":0},{"$f":"Orçamento!V779","v":0},{"$f":"Orçamento!X779","v":0}]
["","t.",{"$f":"Orçamento!P780","v":"FORROS"},{"$f":"Orçamento!S780","v":0},{"$f":"Orçamento!V780","v":0},{"$f":"Orçamento!X780","v":0}]
["","u.",{"$f":"Orçamento!P781","v":"REVESTIMENTO DE PISO"},{"$f":"Orçamento!S781","v":0},{"$f":"Orçamento!V781","v":0},{"$f":"Orçamento!X781","v":0}]
["","v.",{"$f":"Orçamento!P782","v":"FERRAGENS"},{"$f":"Orçamento!S782","v":0},{"$f":"Orçamento!V782","v":0},{"$f":"Orçamento!X782","v":0}]
["","w.",{"$f":"Orçamento!P783","v":"MARCENARIA"},{"$f":"Orçamento!S783","v":0},{"$f":"Orçamento!V783","v":0},{"$f":"Orçamento!X783","v":0}]
["","x.",{"$f":"Orçamento!P784","v":"ADMINISTRAÇÃO"},{"$f":"Orçamento!S784","v":0},{"$f":"Orçamento!V784","v":0},{"$f":"Orçamento!X784","v":0}]
["","y.",{"$f":"Orçamento!P785","v":"PINTURA"},{"$f":"Orçamento!S785","v":0},{"$f":"Orçamento!V785","v":0},{"$f":"Orçamento!X785","v":0}]
["","z.",{"$f":"Orçamento!P786","v":"DIVERSOS"},{"$f":"Orçamento!S786","v":0},{"$f":"Orçamento!V786","v":0},{"$f":"Orçamento!X786","v":0}]
["F","TOTAL GERAL DO ORÇAMENTO",null,{"$f":"SUM(D17:D42)","v":0},{"$f":"SUM(E17:E42)","v":0},{"$f":"SUM(F17:F42)","v":0}]
[]
[null,"(*) Para itens da AGETOP, os vidros não estão inclusos nas esquadrias e já foram considerados os custos de contramarco para as esquadrias de alumínio;"]

{"sheet":"Cronog_120_Dias","index":3,"n_rows":99,"n_cols":24,"rows_kept":99,"cut":false,"hidden":false,"merged":[[97,1,97,4],[98,1,98,21],[94,1,94,2],[94,5,94,8],[94,9,94,12],[94,13,94,16],[94,17,94,20],[95,1,95,2],[95,5,95,8],[95,9,95,12],[95,13,95,16],[95,17,95,20],[92,1,92,2],[92,5,92,8],[92,9,92,12],[92,13,92,16],[92,17,92,20],[93,1,93,2],[93,5,93,8],[93,9,93,12],[93,13,93,16],[93,17,93,20],[89,13,89,16],[89,17,89,20],[91,5,91,8],[91,9,91,12],[91,13,91,16],[91,17,91,20],[86,17,86,20],[88,5,88,8],[88,9,88,12],[88,13,88,16],[88,17,88,20],[86,13,86,16],[89,1,91,2],[89,3,91,3],[89,4,91,4],[89,5,89,8],[89,9,89,12],[86,1,88,2],[86,3,88,3],[86,4,88,4],[86,5,86,8],[86,9,86,12],[83,13,83,16],[83,17,83,20],[85,5,85,8],[85,9,85,12],[85,13,85,16],[85,17,85,20],[80,17,80,20],[82,5,82,8],[82,9,82,12],[82,13,82,16],[82,17,82,20],[80,13,80,16],[83,1,85,2],[83,3,85,3],[83,4,85,4],[83,5,83,8],[83,9,83,12],[80,1,82,2],[80,3,82,3],[80,4,82,4],[80,5,80,8],[80,9,80,12],[77,13,77,16],[77,17,77,20],[79,5,79,8],[79,9,79,12],[79,13,79,16],[79,17,79,20],[74,17,74,20],[76,5,76,8],[76,9,76,12],[76,13,76,16],[76,17,76,20],[74,13,74,16],[77,1,79,2],[77,3,79,3],[77,4,79,4],[77,5,77,8],[77,9,77,12],[74,1,76,2],[74,3,76,3],[74,4,76,4],[74,5,74,8],[74,9,74,12],[71,13,71,16],[71,17,71,20],[73,5,73,8],[73,9,73,12],[73,13,73,16],[73,17,73,20],[68,17,68,20],[70,5,70,8],[70,9,70,12],[70,13,70,16],[70,17,70,20],[68,13,68,16],[71,1,73,2],[71,3,73,3],[71,4,73,4],[71,5,71,8],[71,9,71,12],[68,1,70,2],[68,3,70,3],[68,4,70,4],[68,5,68,8],[68,9,68,12],[65,13,65,16],[65,17,65,20],[67,5,67,8],[67,9,67,12],[67,13,67,16],[67,17,67,20],[62,17,62,20],[64,5,64,8],[64,9,64,12],[64,13,64,16],[64,17,64,20],[62,13,62,16],[65,1,67,2],[65,3,67,3],[65,4,67,4],[65,5,65,8],[65,9,65,12],[62,1,64,2],[62,3,64,3],[62,4,64,4],[62,5,62,8],[62,9,62,12],[59,13,59,16],[59,17,59,20],[61,5,61,8],[61,9,61,12],[61,13,61,16],[61,17,61,20],[56,17,56,20],[58,5,58,8],[58,9,58,12],[58,13,58,16],[58,17,58,20],[56,13,56,16],[59,1,61,2],[59,3,61,3],[59,4,61,4],[59,5,59,8],[59,9,59,12],[56,1,58,2],[56,3,58,3],[56,4,58,4],[56,5,56,8],[56,9,56,12],[53,13,53,16],[53,17,53,20],[55,5,55,8],[55,9,55,12],[55,13,55,16],[55,17,55,20],[50,17,50,20],[52,5,52,8],[52,9,52,12],[52,13,52,16],[52,17,52,20],[50,13,50,16],[53,1,55,2],[53,3,55,3],[53,4,55,4],[53,5,53,8],[53,9,53,12],[50,1,52,2],[50,3,52,3],[50,4,52,4],[50,5,50,8],[50,9,50,12],[47,13,47,16],[47,17,47,20],[49,5,49,8],[49,9,49,12],[49,13,49,16],[49,17,49,20],[44,17,44,20],[46,5,46,8],[46,9,46,12],[46,13,46,16],[46,17,46,20],[44,13,44,16],[47,1,49,2],[47,3,49,3],[47,4,49,4],[47,5,47,8],[47,9,47,12],[44,1,46,2],[44,3,46,3],[44,4,46,4],[44,5,44,8],[44,9,44,12],[41,13,41,16],[41,17,41,20],[43,5,43,8],[43,9,43,12],[43,13,43,16],[43,17,43,20],[38,17,38,20],[40,5,40,8],[40,9,40,12],[40,13,40,16],[40,17,40,20],[38,13,38,16],[41,1,43,2],[41,3,43,3],[41,4,43,4],[41,5,41,8],[41,9,41,12],[38,1,40,2],[38,3,40,3],[38,4,40,4],[38,5,38,8],[38,9,38,12],[35,13,35,16],[35,17,35,20],[37,5,37,8],[37,9,37,12],[37,13,37,16],[37,17,37,20],[32,17,32,20],[34,5,34,8],[34,9,34,12],[34,13,34,16],[34,17,34,20],[32,13,32,16],[35,1,37,2],[35,3,37,3],[35,4,37,4],[35,5,35,8],[35,9,35,12],[32,1,34,2],[32,3,34,3],[32,4,34,4],[32,5,32,8],[32,9,32,12],[29,13,29,16],[29,17,29,20],[31,5,31,8],[31,9,31,12],[31,13,31,16],[31,17,31,20],[26,17,26,20],[28,5,28,8],[28,9,28,12],[28,13,28,16],[28,17,28,20],[26,13,26,16],[29,1,31,2],[29,3,31,3],[29,4,31,4],[29,5,29,8],[29,9,29,12],[26,1,28,2],[26,3,28,3],[26,4,28,4],[26,5,26,8],[26,9,26,12],[23,13,23,16],[23,17,23,20],[25,5,25,8],[25,9,25,12],[25,13,25,16],[25,17,25,20],[20,17,20,20],[22,5,22,8],[22,9,22,12],[22,13,22,16],[22,17,22,20],[20,13,20,16],[23,1,25,2],[23,3,25,3],[23,4,25,4],[23,5,23,8],[23,9,23,12],[20,1,22,2],[20,3,22,3],[20,4,22,4],[20,5,20,8],[20,9,20,12],[17,13,17,16],[17,17,17,20],[19,5,19,8],[19,9,19,12],[19,13,19,16],[19,17,19,20],[14,17,14,20],[16,5,16,8],[16,9,16,12],[16,13,16,16],[16,17,16,20],[14,13,14,16],[17,1,19,2],[17,3,19,3],[17,4,19,4],[17,5,17,8],[17,9,17,12],[14,1,16,2],[14,3,16,3],[14,4,16,4],[14,5,14,8],[14,9,14,12],[12,21,13,21],[13,1,13,2],[13,5,13,8],[13,9,13,12],[13,13,13,16],[13,17,13,20],[12,0,13,0],[12,3,13,3],[12,5,12,8],[12,9,12,12],[12,13,12,16],[12,17,12,20],[0,1,0,21],[1,1,1,21],[2,1,2,7],[2,8,2,21],[3,1,3,7],[3,8,3,21],[8,1,8,7],[8,8,8,21],[9,0,11,0],[9,1,9,7],[9,8,9,21],[10,1,10,21],[11,1,11,21],[4,1,4,21],[5,1,5,7],[5,8,5,21],[6,1,6,7],[6,8,6,21],[7,1,7,21]]}
[]
[]
[null,"UNIDADE ESCOLAR",null,null,null,null,null,null,"PRAZO"]
[null,{"$f":"Orçamento!O4","v":"CENTRO DE ENSINO EM PERÍODO INTEGRAL PROFESSOR JOAQUIM CARVALHO FERREIRA"},null,null,null,null,null,null,"120 DIAS CORRIDOS"]
[]
[null,"OBRA",null,null,null,null,null,null,"DATA"]
[null,{"$f":"Orçamento!O7","v":"REFORMA E AMPLIAÇÃO"},null,null,null,null,null,null,{"$f":"Orçamento!S7","v":"2020-03-25"}]
[]
[null,"LOCAL",null,null,null,null,null,null,"ÁREA TOTAL CONSTRUÍDA (M²)"]
["FILTRO",{"$f":"Orçamento!V7","v":"GOIÂNIA"},null,null,null,null,null,null,{"$f":"Orçamento!V13","v":2969.6299999999997}]
[]
[null,"CRONOGRAMA - FÍSICO FINANCEIRO"]
["↓","CUSTO TOTAL:",{"$f":"D93","v":0},"VALOR","Dias:",30,null,null,null,60,null,null,null,90,null,null,null,120,null,null,null,"TOTAL"]
[null,"DESCRIÇÃO DOS SERVIÇOS",null,null,"%","1ª PARCELA",null,null,null,"2ª PARCELA",null,null,null,"3ª PARCELA",null,null,null,"4ª PARCELA"]
[{"$f":"IF(D15>0,\"F\",\"\")","v":""},"SERVIÇOS PRELIMINARES",null,{"$f":"Orçamento!V761","v":0},{"$f":"Orçamento!X761","v":0},{"$f":"ROUND(F17*$D$15,2)","v":0},null,null,null,{"$f":"ROUND(J17*$D$15,2)","v":0},null,null,null,{"$f":"ROUND(N17*$D$15,2)","v":0},null,null,null,{"$f":"ROUND(R17*$D$15,2)","v":0},null,null,null,{"$f":"SUM(F15:U15)","v":0},null,{"$f":"IF(D15=V15,\"OK\",\"ERRO\")","v":"OK"}]
[{"$f":"IF(A15=\"F\",A15,\"\")","v":""}]
[{"$f":"IF(A16=\"F\",A16,\"\")","v":""},null,null,null,null,1,null,null,null,0,null,null,null,0,null,null,null,{"$f":"100%-(SUM(F17:Q17))","v":0},null,null,null,{"$f":"IFERROR(E15/100,\"\")","v":0},null,{"$f":"IF(E15=V17*100,\"OK\",\"ERRO\")","v":"OK"}]
[{"$f":"IF(D18>0,\"F\",\"\")","v":""},"TRANSPORTES",null,{"$f":"Orçamento!V762","v":0},{"$f":"Orçamento!X762","v":0},{"$f":"ROUND(F20*$D$18,2)","v":0},null,null,null,{"$f":"ROUND(J20*$D$18,2)","v":0},null,null,null,{"$f":"ROUND(N20*$D$18,2)","v":0},null,null,null,{"$f":"ROUND(R20*$D$18,2)","v":0},null,null,null,{"$f":"SUM(F18:U18)","v":0},null,{"$f":"IF(D18=V18,\"OK\",\"ERRO\")","v":"OK"}]
[{"$f":"IF(A18=\"F\",A18,\"\")","v":""}]
[{"$f":"IF(A19=\"F\",A19,\"\")","v":""},null,null,null,null,0.26,null,null,null,0.26,null,null,null,0.26,null,null,null,{"$f":"100%-(SUM(F20:Q20))","v":0.21999999999999997},null,null,null,{"$f":"IFERROR(E18/100,\"\")","v":0},null,{"$f":"IF(E18=V20*100,\"OK\",\"ERRO\")","v":"OK"}]
[{"$f":"IF(D21>0,\"F\",\"\")","v":""},"SERVIÇO EM TERRA",null,{"$f":"Orçamento!V763","v":0},{"$f":"Orçamento!X763","v":0},{"$f":"ROUND(F23*$D$21,2)","v":0},null,null,null,{"$f":"ROUND(J23*$D$21,2)","v":0},null,null,null,{"$f":"ROUND(N23*$D$21,2)","v":0},null,null,null,{"$f":"ROUND(R23*$D$21,2)","v":0},null,null,null,{"$f":"SUM(F21:U21)","v":0},null,{"$f":"IF(D21=V21,\"OK\",\"ERRO\")","v":"OK"}]
[{"$f":"IF(A21=\"F\",A21,\"\")","v":""}]
[{"$f":"IF(A22=\"F\",A22,\"\")","v":""},null,null,null,null,1,null,null,null,0,null,null,null,0,null,null,null,{"$f":"100%-(SUM(F23:Q23))","v":0},null,null,null,{"$f":"IFERROR(E21/100,\"\")","v":0},null,{"$f":"IF(E21=V23*100,\"OK\",\"ERRO\")","v":"OK"}]
[{"$f":"IF(D24>0,\"F\",\"\")","v":""},"FUNDAÇÕES E SONDAGENS",null,{"$f":"Orçamento!V764","v":0},{"$f":"Orçamento!X764","v":0},{"$f":"ROUND(F26*$D$24,2)","v":0},null,null,null,{"$f":"ROUND(J26*$D$24,2)","v":0},null,null,null,{"$f":"ROUND(N26*$D$24,2)","v":0},null,null,null,{"$f":"ROUND(R26*$D$24,2)","v":0},null,null,null,{"$f":"SUM(F24:U24)","v":0},null,{"$f":"IF(D24=V24,\"OK\",\"ERRO\")","v":"OK"}]
[{"$f":"IF(A24=\"F\",A24,\"\")","v":""}]
[{"$f":"IF(A25=\"F\",A25,\"\")","v":""},null,null,null,null,1,null,null,null,0,null,null,null,null,null,null,null,{"$f":"100%-(SUM(F26:Q26))","v":0},null,null,null,{"$f":"IFERROR(E24/100,\"\")","v":0},null,{"$f":"IF(E24=V26*100,\"OK\",\"ERRO\")","v":"OK"}]
[{"$f":"IF(D27>0,\"F\",\"\")","v":""},"ESTRUTURA",null,{"$f":"Orçamento!V765","v":0},{"$f":"Orçamento!X765","v":0},{"$f":"ROUND(F29*$D$27,2)","v":0},null,null,null,{"$f":"ROUND(J29*$D$27,2)","v":0},null,null,null,{"$f":"ROUND(N29*$D$27,2)","v":0},null,null,null,{"$f":"ROUND(R29*$D$27,2)","v":0},null,null,null,{"$f":"SUM(F27:U27)","v":0},null,{"$f":"IF(D27=V27,\"OK\",\"ERRO\")","v":"OK"}]
[{"$f":"IF(A27=\"F\",A27,\"\")","v":""}]
[{"$f":"IF(A28=\"F\",A28,\"\")","v":""},null,null,null,null,0.4,null,null,null,0.6,null,null,null,0,null,null,null,{"$f":"100%-(SUM(F29:Q29))","v":0},null,null,null,{"$f":"IFERROR(E27/100,\"\")","v":0},null,{"$f":"IF(E27=V29*100,\"OK\",\"ERRO\")","v":"OK"}]
[{"$f":"IF(D30>0,\"F\",\"\")","v":""},"INST.ELET/TELEFÔNICA/CABEAMENTO ESTRUTURADO",null,{"$f":"Orçamento!V766","v":0},{"$f":"Orçamento!X766","v":0},{"$f":"ROUND(F32*$D$30,2)","v":0},null,null,null,{"$f":"ROUND(J32*$D$30,2)","v":0},null,null,null,{"$f":"ROUND(N32*$D$30,2)","v":0},null,null,null,{"$f":"ROUND(R32*$D$30,2)","v":0},null,null,null,{"$f":"SUM(F30:U30)","v":0},null,{"$f":"IF(D30=V30,\"OK\",\"ERRO\")","v":"OK"}]
[{"$f":"IF(A30=\"F\",A30,\"\")","v":""}]
[{"$f":"IF(A31=\"F\",A31,\"\")","v":""},null,null,null,null,null,null,null,null,0.75,null,null,null,0.25,null,null,null,{"$f":"100%-(SUM(F32:Q32))","v":0},null,null,null,{"$f":"IFERROR(E30/100,\"\")","v":0},null,{"$f":"IF(E30=V32*100,\"OK\",\"ERRO\")","v":"OK"}]
[{"$f":"IF(D33>0,\"F\",\"\")","v":""},"INSTALAÇÕES HIDROSSANITÁRIAS",null,{"$f":"Orçamento!V767","v":0},{"$f":"Orçamento!X767","v":0},{"$f":"ROUND(F35*$D$33,2)","v":0},null,null,null,{"$f":"ROUND(J35*$D$33,2)-0.01","v":-0.01},null,null,null,{"$f":"ROUND(N35*$D$33,2)","v":0},null,null,null,{"$f":"ROUND(R35*$D$33,2)","v":0},null,null,null,{"$f":"SUM(F33:U33)","v":-0.01},1,{"$f":"IF(D33=V33,\"OK\",\"ERRO\")","v":"ERRO"}]
[{"$f":"IF(A33=\"F\",A33,\"\")","v":""}]
[{"$f":"IF(A34=\"F\",A34,\"\")","v":""},null,null,null,null,null,null,null,null,0.75,null,null,null,0.25,null,null,null,{"$f":"100%-(SUM(F35:Q35))","v":0},null,null,null,{"$f":"IFERROR(E33/100,\"\")","v":0},null,{"$f":"IF(E33=V35*100,\"OK\",\"ERRO\")","v":"OK"}]
[{"$f":"IF(D36>0,\"F\",\"\")","v":""},"INSTALAÇÕES ESPECIAIS",null,{"$f":"Orçamento!V768","v":0},{"$f":"Orçamento!X768","v":0},{"$f":"ROUND(F38*$D$36,2)","v":0},null,null,null,{"$f":"ROUND(J38*$D$36,2)","v":0},null,null,null,{"$f":"ROUND(N38*$D$36,2)","v":0},null,null,null,{"$f":"ROUND(R38*$D$36,2)","v":0},null,null,null,{"$f":"SUM(F36:U36)","v":0},null,{"$f":"IF(D36=V36,\"OK\",\"ERRO\")","v":"OK"}]
[{"$f":"IF(A36=\"F\",A36,\"\")","v":""}]
[{"$f":"IF(A37=\"F\",A37,\"\")","v":""},null,null,null,null,null,null,null,null,0.63,null,null,null,0.37,null,null,null,{"$f":"100%-(SUM(F38:Q38))","v":0},null,null,null,{"$f":"IFERROR(E36/100,\"\")","v":0},null,{"$f":"IF(E36=V38*100,\"OK\",\"ERRO\")","v":"OK"}]
[{"$f":"IF(D39>0,\"F\",\"\")","v":""},"ALVENARIA E DIVISÓRIAS",null,{"$f":"Orçamento!V769","v":0},{"$f":"Orçamento!X769","v":0},{"$f":"ROUND(F41*$D$39,2)","v":0},null,null,null,{"$f":"ROUND(J41*$D$39,2)","v":0},null,null,null,{"$f":"ROUND(N41*$D$39,2)","v":0},null,null,null,{"$f":"ROUND(R41*$D$39,2)","v":0},null,null,null,{"$f":"SUM(F39:U39)","v":0},null,{"$f":"IF(D39=V39,\"OK\",\"ERRO\")","v":"OK"}]
[{"$f":"IF(A39=\"F\",A39,\"\")","v":""}]
[{"$f":"IF(A40=\"F\",A40,\"\")","v":""},null,null,null,null,null,null,null,null,0.63,null,null,null,0.37,null,null,null,{"$f":"100%-(SUM(F41:Q41))","v":0},null,null,null,{"$f":"IFERROR(E39/100,\"\")","v":0},null,{"$f":"IF(E39=V41*100,\"OK\",\"ERRO\")","v":"OK"}]
[{"$f":"IF(D42>0,\"F\",\"\")","v":""},"ALVENARIA AUTO-PORTANTE",null,{"$f":"Orçamento!V770","v":0},{"$f":"Orçamento!X770","v":0},{"$f":"ROUND(F44*$D$42,2)","v":0},null,null,null,{"$f":"ROUND(J44*$D$42,2)","v":0},null,null,null,{"$f":"ROUND(N44*$D$42,2)","v":0},null,null,null,{"$f":"ROUND(R44*$D$42,2)","v":0},null,null,null,{"$f":"SUM(F42:U42)","v":0},null,{"$f":"IF(D42=V42,\"OK\",\"ERRO\")","v":"OK"}]
[{"$f":"IF(A42=\"F\",A42,\"\")","v":""}]
[{"$f":"IF(A43=\"F\",A43,\"\")","v":""},null,null,null,null,null,null,null,null,0.63,null,null,null,0.37,null,null,null,{"$f":"100%-(SUM(F44:Q44))","v":0},null,null,null,{"$f":"IFERROR(E42/100,\"\")","v":0},null,{"$f":"IF(E42=V44*100,\"OK\",\"ERRO\")","v":"OK"}]
[{"$f":"IF(D45>0,\"F\",\"\")","v":""},"IMPERMEABILIZAÇÃO",null,{"$f":"Orçamento!V771","v":0},{"$f":"Orçamento!X771","v":0},{"$f":"ROUND(F47*$D$45,2)","v":0},null,null,null,{"$f":"ROUND(J47*$D$45,2)","v":0},null,null,null,{"$f":"ROUND(N47*$D$45,2)+0.01","v":0.01},null,null,null,{"$f":"ROUND(R47*$D$45,2)","v":0},null,null,null,{"$f":"SUM(F45:U45)","v":0.01},1,{"$f":"IF(D45=V45,\"OK\",\"ERRO\")","v":"ERRO"}]
[{"$f":"IF(A45=\"F\",A45,\"\")","v":""}]
[{"$f":"IF(A46=\"F\",A46,\"\")","v":""},null,null,null,null,0.35,null,null,null,0.35,null,null,null,0.3,null,null,null,{"$f":"100%-(SUM(F47:Q47))","v":0},null,null,null,{"$f":"IFERROR(E45/100,\"\")","v":0},null,{"$f":"IF(E45=V47*100,\"OK\",\"ERRO\")","v":"OK"}]
[{"$f":"IF(D48>0,\"F\",\"\")","v":""},"ISOLAMENTO TÉRMICO E ACÚSTICO",null,{"$f":"Orçamento!V772","v":0},{"$f":"Orçamento!X772","v":0},{"$f":"ROUND(F50*$D$48,2)","v":0},null,null,null,{"$f":"ROUND(J50*$D$48,2)","v":0},null,null,null,{"$f":"ROUND(N50*$D$48,2)","v":0},null,null,null,{"$f":"ROUND(R50*$D$48,2)","v":0},null,null,null,{"$f":"SUM(F48:U48)","v":0},null,{"$f":"IF(D48=V48,\"OK\",\"ERRO\")","v":"OK"}]
[{"$f":"IF(A48=\"F\",A48,\"\")","v":""}]
[{"$f":"IF(A49=\"F\",A49,\"\")","v":""},null,null,null,null,null,null,null,null,0.55000000000000004,null,null,null,0.4,null,null,null,{"$f":"100%-(SUM(F50:Q50))","v":4.9999999999999933E-2},null,null,null,{"$f":"IFERROR(E48/100,\"\")","v":0},null,{"$f":"IF(E48=V50*100,\"OK\",\"ERRO\")","v":"OK"}]
[{"$f":"IF(D51>0,\"F\",\"\")","v":""},"ESTRUTURA DE MADEIRA",null,{"$f":"Orçamento!V773","v":0},{"$f":"Orçamento!X773","v":0},{"$f":"ROUND(F53*$D$51,2)","v":0},null,null,null,{"$f":"ROUND(J53*$D$51,2)","v":0},null,null,null,{"$f":"ROUND(N53*$D$51,2)","v":0},null,null,null,{"$f":"ROUND(R53*$D$51,2)","v":0},null,null,null,{"$f":"SUM(F51:U51)","v":0},null,{"$f":"IF(D51=V51,\"OK\",\"ERRO\")","v":"OK"}]
[{"$f":"IF(A51=\"F\",A51,\"\")","v":""}]
[{"$f":"IF(A52=\"F\",A52,\"\")","v":""},null,null,null,null,null,null,null,null,0.35,null,null,null,0.65,null,null,null,{"$f":"100%-(SUM(F53:Q53))","v":0},null,null,null,{"$f":"IFERROR(E51/100,\"\")","v":0},null,{"$f":"IF(E51=V53*100,\"OK\",\"ERRO\")","v":"OK"}]
[{"$f":"IF(D54>0,\"F\",\"\")","v":""},"ESTRUTURA METÁLICA",null,{"$f":"Orçamento!V774","v":0},{"$f":"Orçamento!X774","v":0},{"$f":"ROUND(F56*$D$54,2)","v":0},null,null,null,{"$f":"ROUND(J56*$D$54,2)","v":0},null,null,null,{"$f":"ROUND(N56*$D$54,2)","v":0},null,null,null,{"$f":"ROUND(R56*$D$54,2)","v":0},null,null,null,{"$f":"SUM(F54:U54)","v":0},null,{"$f":"IF(D54=V54,\"OK\",\"ERRO\")","v":"OK"}]
[{"$f":"IF(A54=\"F\",A54,\"\")","v":""}]
[{"$f":"IF(A55=\"F\",A55,\"\")","v":""},null,null,null,null,null,null,null,null,0.35,null,null,null,0.65,null,null,null,{"$f":"100%-(SUM(F56:Q56))","v":0},null,null,null,{"$f":"IFERROR(E54/100,\"\")","v":0},null,{"$f":"IF(E54=V56*100,\"OK\",\"ERRO\")","v":"OK"}]
[{"$f":"IF(D57>0,\"F\",\"\")","v":""},"COBERTURAS",null,{"$f":"Orçamento!V775","v":0},{"$f":"Orçamento!X775","v":0},{"$f":"ROUND(F59*$D$57,2)","v":0},null,null,null,{"$f":"ROUND(J59*$D$57,2)","v":0},null,null,null,{"$f":"ROUND(N59*$D$57,2)","v":0},null,null,null,{"$f":"ROUND(R59*$D$57,2)","v":0},null,null,null,{"$f":"SUM(F57:U57)","v":0},null,{"$f":"IF(D57=V57,\"OK\",\"ERRO\")","v":"OK"}]
[{"$f":"IF(A57=\"F\",A57,\"\")","v":""}]
[{"$f":"IF(A58=\"F\",A58,\"\")","v":""},null,null,null,null,null,null,null,null,null,null,null,null,0.55000000000000004,null,null,null,{"$f":"100%-(SUM(F59:Q59))","v":0.44999999999999996},null,null,null,{"$f":"IFERROR(E57/100,\"\")","v":0},null,{"$f":"IF(E57=V59*100,\"OK\",\"ERRO\")","v":"OK"}]
[{"$f":"IF(D60>0,\"F\",\"\")","v":""},"ESQUADRIAS DE MADEIRA",null,{"$f":"Orçamento!V776","v":0},{"$f":"Orçamento!X776","v":0},{"$f":"ROUND(F62*$D$60,2)","v":0},null,null,null,{"$f":"ROUND(J62*$D$60,2)","v":0},null,null,null,{"$f":"ROUND(N62*$D$60,2)","v":0},null,null,null,{"$f":"ROUND(R62*$D$60,2)","v":0},null,null,null,{"$f":"SUM(F60:U60)","v":0},null,{"$f":"IF(D60=V60,\"OK\",\"ERRO\")","v":"OK"}]
[{"$f":"IF(A60=\"F\",A60,\"\")","v":""}]
[{"$f":"IF(A61=\"F\",A61,\"\")","v":""},null,null,null,null,null,null,null,null,null,null,null,null,0.55000000000000004,null,null,null,{"$f":"100%-(SUM(F62:Q62))","v":0.44999999999999996},null,null,null,{"$f":"IFERROR(E60/100,\"\")","v":0},null,{"$f":"IF(E60=V62*100,\"OK\",\"ERRO\")","v":"OK"}]
[{"$f":"IF(D63>0,\"F\",\"\")","v":""},"ESQUADRIAS METÁLICAS",null,{"$f":"Orçamento!V777","v":0},{"$f":"Orçamento!X777","v":0},{"$f":"ROUND(F65*$D$63,2)","v":0},null,null,null,{"$f":"ROUND(J65*$D$63,2)","v":0},null,null,null,{"$f":"ROUND(N65*$D$63,2)","v":0},null,null,null,{"$f":"ROUND(R65*$D$63,2)","v":0},null,null,null,{"$f":"SUM(F63:U63)","v":0},null,{"$f":"IF(D63=V63,\"OK\",\"ERRO\")","v":"OK"}]
[{"$f":"IF(A63=\"F\",A63,\"\")","v":""}]
[{"$f":"IF(A64=\"F\",A64,\"\")","v":""},null,null,null,null,null,null,null,null,null,null,null,null,0.55000000000000004,null,null,null,{"$f":"100%-(SUM(F65:Q65))","v":0.44999999999999996},null,null,null,{"$f":"IFERROR(E63/100,\"\")","v":0},null,{"$f":"IF(E63=V65*100,\"OK\",\"ERRO\")","v":"OK"}]
[{"$f":"IF(D66>0,\"F\",\"\")","v":""},"VIDROS",null,{"$f":"Orçamento!V778","v":0},{"$f":"Orçamento!X778","v":0},{"$f":"ROUND(F68*$D$66,2)","v":0},null,null,null,{"$f":"ROUND(J68*$D$66,2)","v":0},null,null,null,{"$f":"ROUND(N68*$D$66,2)","v":0},null,null,null,{"$f":"ROUND(R68*$D$66,2)","v":0},null,null,null,{"$f":"SUM(F66:U66)","v":0},null,{"$f":"IF(D66=V66,\"OK\",\"ERRO\")","v":"OK"}]
[{"$f":"IF(A66=\"F\",A66,\"\")","v":""}]
[{"$f":"IF(A67=\"F\",A67,\"\")","v":""},null,null,null,null,null,null,null,null,null,null,null,null,0,null,null,null,1,null,null,null,{"$f":"IFERROR(E66/100,\"\")","v":0},null,{"$f":"IF(E66=V68*100,\"OK\",\"ERRO\")","v":"OK"}]
[{"$f":"IF(D69>0,\"F\",\"\")","v":""},"REVESTIMENTO DE PAREDE",null,{"$f":"Orçamento!V779","v":0},{"$f":"Orçamento!X779","v":0},{"$f":"ROUND(F71*$D$69,2)","v":0},null,null,null,{"$f":"ROUND(J71*$D$69,2)","v":0},null,null,null,{"$f":"ROUND(N71*$D$69,2)","v":0},null,null,null,{"$f":"ROUND(R71*$D$69,2)","v":0},null,null,null,{"$f":"SUM(F69:U69)","v":0},null,{"$f":"IF(D69=V69,\"OK\",\"ERRO\")","v":"OK"}]
[{"$f":"IF(A69=\"F\",A69,\"\")","v":""}]
[{"$f":"IF(A70=\"F\",A70,\"\")","v":""},null,null,null,null,null,null,null,null,null,null,null,null,1,null,null,null,{"$f":"100%-(SUM(F71:Q71))","v":0},null,null,null,{"$f":"IFERROR(E69/100,\"\")","v":0},null,{"$f":"IF(E69=V71*100,\"OK\",\"ERRO\")","v":"OK"}]
[{"$f":"IF(D72>0,\"F\",\"\")","v":""},"FORROS",null,{"$f":"Orçamento!V780","v":0},{"$f":"Orçamento!X780","v":0},{"$f":"ROUND(F74*$D$72,2)","v":0},null,null,null,{"$f":"ROUND(J74*$D$72,2)","v":0},null,null,null,{"$f":"ROUND(N74*$D$72,2)","v":0},null,null,null,{"$f":"ROUND(R74*$D$72,2)","v":0},null,null,null,{"$f":"SUM(F72:U72)","v":0},null,{"$f":"IF(D72=V72,\"OK\",\"ERRO\")","v":"OK"}]
[{"$f":"IF(A72=\"F\",A72,\"\")","v":""}]
[{"$f":"IF(A73=\"F\",A73,\"\")","v":""},null,null,null,null,null,null,null,null,null,null,null,null,0.4,null,null,null,{"$f":"100%-(SUM(F74:Q74))","v":0.6},null,null,null,{"$f":"IFERROR(E72/100,\"\")","v":0},null,{"$f":"IF(E72=V74*100,\"OK\",\"ERRO\")","v":"OK"}]
[{"$f":"IF(D75>0,\"F\",\"\")","v":""},"REVESTIMENTO DE PISO",null,{"$f":"Orçamento!V781","v":0},{"$f":"Orçamento!X781","v":0},{"$f":"ROUND(F77*$D$75,2)","v":0},null,null,null,{"$f":"ROUND(J77*$D$75,2)","v":0},null,null,null,{"$f":"ROUND(N77*$D$75,2)","v":0},null,null,null,{"$f":"ROUND(R77*$D$75,2)","v":0},null,null,null,{"$f":"SUM(F75:U75)","v":0},null,{"$f":"IF(D75=V75,\"OK\",\"ERRO\")","v":"OK"}]
[{"$f":"IF(A75=\"F\",A75,\"\")","v":""}]
[{"$f":"IF(A76=\"F\",A76,\"\")","v":""},null,null,null,null,null,null,null,null,null,null,null,null,0.4,null,null,null,{"$f":"100%-(SUM(F77:Q77))","v":0.6},null,null,null,{"$f":"IFERROR(E75/100,\"\")","v":0},null,{"$f":"IF(E75=V77*100,\"OK\",\"ERRO\")","v":"OK"}]
[{"$f":"IF(D78>0,\"F\",\"\")","v":""},"FERRAGENS",null,{"$f":"Orçamento!V782","v":0},{"$f":"Orçamento!X782","v":0},{"$f":"ROUND(F80*$D$78,2)","v":0},null,null,null,{"$f":"ROUND(J80*$D$78,2)","v":0},null,null,null,{"$f":"ROUND(N80*$D$78,2)","v":0},null,null,null,{"$f":"ROUND(R80*$D$78,2)","v":0},null,null,null,{"$f":"SUM(F78:U78)","v":0},null,{"$f":"IF(D78=V78,\"OK\",\"ERRO\")","v":"OK"}]
[{"$f":"IF(A78=\"F\",A78,\"\")","v":""}]
[{"$f":"IF(A79=\"F\",A79,\"\")","v":""},null,null,null,null,null,null,null,null,null,null,null,null,null,null,null,null,{"$f":"100%-(SUM(F80:Q80))","v":1},null,null,null,{"$f":"IFERROR(E78/100,\"\")","v":0},null,{"$f":"IF(E78=V80*100,\"OK\",\"ERRO\")","v":"OK"}]
[{"$f":"IF(D81>0,\"F\",\"\")","v":""},"MARCENARIA",null,{"$f":"Orçamento!V783","v":0},{"$f":"Orçamento!X783","v":0},{"$f":"ROUND(F83*$D$81,2)","v":0},null,null,null,{"$f":"ROUND(J83*$D$81,2)","v":0},null,null,null,{"$f":"ROUND(N83*$D$81,2)","v":0},null,null,null,{"$f":"ROUND(R83*$D$81,2)","v":0},null,null,null,{"$f":"SUM(F81:U81)","v":0},null,{"$f":"IF(D81=V81,\"OK\",\"ERRO\")","v":"OK"}]
[{"$f":"IF(A81=\"F\",A81,\"\")","v":""}]
[{"$f":"IF(A82=\"F\",A82,\"\")","v":""},null,null,null,null,null,null,null,null,null,null,null,null,null,null,null,null,{"$f":"100%-(SUM(F83:Q83))","v":1},null,null,null,{"$f":"IFERROR(E81/100,\"\")","v":0},null,{"$f":"IF(E81=V83*100,\"OK\",\"ERRO\")","v":"OK"}]
[{"$f":"IF(D84>0,\"F\",\"\")","v":""},"ADMINISTRAÇÃO - MENSALISTAS",null,{"$f":"Orçamento!V784","v":0},{"$f":"Orçamento!X784","v":0},{"$f":"ROUND(F86*$D$84,2)","v":0},null,null,null,{"$f":"ROUND(J86*$D$84,2)","v":0},null,null,null,{"$f":"ROUND(N86*$D$84,2)","v":0},null,null,null,{"$f":"ROUND(R86*$D$84,2)","v":0},null,null,null,{"$f":"SUM(F84:U84)","v":0},null,{"$f":"IF(D84=V84,\"OK\",\"ERRO\")","v":"OK"}]
[{"$f":"IF(A84=\"F\",A84,\"\")","v":""}]
[{"$f":"IF(A85=\"F\",A85,\"\")","v":""},null,null,null,null,0.26,null,null,null,0.26,null,null,null,0.25,null,null,null,{"$f":"100%-(SUM(F86:Q86))","v":0.22999999999999998},null,null,null,{"$f":"IFERROR(E84/100,\"\")","v":0},null,{"$f":"IF(E84=V86*100,\"OK\",\"ERRO\")","v":"OK"}]
[{"$f":"IF(D87>0,\"F\",\"\")","v":""},"PINTURA",null,{"$f":"Orçamento!V785","v":0},{"$f":"Orçamento!X785","v":0},{"$f":"ROUND(F89*$D$87,2)","v":0},null,null,null,{"$f":"ROUND(J89*$D$87,2)","v":0},null,null,null,{"$f":"ROUND(N89*$D$87,2)","v":0},null,null,null,{"$f":"ROUND(R89*$D$87,2)","v":0},null,null,null,{"$f":"SUM(F87:U87)","v":0},null,{"$f":"IF(D87=V87,\"OK\",\"ERRO\")","v":"OK"}]
[{"$f":"IF(A87=\"F\",A87,\"\")","v":""}]
[{"$f":"IF(A88=\"F\",A88,\"\")","v":""},null,null,null,null,null,null,null,null,null,null,null,null,0.36,null,null,null,{"$f":"100%-(SUM(F89:Q89))","v":0.64},null,null,null,{"$f":"IFERROR(E87/100,\"\")","v":0},null,{"$f":"IF(E87=V89*100,\"OK\",\"ERRO\")","v":"OK"}]
[{"$f":"IF(D90>0,\"F\",\"\")","v":""},"DIVERSOS",null,{"$f":"Orçamento!V786","v":0},{"$f":"Orçamento!X786","v":0},{"$f":"ROUND(F92*$D$90,2)","v":0},null,null,null,{"$f":"ROUND(J92*$D$90,2)","v":0},null,null,null,{"$f":"ROUND(N92*$D$90,2)","v":0},null,null,null,{"$f":"ROUND(R92*$D$90,2)-0.01","v":-0.01},null,null,null,{"$f":"SUM(F90:U90)","v":-0.01},1,{"$f":"IF(D90=V90,\"OK\",\"ERRO\")","v":"ERRO"}]
[{"$f":"IF(A90=\"F\",A90,\"\")","v":""}]
[{"$f":"IF(A91=\"F\",A91,\"\")","v":""},null,null,null,null,0.255,null,null,null,0.255,null,null,null,0.255,null,null,null,{"$f":"100%-(SUM(F92:Q92))","v":0.23499999999999999},null,null,null,{"$f":"IFERROR(E90/100,\"\")","v":0},null,{"$f":"IF(E90=V92*100,\"OK\",\"ERRO\")","v":"OK"}]
["F","CUSTO DO ORÇAMENTO",null,{"$f":"SUM(D15:D92)","v":0},{"$f":"SUM(E15:E92)","v":0},{"$f":"F15+F18+F21+F24+F27+F30+F33+F36+F39+F42+F45+F48+F51+F54+F57+F60+F63+F66+F69+F72+F75+F78+F81+F84+F87+F90","v":0},null,null,null,{"$f":"J15+J18+J21+J24+J27+J30+J33+J36+J39+J42+J45+J48+J51+J54+J57+J60+J63+J66+J69+J72+J75+J78+J81+J84+J87+J90","v":-0.01},null,null,null,{"$f":"N15+N18+N21+N24+N27+N30+N33+N36+N39+N42+N45+N48+N51+N54+N57+N60+N63+N66+N69+N72+N75+N78+N81+N84+N87+N90","v":0.01},null,null,null,{"$f":"R15+R18+R21+R24+R27+R30+R33+R36+R39+R42+R45+R48+R51+R54+R57+R60+R63+R66+R69+R72+R75+R78+R81+R84+R87+R90","v":-0.01},null,null,null,{"$f":"V15+V18+V21+V24+V27+V30+V33+V36+V39+V42+V45+V48+V51+V54+V57+V60+V63+V66+V69+V72+V75+V78+V81+V84+V87+V90","v":-0.01}]
["F","PERCENTUAIS:",null,null,null,{"$f":"IFERROR(F93/$D$93,\"\")","v":""},null,null,null,{"$f":"IFERROR(J93/$D$93,\"\")","v":""},null,null,null,{"$f":"IFERROR(N93/$D$93,\"\")","v":""},null,null,null,{"$f":"IFERROR(R93/$D$93,\"\")","v":""},null,null,null,{"$f":"SUM(F94:U94)","v":0}]
["F","TOTAIS ACUMULADOS:",null,null,null,{"$f":"F93","v":0},null,null,null,{"$f":"J93+F95","v":-0.01},null,null,null,{"$f":"N93+J95","v":0},null,null,null,{"$f":"R93+N95","v":-0.01}]
["F","PERCENTUAIS  ACUMULADOS:",null,null,null,{"$f":"F94","v":""},null,null,null,{"$f":"J94+F96","v":{"$error":"#VALUE!"}},null,null,null,{"$f":"N94+J96","v":{"$error":"#VALUE!"}},null,null,null,{"$f":"R94+N96","v":{"$error":"#VALUE!"}}]
["F"]
["F","OBSERVAÇÕES:"]
["F","Os pagamentos somente poderão ser efetuados mediante medição e atesto pelos técnicos da Secretaria da Educação. "]

{"sheet":"Composição BDI","index":4,"n_rows":45,"n_cols":9,"rows_kept":45,"cut":false,"hidden":false,"merged":[[18,5,18,8],[17,0,17,3],[16,0,16,3],[44,0,44,3],[42,0,42,3],[43,0,43,3],[18,0,18,3],[36,0,36,3],[39,0,39,3],[38,0,38,3],[40,0,40,3],[29,0,29,2],[32,0,32,3],[33,0,33,3],[34,0,34,3],[35,0,35,3],[0,0,0,3],[1,0,1,3],[4,0,4,3],[7,0,7,3],[10,0,10,3],[2,0,2,3],[3,0,3,3],[5,0,5,3],[6,0,6,3],[8,0,8,3],[9,0,9,3],[11,0,11,3],[12,0,12,3],[14,0,14,3],[15,0,15,3],[13,0,13,3]]}
[]
[]
["UNIDADE ESCOLAR"]
[{"$f":"Orçamento!$O$4","v":"CENTRO DE ENSINO EM PERÍODO INTEGRAL PROFESSOR JOAQUIM CARVALHO FERREIRA"}]
[]
["OBRA"]
[{"$f":"Orçamento!$O$7","v":"REFORMA E AMPLIAÇÃO"}]
[]
["ENDEREÇO"]
[{"$f":"Orçamento!$R$10","v":"AV FERNÃO DIAS PAES LEME S/Nº 32, CAPUAVA, CEP:74450-200"}]
[]
["CIDADE"]
[{"$f":"Orçamento!$V$7","v":"GOIÂNIA"}]
[]
["CRE"]
[{"$f":"Orçamento!$O$10","v":"GOIÂNIA"}]
[]
["DETALHAMENTO DA COMPOSIÇÃO DE BDI"]
["COMPOSIÇÃO BDI PARA OBRAS CIVIS",null,null,null,null,"BDI CONSTRUÇÃO E REFORMA"]
["DESCRIÇÃO","COEF.","TAXA % (a.m)","% no preço de venda",null,"Situação","1º Quartil","Médio","3º Quartil"]
["1) COFINS",1,0.03,{"$f":"C21","v":0.03},null,{"$f":"IF(OR(C21<G21,C21>I21),\"FORA DO INTERVALO\",\"OK\")","v":"OK"},0.03,0.03,0.03]
["2) PIS",1,6.4999999999999997E-3,{"$f":"C22","v":6.4999999999999997E-3},null,{"$f":"IF(OR(C22<G22,C22>I22),\"FORA DO INTERVALO\",\"OK\")","v":"OK"},6.4999999999999997E-3,6.4999999999999997E-3,6.4999999999999997E-3]
["3) ISSQN",1,0.03,{"$f":"C23*B23","v":0.03},null,"OK",0.02,3.5000000000000003E-2,0.05]
["4) CPRB",1,4.4999999999999998E-2,{"$f":"C24","v":4.4999999999999998E-2},null,"OK",4.4999999999999998E-2,4.4999999999999998E-2,4.4999999999999998E-2]
["5) Administração Central",1,3.1199999999999999E-2,3.1199999999999999E-2,null,"OK",0.03,0.04,5.5E-2]
["6) Despesas Financeiras",1,5.5999999999999999E-3,5.5999999999999999E-3,null,"FORA DO INTERVALO",5.8999999999999999E-3,1.23E-2,1.3899999999999999E-2]
["7) Seguros + Garantias",1,1.1999999999999999E-3,1.1999999999999999E-3,null,"FORA DO INTERVALO",8.0000000000000002E-3,8.0000000000000002E-3,0.01]
["8) Risco",1,9.7000000000000003E-3,9.7000000000000003E-3,null,"OK",9.7000000000000003E-3,1.2699999999999999E-2,1.2699999999999999E-2]
["9) Lucro",1,7.1999999999999995E-2,7.1999999999999995E-2,null,"OK",6.1600000000000002E-2,7.3999999999999996E-2,8.9599999999999999E-2]
["BDI - FINAL",null,null,{"$f":"(((1+D25+D27+D28)*(1+D26)*(1+D29))/(1-(D21+D22+D23+D24))-1)","v":0.26436368567248203},null,{"$f":"IF(OR(D30<G30,D30>I30),\"FORA DO INTERVALO\",\"OK\")","v":"FORA DO INTERVALO"},0.2034,0.22120000000000001,0.25]
[]
["Notas:"]
["(1) e (2) Alíquota definida por lei."]
["(3) Alíquota e base de cálculo definidas pela legislação municipal."]
["(4) Alíquota definida pelas leis 12.546/11, 12844/13 e 13.161/15 (CPRB – contribuição previdenciária sobre a receita bruta)."]
["(5) Valores definidos a partir dos limites no Acórdão nº 2.622/2013 - TCU – Plenário. Valores entre o 1º e 3º quartis."]
["(6) Valor calculado pela expressão matemática do acórdão 2.369/2011 – TCU – Plenário e disponibilizado pela AGETOP em dezembro de 2018. (Foi utilizado para o cálculo a média da Taxa SELIC no período de 11/2017 a 10/2018)"]
[]
["(7) Valores definidos pela AGETOP a partir dos limites no Acórdão nº 2.622/2013 - TCU – Plenário. Valores médios. \n\nObservação da AGETOP: (Seguros contra erros de execução, incêndio e explosão, danos da natureza (vendaval, destelhamento, alagamento, inundação, desmoronamento, geadas etc.), emprego de material defeituoso ou inadequado, roubo e/ou furto qualificado, quebra de equipamentos, desmoronamento de estrutura, nas modalidades de Obras Civis em Construção (OCC); Instalação e Montagem (IM); e Obras Civis em Construção e Instalação e Montagem (OCC/IM). Bem como coberturas adicionais para ampliação dessas coberturas básicas, como: cobertura de responsabilidade civil geral, cobertura de responsabilidade civil cruzada, cobertura de despesas extraordinárias, cobertura de tumultos, cobertura de desentulho do local, cobertura de riscos do fabricante, dentre outras, incluindo o seguro de vida em grupo regido pela convenção coletiva dos trabalhadores na indústria da construção civil). A partir de 24/02/2015 por intermédio da Portaria 449/2015 a Presidência da AGETOP, na pessoa do Senhor Jayme Eduardo Rincon, determinou a exclusão dos valores referentes aos Seguros de Risco de Engenharia e Responsabilidade Civil do Profissional na composição do cálculo do B.D.I.."]
["(8) Valores definidos a partir dos limites no Acórdão nº 2.622/2013 - TCU – Plenário. Valores entre 1º e 3° quartis."]
["(9) Valores definidos a partir dos limites definidos no Acórdão nº 2.622/2013 - TCU – Plenário. Valores adotados e praticados no mercado ( “ ex ante ” ) ou aqueles entre os 1º e 3º quartis."]
[]
["(*) A fórmula para estipulação da taxa de BDI estimado adotado é a mesma que foi aplicada para a obtenção das tabelas contidas no Acórdão n. 2.622/2013 – TCUPlenário"]
[]
["Obs.: Para obras com valores superiores a R$ 20.000.000,00 sugere-se recalcular o BDI, dimensionando as taxas de administração central e lucro para patamares inferiores ao estipulado acima."]

{"sheet":"Relatório CENTRAL","index":5,"n_rows":40,"n_cols":5,"rows_kept":40,"cut":false,"hidden":false,"merged":[[8,1,8,2],[8,3,8,4],[9,1,9,2],[10,1,10,4],[11,1,11,4],[39,1,39,2],[9,0,11,0],[0,1,0,4],[6,3,6,4],[9,3,9,4],[1,1,1,4],[2,1,2,2],[2,3,2,4],[3,1,3,2],[3,3,3,4],[4,1,4,4],[5,1,5,2],[5,3,5,4],[6,1,6,2],[7,1,7,4]]}
[]
[]
[null,"UNIDADE ESCOLAR",null,"CIDADE"]
[null,{"$f":"Orçamento!$O$4","v":"CENTRO DE ENSINO EM PERÍODO INTEGRAL PROFESSOR JOAQUIM CARVALHO FERREIRA"},null,{"$f":"Orçamento!$V$7","v":"GOIÂNIA"}]
[]
[null,"OBRA",null,"CRE"]
[null,{"$f":"Orçamento!$O$7","v":"REFORMA E AMPLIAÇÃO"},null,{"$f":"Orçamento!$O$10","v":"GOIÂNIA"}]
[]
[null,"ENDEREÇO",null,"DATA"]
["FILTRO",{"$f":"Orçamento!$R$10","v":"AV FERNÃO DIAS PAES LEME S/Nº 32, CAPUAVA, CEP:74450-200"},null,{"$f":"Orçamento!$S$7","v":"2020-03-25"}]
[]
[null,"RELATÓRIO CENTRAL"]
["↓","CÓDIGO","ETAPA","PREÇO  (R$) C/ BDI","PARTIC  ( % )"]
[{"$f":"IF(D14>0,\"F\",\"\")","v":""},{"$f":"Orçamento!O761","v":"a."},{"$f":"Orçamento!P761","v":"SERVIÇOS PRELIMINARES"},{"$f":"Orçamento!V761","v":0},{"$f":"Orçamento!X761","v":0}]
[{"$f":"IF(D15>0,\"F\",\"\")","v":""},{"$f":"Orçamento!O762","v":"b."},{"$f":"Orçamento!P762","v":"TRANSPORTES"},{"$f":"Orçamento!V762","v":0},{"$f":"Orçamento!X762","v":0}]
["",{"$f":"Orçamento!O763","v":"c."},{"$f":"Orçamento!P763","v":"SERVIÇO EM TERRA"},{"$f":"Orçamento!V763","v":0},{"$f":"Orçamento!X763","v":0}]
["",{"$f":"Orçamento!O764","v":"d."},{"$f":"Orçamento!P764","v":"FUNDAÇÕES E SONDAGENS"},{"$f":"Orçamento!V764","v":0},{"$f":"Orçamento!X764","v":0}]
["",{"$f":"Orçamento!O765","v":"e."},{"$f":"Orçamento!P765","v":"ESTRUTURA"},{"$f":"Orçamento!V765","v":0},{"$f":"Orçamento!X765","v":0}]
["",{"$f":"Orçamento!O766","v":"f."},{"$f":"Orçamento!P766","v":"INSTALAÇÕES ELÉTRICAS"},{"$f":"Orçamento!V766","v":0},{"$f":"Orçamento!X766","v":0}]
["",{"$f":"Orçamento!O767","v":"g."},{"$f":"Orçamento!P767","v":"INSTALAÇÕES HIDROSSANITÁRIAS"},{"$f":"Orçamento!V767","v":0},{"$f":"Orçamento!X767","v":0}]
["",{"$f":"Orçamento!O768","v":"h"},{"$f":"Orçamento!P768","v":"INSTALAÇÕES ESPECIAIS"},{"$f":"Orçamento!V768","v":0},{"$f":"Orçamento!X768","v":0}]
["",{"$f":"Orçamento!O769","v":"i."},{"$f":"Orçamento!P769","v":"ALVENARIAS E DIVISÓRIAS"},{"$f":"Orçamento!V769","v":0},{"$f":"Orçamento!X769","v":0}]
["",{"$f":"Orçamento!O770","v":"j."},{"$f":"Orçamento!P770","v":"ALVENARIA AUTO-PORTANTE"},{"$f":"Orçamento!V770","v":0},{"$f":"Orçamento!X770","v":0}]
["",{"$f":"Orçamento!O771","v":"k."},{"$f":"Orçamento!P771","v":"IMPERMEABILIZAÇÃO"},{"$f":"Orçamento!V771","v":0},{"$f":"Orçamento!X771","v":0}]
["",{"$f":"Orçamento!O772","v":"l."},{"$f":"Orçamento!P772","v":"ISOLAMENTO TÉRMICO E ACÚSTICO"},{"$f":"Orçamento!V772","v":0},{"$f":"Orçamento!X772","v":0}]
["",{"$f":"Orçamento!O773","v":"m."},{"$f":"Orçamento!P773","v":"ESTRUTURA DE MADEIRA"},{"$f":"Orçamento!V773","v":0},{"$f":"Orçamento!X773","v":0}]
["",{"$f":"Orçamento!O774","v":"n."},{"$f":"Orçamento!P774","v":"ESTRUTURAS METÁLICAS"},{"$f":"Orçamento!V774","v":0},{"$f":"Orçamento!X774","v":0}]
["",{"$f":"Orçamento!O775","v":"o."},{"$f":"Orçamento!P775","v":"COBERTURAS"},{"$f":"Orçamento!V775","v":0},{"$f":"Orçamento!X775","v":0}]
["",{"$f":"Orçamento!O776","v":"p."},{"$f":"Orçamento!P776","v":"ESQUADRIAS DE MADEIRA"},{"$f":"Orçamento!V776","v":0},{"$f":"Orçamento!X776","v":0}]
["",{"$f":"Orçamento!O777","v":"q."},{"$f":"Orçamento!P777","v":"ESQUADRIAS METÁLICAS"},{"$f":"Orçamento!V777","v":0},{"$f":"Orçamento!X777","v":0}]
["",{"$f":"Orçamento!O778","v":"r."},{"$f":"Orçamento!P778","v":"VIDROS"},{"$f":"Orçamento!V778","v":0},{"$f":"Orçamento!X778","v":0}]
["",{"$f":"Orçamento!O779","v":"s."},{"$f":"Orçamento!P779","v":"REVESTIMENTO DE PAREDE"},{"$f":"Orçamento!V779","v":0},{"$f":"Orçamento!X779","v":0}]
["",{"$f":"Orçamento!O780","v":"t."},{"$f":"Orçamento!P780","v":"FORROS"},{"$f":"Orçamento!V780","v":0},{"$f":"Orçamento!X780","v":0}]
["",{"$f":"Orçamento!O781","v":"u."},{"$f":"Orçamento!P781","v":"REVESTIMENTO DE PISO"},{"$f":"Orçamento!V781","v":0},{"$f":"Orçamento!X781","v":0}]
["",{"$f":"Orçamento!O782","v":"v."},{"$f":"Orçamento!P782","v":"FERRAGENS"},{"$f":"Orçamento!V782","v":0},{"$f":"Orçamento!X782","v":0}]
["",{"$f":"Orçamento!O783","v":"w."},{"$f":"Orçamento!P783","v":"MARCENARIA"},{"$f":"Orçamento!V783","v":0},{"$f":"Orçamento!X783","v":0}]
["",{"$f":"Orçamento!O784","v":"x."},{"$f":"Orçamento!P784","v":"ADMINISTRAÇÃO"},{"$f":"Orçamento!V784","v":0},{"$f":"Orçamento!X784","v":0}]
["",{"$f":"Orçamento!O785","v":"y."},{"$f":"Orçamento!P785","v":"PINTURA"},{"$f":"Orçamento!V785","v":0},{"$f":"Orçamento!X785","v":0}]
["",{"$f":"Orçamento!O786","v":"z."},{"$f":"Orçamento!P786","v":"DIVERSOS"},{"$f":"Orçamento!V786","v":0},{"$f":"Orçamento!X786","v":0}]
["F","TOTAL GERAL DO ORÇAMENTO (R$) C/BDI",null,{"$f":"SUM(D14:D39)","v":0},{"$f":"SUM(E14:E39)","v":0}]

{"sheet":"Parc Maior Relev","index":6,"n_rows":20,"n_cols":7,"rows_kept":20,"cut":false,"hidden":false,"merged":[[10,0,12,0],[8,1,8,3],[8,4,8,6],[20,3,20,7],[18,1,18,6],[0,1,0,6],[11,1,11,6],[1,1,1,6],[2,1,2,3],[2,4,2,6],[3,1,3,3],[3,4,3,6],[4,1,4,6],[5,1,5,3],[5,4,5,6],[9,1,9,3],[9,4,9,6],[10,1,10,6],[6,1,6,3],[6,4,6,6],[7,1,7,6]]}
[]
[]
[null,"UNIDADE ESCOLAR",null,null,"CÓDIGO INEP"]
[null,{"$f":"Orçamento!$O$4","v":"CENTRO DE ENSINO EM PERÍODO INTEGRAL PROFESSOR JOAQUIM CARVALHO FERREIRA"},null,null,{"$f":"Orçamento!$V$4","v":52033589}]
[]
[null,"OBRA",null,null,"CIDADE"]
[null,{"$f":"Orçamento!$O$7","v":"REFORMA E AMPLIAÇÃO"},null,null,{"$f":"Orçamento!$V$7","v":"GOIÂNIA"}]
[]
[null,"CRE",null,null,"ÁREA TOTAL CONSTRUÍDA (M²)"]
[null,{"$f":"Orçamento!$O$10","v":"GOIÂNIA"},null,null,{"$f":"Orçamento!$V$13","v":2969.6299999999997}]
["FILTRO"]
[null,"PARCELA DE MAIOR RELEVÂNCIA"]
[null,"CÓDIGO","SERVIÇO","DESCRIÇÃO","UNID","QUANT","PARC. MAIOR RELEV (100%)"]
[null,"f.","INSTALAÇÕES ELÉTRICAS","SUBESTAÇÃO","KVA",112.5,{"$f":"F14","v":112.5}]
[null,"CÓDIGO","SERVIÇO","DESCRIÇÃO","UNID","QUANT","PARC. MAIOR RELEV (50%)"]
[null,"u.","REVESTIMENTO DE PISO","PISO EM GRANITINA","M2",779.41029999999989,{"$f":"F16*0.5","v":389.70514999999995}]
[null,"s.","REVESTIMENTO DE PAREDE","REVESTIMENTO CERÂMICO DE PAREDE","M2",411.26499999999999,{"$f":"F17*0.5","v":205.63249999999999}]
["F"]
["F","(*) Para os fins do inciso I dp § 1º do Art. 30 da Lei Federal 8.666/93, são consideradas parcelas de maior relevância técnica as execuções apresentadas"]
["F"]

{"sheet":"Composições","index":7,"n_rows":394,"n_cols":10,"rows_kept":394,"cut":false,"hidden":false,"merged":[[390,1,390,7],[393,1,393,7],[228,4,229,4],[228,5,229,5],[228,6,228,7],[228,8,228,9],[232,1,232,7],[238,0,239,0],[238,1,239,1],[238,2,239,2],[238,3,239,3],[238,4,239,4],[238,5,239,5],[238,6,238,7],[238,8,238,9],[383,1,383,7],[381,1,381,7],[385,0,386,0],[385,1,386,1],[385,2,386,2],[385,3,386,3],[385,4,386,4],[385,5,386,5],[385,6,385,7],[180,5,181,5],[180,6,180,7],[180,8,180,9],[185,1,185,7],[190,0,191,0],[190,1,191,1],[190,2,191,2],[190,3,191,3],[190,4,191,4],[190,5,191,5],[190,6,190,7],[190,8,190,9],[188,1,188,7],[180,0,181,0],[180,1,181,1],[180,2,181,2],[180,3,181,3],[180,4,181,4],[385,8,385,9],[374,1,374,7],[371,1,371,7],[376,0,377,0],[376,1,377,1],[376,2,377,2],[376,3,377,3],[376,4,377,4],[376,5,377,5],[376,6,376,7],[376,8,376,9],[346,8,346,9],[364,1,364,7],[366,0,367,0],[366,1,367,1],[366,2,367,2],[366,3,367,3],[366,4,367,4],[366,5,367,5],[366,6,366,7],[366,8,366,9],[351,1,351,7],[324,1,324,7],[321,1,321,7],[326,0,327,0],[326,1,327,1],[326,2,327,2],[326,3,327,3],[326,4,327,4],[326,5,327,5],[326,6,326,7],[344,1,344,7],[346,0,347,0],[346,1,347,1],[346,2,347,2],[346,3,347,3],[346,4,347,4],[346,5,347,5],[346,6,346,7],[326,8,326,9],[331,1,331,7],[314,1,314,7],[311,1,311,7],[316,0,317,0],[316,1,317,1],[316,2,317,2],[316,3,317,3],[316,4,317,4],[316,5,317,5],[316,6,316,7],[316,8,316,9],[306,8,306,9],[295,1,295,7],[293,1,293,7],[297,0,298,0],[297,1,298,1],[297,2,298,2],[297,3,298,3],[297,4,298,4],[297,5,298,5],[297,6,297,7],[297,8,297,9],[304,1,304,7],[302,1,302,7],[306,0,307,0],[306,1,307,1],[306,2,307,2],[306,3,307,3],[306,4,307,4],[306,5,307,5],[306,6,306,7],[286,1,286,7],[288,0,289,0],[288,1,289,1],[288,2,289,2],[288,3,289,3],[288,4,289,4],[288,5,289,5],[288,6,288,7],[288,8,288,9],[279,1,279,7],[269,1,269,7],[273,1,273,7],[275,0,276,0],[275,1,276,1],[275,2,276,2],[275,3,276,3],[275,4,276,4],[275,5,276,5],[275,6,275,7],[275,8,275,9],[261,1,261,7],[263,1,263,7],[265,0,266,0],[265,1,266,1],[265,2,266,2],[265,3,266,3],[265,4,266,4],[265,5,266,5],[265,6,265,7],[265,8,265,9],[256,8,256,9],[245,1,245,7],[243,1,243,7],[247,0,248,0],[247,1,248,1],[247,2,248,2],[247,3,248,3],[247,4,248,4],[247,5,248,5],[247,6,247,7],[247,8,247,9],[254,1,254,7],[252,1,252,7],[256,0,257,0],[256,1,257,1],[256,2,257,2],[256,3,257,3],[256,4,257,4],[256,5,257,5],[256,6,256,7],[236,1,236,7],[220,0,221,0],[220,1,221,1],[220,2,221,2],[220,3,221,3],[220,4,221,4],[220,5,221,5],[220,6,220,7],[220,8,220,9],[224,1,224,7],[226,1,226,7],[228,0,229,0],[228,1,229,1],[228,2,229,2],[228,3,229,3],[215,1,215,7],[218,1,218,7],[208,1,208,7],[205,1,205,7],[210,0,211,0],[210,1,211,1],[210,2,211,2],[210,3,211,3],[210,4,211,4],[210,5,211,5],[210,6,210,7],[210,8,210,9],[198,1,198,7],[195,1,195,7],[200,0,201,0],[200,1,201,1],[200,2,201,2],[200,3,201,3],[200,4,201,4],[200,5,201,5],[200,6,200,7],[200,8,200,9],[178,1,178,7],[172,0,173,0],[172,1,173,1],[172,2,173,2],[172,3,173,3],[172,4,173,4],[172,5,173,5],[172,6,172,7],[172,8,172,9],[176,1,176,7],[168,1,168,7],[170,1,170,7],[156,5,157,5],[156,6,156,7],[156,8,156,9],[161,1,161,7],[156,0,157,0],[156,1,157,1],[156,2,157,2],[156,3,157,3],[156,4,157,4],[160,1,160,7],[163,0,164,0],[163,1,164,1],[163,2,164,2],[163,3,164,3],[163,4,164,4],[163,5,164,5],[163,6,163,7],[163,8,163,9],[146,5,147,5],[146,6,146,7],[146,8,146,9],[150,1,150,7],[154,1,154,7],[146,0,147,0],[146,1,147,1],[146,2,147,2],[146,3,147,3],[146,4,147,4],[136,5,137,5],[136,6,136,7],[136,8,136,9],[140,1,140,7],[144,1,144,7],[136,0,137,0],[136,1,137,1],[136,2,137,2],[136,3,137,3],[136,4,137,4],[126,5,127,5],[126,6,126,7],[126,8,126,9],[131,1,131,7],[134,1,134,7],[126,0,127,0],[126,1,127,1],[126,2,127,2],[126,3,127,3],[126,4,127,4],[116,5,117,5],[116,6,116,7],[116,8,116,9],[121,1,121,7],[124,1,124,7],[116,0,117,0],[116,1,117,1],[116,2,117,2],[116,3,117,3],[116,4,117,4],[107,5,108,5],[107,6,107,7],[107,8,107,9],[112,1,112,7],[114,1,114,7],[107,0,108,0],[107,1,108,1],[107,2,108,2],[107,3,108,3],[107,4,108,4],[98,5,99,5],[98,6,98,7],[98,8,98,9],[103,1,103,7],[105,1,105,7],[98,0,99,0],[98,1,99,1],[98,2,99,2],[98,3,99,3],[98,4,99,4],[89,5,90,5],[89,6,89,7],[89,8,89,9],[94,1,94,7],[96,1,96,7],[89,0,90,0],[89,1,90,1],[89,2,90,2],[89,3,90,3],[89,4,90,4],[80,5,81,5],[80,6,80,7],[80,8,80,9],[85,1,85,7],[87,1,87,7],[80,0,81,0],[80,1,81,1],[80,2,81,2],[80,3,81,3],[80,4,81,4],[71,5,72,5],[71,6,71,7],[71,8,71,9],[76,1,76,7],[78,1,78,7],[71,0,72,0],[71,1,72,1],[71,2,72,2],[71,3,72,3],[71,4,72,4],[61,5,62,5],[61,6,61,7],[61,8,61,9],[66,1,66,7],[69,1,69,7],[61,0,62,0],[61,1,62,1],[61,2,62,2],[61,3,62,3],[61,4,62,4],[51,5,52,5],[51,6,51,7],[51,8,51,9],[56,1,56,7],[59,1,59,7],[51,0,52,0],[51,1,52,1],[51,2,52,2],[51,3,52,3],[51,4,52,4],[43,5,44,5],[43,6,43,7],[43,8,43,9],[47,1,47,7],[49,1,49,7],[43,0,44,0],[43,1,44,1],[43,2,44,2],[43,3,44,3],[43,4,44,4],[34,5,35,5],[34,6,34,7],[34,8,34,9],[39,1,39,7],[41,1,41,7],[34,0,35,0],[34,1,35,1],[34,2,35,2],[34,3,35,3],[34,4,35,4],[25,5,26,5],[25,6,25,7],[25,8,25,9],[30,1,30,7],[32,1,32,7],[25,0,26,0],[25,1,26,1],[25,2,26,2],[25,3,26,3],[25,4,26,4],[16,5,17,5],[16,6,16,7],[16,8,16,9],[21,1,21,7],[23,1,23,7],[16,0,17,0],[16,1,17,1],[16,2,17,2],[16,3,17,3],[16,4,17,4],[0,0,0,8],[10,0,10,2],[10,3,10,6],[11,0,11,9],[12,0,12,2],[12,3,12,6],[12,7,12,8],[7,0,7,6],[9,0,9,2],[9,3,9,6],[9,7,9,8],[3,0,3,6],[4,0,4,6],[15,0,15,9],[13,0,13,2],[13,3,13,6],[1,0,1,9],[3,7,3,9],[4,7,4,9],[6,7,6,9],[7,7,7,9],[6,0,6,6],[10,8,10,9],[13,8,13,9],[14,0,14,9],[8,0,8,9],[5,0,5,9],[2,0,2,9]]}
[]
[]
[]
["UNIDADE ESCOLAR",null,null,null,null,null,null,"CÓDIGO INEP"]
[{"$f":"Orçamento!$O$4","v":"CENTRO DE ENSINO EM PERÍODO INTEGRAL PROFESSOR JOAQUIM CARVALHO FERREIRA"},null,null,null,null,null,null,{"$f":"Orçamento!$V$4","v":52033589}]
[]
["OBRA",null,null,null,null,null,null,"CIDADE"]
[{"$f":"Orçamento!$O$7","v":"REFORMA E AMPLIAÇÃO"},null,null,null,null,null,null,{"$f":"Orçamento!$V$7","v":"GOIÂNIA"}]
[]
["CRE",null,null,"ENDEREÇO",null,null,null,"REFERÊNCIA AGETOP"]
[{"$f":"Orçamento!$O$10","v":"GOIÂNIA"},null,null,{"$f":"Orçamento!$R$10","v":"AV FERNÃO DIAS PAES LEME S/Nº 32, CAPUAVA, CEP:74450-200"},null,null,null,{"$f":"Orçamento!$S$10","v":"ABR/19"},{"$f":"Orçamento!$T$10","v":"DESONERADA"}]
[]
["DATA",null,null,"ÁREA TOTAL CONSTRUÍDA (M²)",null,null,null,"REFERÊNCIA SINAPI"]
[{"$f":"Orçamento!$S$7","v":"2020-03-25"},null,null,{"$f":"Orçamento!$V$13","v":2969.6299999999997},null,null,null,{"$f":"Orçamento!$V$10","v":"OUT/19"},{"$f":"Orçamento!$W$10","v":"DESONERADA"}]
[]
["COMPOSIÇÕES DE CUSTOS UNITÁRIOS - SEE-GO"]
[46,"FONTE","CÓDIGO","DESCRIÇÃO","UNIDADE","COEFIC.","CUSTO UNITÁRIO",null,"CUSTO  TOTAL (A) + (B) + (C) + (D) + (E)"]
[null,null,null,null,null,null,"DESONERADO","NÃO DESONER.","DESONERADO","NÃO DESONER."]
[null,"COMPOSIÇÃO","COMP 046_SEE","CAPUZ PARA PROTEÇÃO DOS PARA RAIOS","UN ",null,null,null,16.100000000000001,16.150000000000002]
[null,"AGETOP_I",8,"AJUDANTE","h     ",3.3300000000000003E-2,8.75,10.14,0.28999999999999998,0.34]
[null,"AGETOP_I",12,"MATERIAL HIDRO-SANITÁRIO",0,3.3300000000000003E-2,0,0,0,0]
[null,"MÃO DE OBRA (B) - TOTAL",null,null,null,null,null,null,0.28999999999999998,0.34]
[null,"COTAÇÃO","COT 010_SEE","CAPUZ PARA PROTEÇÃO DOS PARA RAIOS","UN ",1,15.81,15.81,15.81,15.81]
[null,"MATERIAL (C) - TOTAL",null,null,null,null,null,null,15.81,15.81]
[]
[47,"FONTE","CÓDIGO","DESCRIÇÃO","UNIDADE","COEFIC.","CUSTO UNITÁRIO",null,"CUSTO  TOTAL (A) + (B) + (C) + (D) + (E)"]
[null,null,null,null,null,null,"DESONERADO","NÃO DESONER.","DESONERADO","NÃO DESONER."]
[null,"COMPOSIÇÃO","COMP 047_SEE","CAPUZ DE PROTEÇÃO PARA BUCHA DE TRANSFORMADOR","UN ",null,null,null,16.100000000000001,16.150000000000002]
[null,"AGETOP_I",8,"AJUDANTE","h     ",3.3300000000000003E-2,8.75,10.14,0.28999999999999998,0.34]
[null,"AGETOP_I",12,"MATERIAL HIDRO-SANITÁRIO",0,3.3300000000000003E-2,0,0,0,0]
[null,"MÃO DE OBRA (B) - TOTAL",null,null,null,null,null,null,0.28999999999999998,0.34]
[null,"COTAÇÃO","COT 011_SEE","CAPUZ DE PROTEÇÃO PARA BUCHA DE TRANSFORMADOR","UN ",1,15.81,15.81,15.81,15.81]
[null,"MATERIAL (C) - TOTAL",null,null,null,null,null,null,15.81,15.81]
[]
[48,"FONTE","CÓDIGO","DESCRIÇÃO","UNIDADE","COEFIC.","CUSTO UNITÁRIO",null,"CUSTO  TOTAL (A) + (B) + (C) + (D) + (E)"]
[null,null,null,null,null,null,"DESONERADO","NÃO DESONER.","DESONERADO","NÃO DESONER."]
[null,"COMPOSIÇÃO","COMP 048_SEE","HASTE ROSQUEADA \"TIRANTE\" 3/8\"","M",null,null,null,8.879999999999999,9.44]
[null,"AGETOP_I",8,"AJUDANTE","h     ",0.4,8.75,10.14,3.5,4.0599999999999996]
[null,"AGETOP_I",12,"MATERIAL HIDRO-SANITÁRIO",0,0.4,0,0,0,0]
[null,"MÃO DE OBRA (B) - TOTAL",null,null,null,null,null,null,3.5,4.0599999999999996]
[null,"COTAÇÃO","COT 012_SEE","HASTE ROSQUEADA \"TIRANTE\" 3/8\"","M",1,5.3833333333333329,5.3833333333333329,5.38,5.38]
[null,"MATERIAL (C) - TOTAL",null,null,null,null,null,null,5.38,5.38]
[]
[49,"FONTE","CÓDIGO","DESCRIÇÃO","UNIDADE","COEFIC.","CUSTO UNITÁRIO",null,"CUSTO  TOTAL (A) + (B) + (C) + (D) + (E)"]
[null,null,null,null,null,null,"DESONERADO","NÃO DESONER.","DESONERADO","NÃO DESONER."]
[null,"COMPOSIÇÃO","COMP 049_SEE","PORCA SEXTAVADA 3/8\"","UN ",null,null,null,0.21000000000000002,0.22]
[null,"AGETOP_I",8,"AJUDANTE","h     ",8.9999999999999993E-3,8.75,10.14,0.08,0.09]
[null,"MÃO DE OBRA (B) - TOTAL",null,null,null,null,null,null,0.08,0.09]
[null,"COTAÇÃO","COT 013_SEE","PORCA SEXTAVADA 3/8\"","UN ",1,0.13,0.13,0.13,0.13]
[null,"MATERIAL (C) - TOTAL",null,null,null,null,null,null,0.13,0.13]
[]
[382,"FONTE","CÓDIGO","DESCRIÇÃO","UNIDADE","COEFIC.","CUSTO UNITÁRIO",null,"CUSTO  TOTAL (A) + (B) + (C) + (D) + (E)"]
[null,null,null,null,null,null,"DESONERADO","NÃO DESONER.","DESONERADO","NÃO DESONER."]
[null,"COMPOSIÇÃO","COMP 382_SEE","TE DE REDUCAO DE FERRO GALVANIZADO, COM ROSCA BSP, DE 3/4\" X 1/2\"","UN ",null,null,null,14.08,14.91]
[null,"AGETOP_I",8,"AJUDANTE","h     ",0.6,8.75,10.14,5.25,6.08]
[null,"AGETOP_I",11,"MATERIAL ELÉTRICO",0,0.61050000000000004,0,0,0,0]
[null,"MÃO DE OBRA (B) - TOTAL",null,null,null,null,null,null,5.25,6.08]
[null,"SINAPI_I",3146,"FITA VEDA ROSCA EM ROLOS DE 18 MM X 10 M (L X C)","UN    ",0.12075471698113208,3.93,3.93,0.47,0.47]
[null,"SINAPI_I",6302,"TE DE REDUCAO DE FERRO GALVANIZADO, COM ROSCA BSP, DE 3/4\" X 1/2\"","UN    ",1,8.36,8.36,8.36,8.36]
[null,"MATERIAL (C) - TOTAL",null,null,null,null,null,null,8.83,8.83]
[]
[383,"FONTE","CÓDIGO","DESCRIÇÃO","UNIDADE","COEFIC.","CUSTO UNITÁRIO",null,"CUSTO  TOTAL (A) + (B) + (C) + (D) + (E)"]
[null,null,null,null,null,null,"DESONERADO","NÃO DESONER.","DESONERADO","NÃO DESONER."]
[null,"COMPOSIÇÃO","COMP 383_SEE","BUCHA DE REDUCAO DE FERRO GALVANIZADO, COM ROSCA BSP, DE 1/2\" X 1/4\"","UN ",null,null,null,4.4800000000000004,4.7]
[null,"AGETOP_I",8,"AJUDANTE","h     ",0.16,8.75,10.14,1.4,1.62]
[null,"AGETOP_I",11,"MATERIAL ELÉTRICO",0,0.16,0,0,0,0]
[null,"MÃO DE OBRA (B) - TOTAL",null,null,null,null,null,null,1.4,1.62]
[null,"AGETOP_I","H689","","",1.2,0,0,0,0]
[null,"SINAPI_I",770,"BUCHA DE REDUCAO DE FERRO GALVANIZADO, COM ROSCA BSP, DE 1/2\" X 1/4\"","UN    ",1,3.08,3.08,3.08,3.08]
[null,"MATERIAL (C) - TOTAL",null,null,null,null,null,null,3.08,3.08]
[]
[212,"FONTE","CÓDIGO","DESCRIÇÃO","UNIDADE","COEFIC.","CUSTO UNITÁRIO",null,"CUSTO  TOTAL (A) + (B) + (C) + (D) + (E)"]
[null,null,null,null,null,null,"DESONERADO","NÃO DESONER.","DESONERADO","NÃO DESONER."]
[null,"COMPOSIÇÃO","COMP 212_SEE","NIPLE DE REDUÇÃO 1/2\" X 1/4\" BSP","UN ",null,null,null,7.4499999999999993,7.67]
[null,"AGETOP_I",8,"AJUDANTE","h     ",0.16,8.75,10.14,1.4,1.62]
[null,"AGETOP_I",11,"MATERIAL ELÉTRICO",0,0.16,0,0,0,0]
[null,"MÃO DE OBRA (B) - TOTAL",null,null,null,null,null,null,1.4,1.62]
[null,"COTAÇÃO","COT 103_SEE","NIPLE DE REDUÇÃO 1/2\" X 1/4\" BSP","UN",1,6.0533333333333337,6.0533333333333337,6.05,6.05]
[null,"MATERIAL (C) - TOTAL",null,null,null,null,null,null,6.05,6.05]
[]
[213,"FONTE","CÓDIGO","DESCRIÇÃO","UNIDADE","COEFIC.","CUSTO UNITÁRIO",null,"CUSTO  TOTAL (A) + (B) + (C) + (D) + (E)"]
[null,null,null,null,null,null,"DESONERADO","NÃO DESONER.","DESONERADO","NÃO DESONER."]
[null,"COMPOSIÇÃO","COMP 213_SEE","NIPLE DE REDUÇÃO 3/4\" X 1/2\" BSP","UN ",null,null,null,11.110000000000001,11.330000000000002]
[null,"AGETOP_I",8,"AJUDANTE","h     ",0.16,8.75,10.14,1.4,1.62]
[null,"AGETOP_I",11,"MATERIAL ELÉTRICO",0,0.16,0,0,0,0]
[null,"MÃO DE OBRA (B) - TOTAL",null,null,null,null,null,null,1.4,1.62]
[null,"COTAÇÃO","COT 104_SEE","NIPLE DE REDUÇÃO 3/4\" X 1/2\" BSP","UN",1,9.7099999999999991,9.7099999999999991,9.7100000000000009,9.7100000000000009]
[null,"MATERIAL (C) - TOTAL",null,null,null,null,null,null,9.7100000000000009,9.7100000000000009]
[]
[237,"FONTE","CÓDIGO","DESCRIÇÃO","UNIDADE","COEFIC.","CUSTO UNITÁRIO",null,"CUSTO  TOTAL (A) + (B) + (C) + (D) + (E)"]
[null,null,null,null,null,null,"DESONERADO","NÃO DESONER.","DESONERADO","NÃO DESONER."]
[null,"COMPOSIÇÃO","COMP 237_SEE","FITA ANTICORROSIVA","M",null,null,null,9.4,9.68]
[null,"AGETOP_I",8,"AJUDANTE","h     ",0.2,8.75,10.14,1.75,2.0299999999999998]
[null,"AGETOP_I",12,"MATERIAL HIDRO-SANITÁRIO",0,0.2,0,0,0,0]
[null,"MÃO DE OBRA (B) - TOTAL",null,null,null,null,null,null,1.75,2.0299999999999998]
[null,"SINAPI_I",39634,"FITA ADESIVA ANTICORROSIVA DE PVC FLEXIVEL, COR PRETA, PARA PROTECAO TUBULACAO, 50 MM X 30 M (L X C), E= *0,25* MM","M     ",1,7.65,7.65,7.65,7.65]
[null,"MATERIAL (C) - TOTAL",null,null,null,null,null,null,7.65,7.65]
[]
[542,"FONTE","CÓDIGO","DESCRIÇÃO","UNIDADE","COEFIC.","CUSTO UNITÁRIO",null,"CUSTO  TOTAL (A) + (B) + (C) + (D) + (E)"]
[null,null,null,null,null,null,"DESONERADO","NÃO DESONER.","DESONERADO","NÃO DESONER."]
[null,"COMPOSIÇÃO","COMP 542_SEE","VÁLVULA UGV 3/4\" (S) LATÃO","UN ",null,null,null,19.62,20.22]
[null,"AGETOP_I",8,"AJUDANTE","h     ",0.432,8.75,10.14,3.78,4.38]
[null,"AGETOP_I",11,"MATERIAL ELÉTRICO",0,0.432,0,0,0,0]
[null,"MÃO DE OBRA (B) - TOTAL",null,null,null,null,null,null,3.78,4.38]
[null,"COTAÇÃO","COT 281_SEE","VÁLVULA UGV 3/4\" (S) LATÃO","UN ",1,15.836666666666666,15.836666666666666,15.84,15.84]
[null,"MATERIAL (C) - TOTAL",null,null,null,null,null,null,15.84,15.84]
[]
[543,"FONTE","CÓDIGO","DESCRIÇÃO","UNIDADE","COEFIC.","CUSTO UNITÁRIO",null,"CUSTO  TOTAL (A) + (B) + (C) + (D) + (E)"]
[null,null,null,null,null,null,"DESONERADO","NÃO DESONER.","DESONERADO","NÃO DESONER."]
[null,"COMPOSIÇÃO","COMP 543_SEE","VÁLVULA UGV 1/2\" (S) LATÃO","UN ",null,null,null,18.95,19.55]
[null,"AGETOP_I",8,"AJUDANTE","h     ",0.432,8.75,10.14,3.78,4.38]
[null,"AGETOP_I",11,"MATERIAL ELÉTRICO",0,0.432,0,0,0,0]
[null,"MÃO DE OBRA (B) - TOTAL",null,null,null,null,null,null,3.78,4.38]
[null,"COTAÇÃO","COT 282_SEE","VÁLVULA UGV 1/2\" (S) LATÃO","UN ",1,15.166666666666666,15.166666666666666,15.17,15.17]
[null,"MATERIAL (C) - TOTAL",null,null,null,null,null,null,15.17,15.17]
[]
[211,"FONTE","CÓDIGO","DESCRIÇÃO","UNIDADE","COEFIC.","CUSTO UNITÁRIO",null,"CUSTO  TOTAL (A) + (B) + (C) + (D) + (E)"]
[null,null,null,null,null,null,"DESONERADO","NÃO DESONER.","DESONERADO","NÃO DESONER."]
[null,"COMPOSIÇÃO","COMP 211_SEE","REGULADOR DE 2º ESTÁGIO 5KG/H","UN ",null,null,null,69.89,71.489999999999995]
[null,"AGETOP_I",8,"AJUDANTE","h     ",1.1499999999999999,8.75,10.14,10.06,11.66]
[null,"AGETOP_I",11,"MATERIAL ELÉTRICO",0,1.1499999999999999,0,0,0,0]
[null,"MÃO DE OBRA (B) - TOTAL",null,null,null,null,null,null,10.06,11.66]
[null,"COTAÇÃO","COT 102_SEE","REGULADOR DE 2º ESTÁGIO 5KG/H","UN",1,59.833333333333336,59.833333333333336,59.83,59.83]
[null,"AGETOP_I","H689","","",2.82,0,0,0,0]
[null,"MATERIAL (C) - TOTAL",null,null,null,null,null,null,59.83,59.83]
[]
[210,"FONTE","CÓDIGO","DESCRIÇÃO","UNIDADE","COEFIC.","CUSTO UNITÁRIO",null,"CUSTO  TOTAL (A) + (B) + (C) + (D) + (E)"]
[null,null,null,null,null,null,"DESONERADO","NÃO DESONER.","DESONERADO","NÃO DESONER."]
[null,"COMPOSIÇÃO","COMP 210_SEE","REGULADOR DE 1º ESTÁGIO 60KG/H MODELO AP-40  COM MANÔMETRO","UN ",null,null,null,215.64000000000001,217.24]
[null,"AGETOP_I",8,"AJUDANTE","h     ",1.1499999999999999,8.75,10.14,10.06,11.66]
[null,"AGETOP_I",11,"MATERIAL ELÉTRICO",0,1.1499999999999999,0,0,0,0]
[null,"MÃO DE OBRA (B) - TOTAL",null,null,null,null,null,null,10.06,11.66]
[null,"COTAÇÃO","COT 101_SEE","REGULADOR DE 1º ESTÁGIO 60KG/H MODELO AP-40  COM MANÔMETRO","UN",1,205.57666666666668,205.57666666666668,205.58,205.58]
[null,"AGETOP_I","H689","","",2.82,0,0,0,0]
[null,"MATERIAL (C) - TOTAL",null,null,null,null,null,null,205.58,205.58]
[]
[235,"FONTE","CÓDIGO","DESCRIÇÃO","UNIDADE","COEFIC.","CUSTO UNITÁRIO",null,"CUSTO  TOTAL (A) + (B) + (C) + (D) + (E)"]
[null,null,null,null,null,null,"DESONERADO","NÃO DESONER.","DESONERADO","NÃO DESONER."]
[null,"COMPOSIÇÃO","COMP 235_SEE","PLACA DE SINALIZAÇÃO EM PVC COD 01 - (300X300) PROIBIDO FUMAR","UN ",null,null,null,25.319999999999997,25.439999999999998]
[null,"AGETOP_I",5,"SERVENTE","h     ",0.09,8.75,10.14,0.79,0.91]
[null,"MÃO DE OBRA (B) - TOTAL",null,null,null,null,null,null,0.79,0.91]
[null,"AGETOP_I",3070,"BUCHA DE NYLON S-6","un",2,0.04,0.04,0.08,0.08]
[null,"AGETOP_I",3393,"PARAFUSO P/BUCHA S-6","un",2,0.08,0.08,0.16,0.16]
[null,"SINAPI_I",37556,"PLACA DE SINALIZACAO DE SEGURANCA CONTRA INCENDIO, FOTOLUMINESCENTE, QUADRADA, *20 X 20* CM, EM PVC *2* MM ANTI-CHAMAS (SIMBOLOS, CORES E PICTOGRAMAS CONFORME NBR 13434)","UN    ",1,24.29,24.29,24.29,24.29]
[null,"MATERIAL (C) - TOTAL",null,null,null,null,null,null,24.529999999999998,24.529999999999998]
[]
[236,"FONTE","CÓDIGO","DESCRIÇÃO","UNIDADE","COEFIC.","CUSTO UNITÁRIO",null,"CUSTO  TOTAL (A) + (B) + (C) + (D) + (E)"]
[null,null,null,null,null,null,"DESONERADO","NÃO DESONER.","DESONERADO","NÃO DESONER."]
[null,"COMPOSIÇÃO","COMP 236_SEE","PLACA DE SINALIZAÇÃO EM PVC COD 06 - (300X300) PERIGO INFLAMÁVEL","UN ",null,null,null,25.319999999999997,25.439999999999998]
[null,"AGETOP_I",5,"SERVENTE","h     ",0.09,8.75,10.14,0.79,0.91]
[null,"MÃO DE OBRA (B) - TOTAL",null,null,null,null,null,null,0.79,0.91]
[null,"AGETOP_I",3070,"BUCHA DE NYLON S-6","un",2,0.04,0.04,0.08,0.08]
[null,"AGETOP_I",3393,"PARAFUSO P/BUCHA S-6","un",2,0.08,0.08,0.16,0.16]
[null,"SINAPI_I",37556,"PLACA DE SINALIZACAO DE SEGURANCA CONTRA INCENDIO, FOTOLUMINESCENTE, QUADRADA, *20 X 20* CM, EM PVC *2* MM ANTI-CHAMAS (SIMBOLOS, CORES E PICTOGRAMAS CONFORME NBR 13434)","UN    ",1,24.29,24.29,24.29,24.29]
[null,"MATERIAL (C) - TOTAL",null,null,null,null,null,null,24.529999999999998,24.529999999999998]
[]
[45,"FONTE","CÓDIGO","DESCRIÇÃO","UNIDADE","COEFIC.","CUSTO UNITÁRIO",null,"CUSTO  TOTAL (A) + (B) + (C) + (D) + (E)"]
[null,null,null,null,null,null,"DESONERADO","NÃO DESONER.","DESONERADO","NÃO DESONER."]
[null,"COMPOSIÇÃO","COMP 045_SEE","LAUDO DE ESTANQUEIDADE","UN ",null,null,null,936,1085.1199999999999]
[null,"AGETOP",250101,"ENGENHEIRO - (OBRAS CIVIS)","H     ",16,58.5,67.819999999999993,936,1085.1199999999999]
[null,"MÃO DE OBRA (B) - TOTAL",null,null,null,null,null,null,936,1085.1199999999999]
[null,"MATERIAL (C) - TOTAL",null,null,null,null,null,null,0,0]
[]
[17,"FONTE","CÓDIGO","DESCRIÇÃO","UNIDADE","COEFIC.","CUSTO UNITÁRIO",null,"CUSTO  TOTAL (A) + (B) + (C) + (D) + (E)"]
[null,null,null,null,null,null,"DESONERADO","NÃO DESONER.","DESONERADO","NÃO DESONER."]
[null,"COMPOSIÇÃO","COMP 017_SEE","REDUCAO GIRATÓRIA TIPO STORZ LATAO P/ INST. PREDIAL COMBATE A INCENDIO ENGATE RAPIDO 2.1/2\" X 1.1/2\"","UN ",null,"-","-",97.09,97.31]
[null,"AGETOP_I",8,"AJUDANTE","h     ",0.16,8.75,10.14,1.4,1.62]
[null,"AGETOP_I",11,"MATERIAL ELÉTRICO",0,0.16,0,0,0,0]
[null,"MÃO DE OBRA (B) - TOTAL",null,null,null,null,null,null,1.4,1.62]
[null,"SINAPI_I",20972,"REDUCAO FIXA TIPO STORZ, ENGATE RAPIDO 2.1/2\" X 1.1/2\", EM LATAO, PARA INSTALACAO PREDIAL COMBATE A INCENDIO PREDIAL","UN    ",1,95.69,95.69,95.69,95.69]
[null,"MATERIAL (C) - TOTAL",null,null,null,null,null,null,95.69,95.69]
[]
[18,"FONTE","CÓDIGO","DESCRIÇÃO","UNIDADE","COEFIC.","CUSTO UNITÁRIO",null,"CUSTO  TOTAL (A) + (B) + (C) + (D) + (E)"]
[null,null,null,null,null,null,"DESONERADO","NÃO DESONER.","DESONERADO","NÃO DESONER."]
[null,"COMPOSIÇÃO","COMP 018_SEE","CHAVE DUPLA P/ CONEXÕES TIPO STORZ EM LATÃO ENGATE RÁPIDO 1 1/2\" X 2 1/2\"","UN ",null,"-","-",12.75,12.75]
[null,"AGETOP_I",11,"MATERIAL ELÉTRICO",0,0.15,0,0,0,0]
[null,"MÃO DE OBRA (B) - TOTAL",null,null,null,null,null,null,0,0]
[null,"SINAPI_I",20971,"CHAVE DUPLA PARA CONEXOES TIPO STORZ, ENGATE RAPIDO 1 1/2\" X 2 1/2\", EM LATAO, PARA INSTALACAO PREDIAL COMBATE A INCENDIO","UN    ",1,12.75,12.75,12.75,12.75]
[null,"MATERIAL (C) - TOTAL",null,null,null,null,null,null,12.75,12.75]
[]
[87,"FONTE","CÓDIGO","DESCRIÇÃO","UNIDADE","COEFIC.","CUSTO UNITÁRIO",null,"CUSTO  TOTAL (A) + (B) + (C) + (D) + (E)"]
[null,null,null,null,null,null,"DESONERADO","NÃO DESONER.","DESONERADO","NÃO DESONER."]
[null,"COMPOSIÇÃO","COMP 087_SEE","REGISTRO DE GAVETA COM HASTE ASCENDENTE DE BRONZE 2 1/2\"","UN ",null,null,null,241.73,243.32999999999998]
[null,"AGETOP_I",8,"AJUDANTE","h     ",1.1499999999999999,8.75,10.14,10.06,11.66]
[null,"AGETOP_I",11,"MATERIAL ELÉTRICO",0,1.1499999999999999,0,0,0,0]
[null,"MÃO DE OBRA (B) - TOTAL",null,null,null,null,null,null,10.06,11.66]
[null,"AGETOP_I","H689","","",2.82,0,0,0,0]
[null,"COTAÇÃO","COT 017_SEE","REGISTRO DE GAVETA COM HASTE ASCENDENTE DE BRONZE 2 1/2\"","UN ",1,231.66666666666666,231.66666666666666,231.67,231.67]
[null,"MATERIAL (C) - TOTAL",null,null,null,null,null,null,231.67,231.67]
[]
[30,"FONTE","CÓDIGO","DESCRIÇÃO","UNIDADE","COEFIC.","CUSTO UNITÁRIO",null,"CUSTO  TOTAL (A) + (B) + (C) + (D) + (E)"]
[null,null,null,null,null,null,"DESONERADO","NÃO DESONER.","DESONERADO","NÃO DESONER."]
[null,"COMPOSIÇÃO","COMP 030_SEE","COTOVELO DE FERRO GALV. 90° X 2 1/2\"","UN ",null,null,null,56.78,58.059999999999995]
[null,"AGETOP_I",8,"AJUDANTE","h     ",0.92,8.75,10.14,8.0500000000000007,9.33]
[null,"AGETOP_I",11,"MATERIAL ELÉTRICO",0,0.92,0,0,0,0]
[null,"MÃO DE OBRA (B) - TOTAL",null,null,null,null,null,null,8.0500000000000007,9.33]
[null,"SINAPI_I",3470,"COTOVELO 90 GRAUS DE FERRO GALVANIZADO, COM ROSCA BSP, DE 2 1/2\"","UN    ",1,48.73,48.73,48.73,48.73]
[null,"AGETOP_I","H689","","",2,0,0,0,0]
[null,"MATERIAL (C) - TOTAL",null,null,null,null,null,null,48.73,48.73]
[]
[77,"FONTE","CÓDIGO","DESCRIÇÃO","UNIDADE","COEFIC.","CUSTO UNITÁRIO",null,"CUSTO  TOTAL (A) + (B) + (C) + (D) + (E)"]
[null,null,null,null,null,null,"DESONERADO","NÃO DESONER.","DESONERADO","NÃO DESONER."]
[null,"COMPOSIÇÃO","COMP 077_SEE","UNIAO FERRO GALV C/ASSENTO CONICO BRONZE 2 1/2\"","UN ",null,null,null,142.49,143.05000000000001]
[null,"AGETOP_I",8,"AJUDANTE","h     ",0.4,8.75,10.14,3.5,4.0599999999999996]
[null,"AGETOP_I",11,"MATERIAL ELÉTRICO",0,0.4,0,0,0,0]
[null,"MÃO DE OBRA (B) - TOTAL",null,null,null,null,null,null,3.5,4.0599999999999996]
[null,"AGETOP_I","H689","","",2.4,0,0,0,0]
[null,"SINAPI_I",12427,"UNIAO COM ASSENTO CONICO DE BRONZE, DIAMETRO 2 1/2\"","UN    ",1,138.99,138.99,138.99,138.99]
[null,"MATERIAL (C) - TOTAL",null,null,null,null,null,null,138.99,138.99]
[]
[76,"FONTE","CÓDIGO","DESCRIÇÃO","UNIDADE","COEFIC.","CUSTO UNITÁRIO",null,"CUSTO  TOTAL (A) + (B) + (C) + (D) + (E)"]
[null,null,null,null,null,null,"DESONERADO","NÃO DESONER.","DESONERADO","NÃO DESONER."]
[null,"COMPOSIÇÃO","COMP 076_SEE","CURVA FERRO GALVANIZADO 45G ROSCA MACHO/FEMEA REF. 2 1/2\"","UN ",null,null,null,104.91,106.19]
[null,"AGETOP_I",8,"AJUDANTE","h     ",0.92,8.75,10.14,8.0500000000000007,9.33]
[null,"AGETOP_I",11,"MATERIAL ELÉTRICO",0,0.92,0,0,0,0]
[null,"MÃO DE OBRA (B) - TOTAL",null,null,null,null,null,null,8.0500000000000007,9.33]
[null,"SINAPI_I",3148,"FITA VEDA ROSCA EM ROLOS DE 18 MM X 50 M (L X C)","UN    ",4.9099999999999998E-2,14.49,14.49,0.71,0.71]
[null,"SINAPI_I",1784,"CURVA 45 GRAUS DE FERRO GALVANIZADO, COM ROSCA BSP MACHO/FEMEA, DE 2 1/2\"","UN    ",1,96.15,96.15,96.15,96.15]
[null,"MATERIAL (C) - TOTAL",null,null,null,null,null,null,96.86,96.86]
[]
[22,"FONTE","CÓDIGO","DESCRIÇÃO","UNIDADE","COEFIC.","CUSTO UNITÁRIO",null,"CUSTO  TOTAL (A) + (B) + (C) + (D) + (E)"]
[null,null,null,null,null,null,"DESONERADO","NÃO DESONER.","DESONERADO","NÃO DESONER."]
[null,"COMPOSIÇÃO","COMP 022_SEE","TAMPÃO FOFO 40X50CM C/INSCRIÇÃO ","UN ",null,"-","-",197.82,197.82]
[null,"AGETOP_I",11,"MATERIAL ELÉTRICO",0,0.15,0,0,0,0]
[null,"MÃO DE OBRA (B) - TOTAL",null,null,null,null,null,null,0,0]
[null,"SINAPI_I",11293,"TAMPAO FOFO SIMPLES COM BASE, CLASSE A15 CARGA MAX 1,5 T, 400 X 500 MM, COM INSCRICAO INCENDIO","UN    ",1,197.82,197.82,197.82,197.82]
[null,"MATERIAL (C) - TOTAL",null,null,null,null,null,null,197.82,197.82]
[]
[24,"FONTE","CÓDIGO","DESCRIÇÃO","UNIDADE","COEFIC.","CUSTO UNITÁRIO",null,"CUSTO  TOTAL (A) + (B) + (C) + (D) + (E)"]
[null,null,null,null,null,null,"DESONERADO","NÃO DESONER.","DESONERADO","NÃO DESONER."]
[null,"COMPOSIÇÃO","COMP 024_SEE","SINALIZADOR FOTOLUMINESCENTE PARA EXTINTOR","UN ",null,"-","-",25.319999999999997,25.439999999999998]
[null,"AGETOP_I",5,"SERVENTE","h     ",0.09,8.75,10.14,0.79,0.91]
[null,"MÃO DE OBRA (B) - TOTAL",null,null,null,null,null,null,0.79,0.91]
[null,"AGETOP_I",3070,"BUCHA DE NYLON S-6","un",2,0.04,0.04,0.08,0.08]
[null,"AGETOP_I",3393,"PARAFUSO P/BUCHA S-6","un",2,0.08,0.08,0.16,0.16]
[null,"SINAPI_I",37556,"PLACA DE SINALIZACAO DE SEGURANCA CONTRA INCENDIO, FOTOLUMINESCENTE, QUADRADA, *20 X 20* CM, EM PVC *2* MM ANTI-CHAMAS (SIMBOLOS, CORES E PICTOGRAMAS CONFORME NBR 13434)","UN    ",1,24.29,24.29,24.29,24.29]
[null,"MATERIAL (C) - TOTAL",null,null,null,null,null,null,24.529999999999998,24.529999999999998]
[]
[186,"FONTE","CÓDIGO","DESCRIÇÃO","UNIDADE","COEFIC.","CUSTO UNITÁRIO",null,"CUSTO  TOTAL (A) + (B) + (C) + (D) + (E)"]
[null,null,null,null,null,null,"DESONERADO","NÃO DESONER.","DESONERADO","NÃO DESONER."]
[null,"COMPOSIÇÃO","COMP 186_SEE","BOTOEIRA BOMBA DE INCÊNDIO C/ MARTELO CONVENCIONAL/ ANALÓGICA","UN ",null,null,null,72.25,73.64]
[null,"AGETOP_I",8,"AJUDANTE","h     ",1,8.75,10.14,8.75,10.14]
[null,"AGETOP_I",12,"MATERIAL HIDRO-SANITÁRIO",0,1,0,0,0,0]
[null,"MÃO DE OBRA (B) - TOTAL",null,null,null,null,null,null,8.75,10.14]
[null,"COTAÇÃO","COT 088_SEE","BOTOEIRA BOMBA DE INCÊNDIO C/ MARTELO CONVENCIONAL/ ANALÓGICA","UN",1,63.5,63.5,63.5,63.5]
[null,"MATERIAL (C) - TOTAL",null,null,null,null,null,null,63.5,63.5]
[]
[188,"FONTE","CÓDIGO","DESCRIÇÃO","UNIDADE","COEFIC.","CUSTO UNITÁRIO",null,"CUSTO  TOTAL (A) + (B) + (C) + (D) + (E)"]
[null,null,null,null,null,null,"DESONERADO","NÃO DESONER.","DESONERADO","NÃO DESONER."]
[null,"COMPOSIÇÃO","COMP 188_SEE","ACIONADOR MANUAL DE ALARME","UN ",null,null,null,90.33,91.44]
[null,"AGETOP_I",8,"AJUDANTE","h     ",0.8,8.75,10.14,7,8.11]
[null,"AGETOP_I",12,"MATERIAL HIDRO-SANITÁRIO",0,0.8,0,0,0,0]
[null,"MÃO DE OBRA (B) - TOTAL",null,null,null,null,null,null,7,8.11]
[null,"COTAÇÃO","COT 090_SEE","ACIONADOR MANUAL DE ALARME","UN",1,83.333333333333329,83.333333333333329,83.33,83.33]
[null,"MATERIAL (C) - TOTAL",null,null,null,null,null,null,83.33,83.33]
[]
[190,"FONTE","CÓDIGO","DESCRIÇÃO","UNIDADE","COEFIC.","CUSTO UNITÁRIO",null,"CUSTO  TOTAL (A) + (B) + (C) + (D) + (E)"]
[null,null,null,null,null,null,"DESONERADO","NÃO DESONER.","DESONERADO","NÃO DESONER."]
[null,"COMPOSIÇÃO","COMP 190_SEE","CENTRAL DE DETECÇÃO E ALARME DE 40 SETORES COM BATERIA","UN ",null,null,null,1033.33,1044.45]
[null,"AGETOP_I",8,"AJUDANTE","h     ",8,8.75,10.14,70,81.12]
[null,"AGETOP_I",12,"MATERIAL HIDRO-SANITÁRIO",0,8,0,0,0,0]
[null,"MÃO DE OBRA (B) - TOTAL",null,null,null,null,null,null,70,81.12]
[null,"COTAÇÃO","COT 092_SEE","CENTRAL DE DETECÇÃO E ALARME DE 40 SETORES COM BATERIA (PREÇO MÉDIO)","UN",1,963.33333333333337,963.33333333333337,963.33,963.33]
[null,"MATERIAL (C) - TOTAL",null,null,null,null,null,null,963.33,963.33]
[]
[25,"FONTE","CÓDIGO","DESCRIÇÃO","UNIDADE","COEFIC.","CUSTO UNITÁRIO",null,"CUSTO  TOTAL (A) + (B) + (C) + (D) + (E)"]
[null,null,null,null,null,null,"DESONERADO","NÃO DESONER.","DESONERADO","NÃO DESONER."]
[null,"COMPOSIÇÃO","COMP 025_SEE","SINALIZADOR FOTOLUMINESCENTE DE EMERGÊNCIA","UN ",null,"-","-",25.319999999999997,25.439999999999998]
[null,"AGETOP_I",5,"SERVENTE","h     ",0.09,8.75,10.14,0.79,0.91]
[null,"MÃO DE OBRA (B) - TOTAL",null,null,null,null,null,null,0.79,0.91]
[null,"AGETOP_I",3070,"BUCHA DE NYLON S-6","un",2,0.04,0.04,0.08,0.08]
[null,"AGETOP_I",3393,"PARAFUSO P/BUCHA S-6","un",2,0.08,0.08,0.16,0.16]
[null,"SINAPI_I",37556,"PLACA DE SINALIZACAO DE SEGURANCA CONTRA INCENDIO, FOTOLUMINESCENTE, QUADRADA, *20 X 20* CM, EM PVC *2* MM ANTI-CHAMAS (SIMBOLOS, CORES E PICTOGRAMAS CONFORME NBR 13434)","UN    ",1,24.29,24.29,24.29,24.29]
[null,"MATERIAL (C) - TOTAL",null,null,null,null,null,null,24.529999999999998,24.529999999999998]
[]
[277,"FONTE","CÓDIGO","DESCRIÇÃO","UNIDADE","COEFIC.","CUSTO UNITÁRIO",null,"CUSTO  TOTAL (A) + (B) + (C) + (D) + (E)"]
[null,null,null,null,null,null,"DESONERADO","NÃO DESONER.","DESONERADO","NÃO DESONER."]
[null,"COMPOSIÇÃO","COMP 277_SEE","MARCAÇÃO NO PISO - 1X1 M PARA EXTINTOR","M2",null,null,null,29.54,29.619999999999997]
[null,"AGETOP_I",5,"SERVENTE","h     ",3.3300000000000003E-2,8.75,10.14,0.28999999999999998,0.34]
[null,"MÃO DE OBRA (B) - TOTAL",null,null,null,null,null,null,0.28999999999999998,0.34]
[null,"SINAPI_I",5318,"SOLVENTE DILUENTE A BASE DE AGUARRAS","L     ",0.13,11,11,1.43,1.43]
[null,"SINAPI",5824,"CAMINHÃO TOCO, PBT 16.000 KG, CARGA ÚTIL MÁX. 10.685 KG, DIST. ENTRE EIXOS 4,8 M, POTÊNCIA 189 CV, INCLUSIVE CARROCERIA FIXA ABERTA DE MADEIRA P/ TRANSPORTE GERAL DE CARGA SECA, DIMEN. APROX. 2,5 X 7,00 X 0,50 M - CHP DIURNO. AF_06/2014","CHP",3.3E-3,122.72,125.93,0.4,0.42]
[null,"SINAPI_I",7343,"TINTA A BASE DE RESINA ACRILICA, PARA SINALIZACAO HORIZONTAL VIARIA (NBR 11862)","L     ",0.6,12.55,12.55,7.53,7.53]
[null,"SINAPI_I",7348,"TINTA ACRILICA PREMIUM PARA PISO","L     ",0.03,13,13,0.39,0.39]
[null,"SINAPI_I",25972,"MICROESFERAS DE VIDRO PARA SINALIZACAO HORIZONTAL VIARIA, TIPO I-B (PREMIX) - NBR 16184","KG    ",2.14,8.94,8.94,19.13,19.13]
[null,"SINAPI",95133,"MÁQUINA DEMARCADORA DE FAIXA DE TRÁFEGO À FRIO, AUTOPROPELIDA, POTÊNCIA 38 HP - CHP DIURNO. AF_07/2016","CHP",3.3E-3,111.93,115.51,0.37,0.38]
[null,"MATERIAL (C) - TOTAL",null,null,null,null,null,null,29.25,29.279999999999998]
[]
[40,"FONTE","CÓDIGO","DESCRIÇÃO","UNIDADE","COEFIC.","CUSTO UNITÁRIO",null,"CUSTO  TOTAL (A) + (B) + (C) + (D) + (E)"]
[null,null,null,null,null,null,"DESONERADO","NÃO DESONER.","DESONERADO","NÃO DESONER."]
[null,"COMPOSIÇÃO","COMP 040_SEE","CONJUNTO MOTOR-BOMBA ELÉTRICA TRIFÁSICO 380/220 V PARA VZ= 24,33 M³/H, HM= 46,24 M POTÊNCIA= 7,5 CV","UN ",null,null,null,3862.67,3873.79]
[null,"AGETOP_I",8,"AJUDANTE","h     ",8,8.75,10.14,70,81.12]
[null,"AGETOP_I",11,"MATERIAL ELÉTRICO",0,8,0,0,0,0]
[null,"MÃO DE OBRA (B) - TOTAL",null,null,null,null,null,null,70,81.12]
[null,"COTAÇÃO","COT 008_SEE","CONJUNTO MOTOR-BOMBA ELÉTRICA TRIFÁSICO 380/220 V PARA VZ= 24,33 M³/H, HM= 46,24 M POTÊNCIA= 7,5 CV","UN ",1,3792.6666666666665,3792.6666666666665,3792.67,3792.67]
[null,"MATERIAL (C) - TOTAL",null,null,null,null,null,null,3792.67,3792.67]
[]
[546,"FONTE","CÓDIGO","DESCRIÇÃO","UNID ","COEFIC.","CUSTO UNITÁRIO",null,"CUSTO  TOTAL (A) + (B) + (C) + (D) + (E)"]
[null,null,null,null,null,null,"DESONERADO","NÃO DESONER.","DESONERADO","NÃO DESONER."]
[null,"COMPOSIÇÃO","COMP 546_SEE","BUJÃO DE REBORDO 2.1/2\"","UN ","-","-","-",15.61,15.71]
[null,"AGETOP_I",8,"AJUDANTE","h     ",7.0000000000000007E-2,8.75,10.14,0.61,0.71]
[null,"AGETOP_I",11,"MATERIAL ELÉTRICO",0,7.0000000000000007E-2,0,0,0,0]
[null,"MÃO DE OBRA (B) - TOTAL",null,null,null,null,null,null,0.61,0.71]
[null,"COTAÇÃO","COT 286_SEE","BUJÃO DE REBORDO 2.1/2\"","UN ",1,15,15,15,15]
[null,"MATERIAL (C) - TOTAL",null,null,null,null,null,null,15,15]
[]
[548,"FONTE","CÓDIGO","DESCRIÇÃO","UNID ","COEFIC.","CUSTO UNITÁRIO",null,"CUSTO  TOTAL (A) + (B) + (C) + (D) + (E)"]
[null,null,null,null,null,null,"DESONERADO","NÃO DESONER.","DESONERADO","NÃO DESONER."]
[null,"COMPOSIÇÃO","COMP 548_SEE","VÁLVULA DE ESFERA BRUTA, METAL, ROSCÁVEL, 2.1/2\" - FORNECIMENTO E INSTALAÇÃO","UN ","-","-","-",310.24999999999994,313.14999999999998]
[null,"SINAPI",88248,"AUXILIAR DE ENCANADOR OU BOMBEIRO HIDRÁULICO COM ENCARGOS COMPLEMENTARES","H",0.77449999999999997,13.83,15.38,10.71,11.91]
[null,"SINAPI",88267,"ENCANADOR OU BOMBEIRO HIDRÁULICO COM ENCARGOS COMPLEMENTARES","H",0.77449999999999997,17.91,20.100000000000001,13.87,15.57]
[null,"MÃO DE OBRA (B) - TOTAL",null,null,null,null,null,null,24.58,27.48]
[null,"SINAPI_I",3148,"FITA VEDA ROSCA EM ROLOS DE 18 MM X 50 M (L X C)","UN    ",9.4999999999999998E-3,14.49,14.49,0.14000000000000001,0.14000000000000001]
[null,"COTAÇÃO","COT 290_SEE","VÁLVULA DE ESFERA BRUTA EM METAL, BITOLA 2.1/2\"","UN ",1,285.52600000000001,285.52600000000001,285.52999999999997,285.52999999999997]
[null,"MATERIAL (C) - TOTAL",null,null,null,null,null,null,285.66999999999996,285.66999999999996]
[]
[347,"FONTE","CÓDIGO","DESCRIÇÃO","UNIDADE","COEFIC.","CUSTO UNITÁRIO",null,"CUSTO  TOTAL (A) + (B) + (C) + (D) + (E)"]
[null,null,null,null,null,null,"DESONERADO","NÃO DESONER.","DESONERADO","NÃO DESONER."]
[null,"COMPOSIÇÃO","COMP 347_SEE","ADAPTADOR PVC SOLDAVEL, COM FLANGES LIVRES, 75 MM X 2 1/2\", PARA CAIXA D' AGUA","UN ",null,null,null,116.42,116.61]
[null,"AGETOP_I",11,"MATERIAL ELÉTRICO",0,0.14000000000000001,0,0,0,0]
[null,"AGETOP_I",8,"AJUDANTE","h     ",0.14000000000000001,8.75,10.14,1.23,1.42]
[null,"MÃO DE OBRA (B) - TOTAL",null,null,null,null,null,null,1.23,1.42]
[null,"SINAPI_I",83,"ADAPTADOR PVC SOLDAVEL, COM FLANGES LIVRES, 75 MM X 2  1/2\", PARA CAIXA D' AGUA","UN    ",1,115.19,115.19,115.19,115.19]
[null,"AGETOP_I","H689","","",1.88,0,0,0,0]
[null,"MATERIAL (C) - TOTAL",null,null,null,null,null,null,115.19,115.19]
[]
[83,"FONTE","CÓDIGO","DESCRIÇÃO","UNIDADE","COEFIC.","CUSTO UNITÁRIO",null,"CUSTO  TOTAL (A) + (B) + (C) + (D) + (E)"]
[null,null,null,null,null,null,"DESONERADO","NÃO DESONER.","DESONERADO","NÃO DESONER."]
[null,"COMPOSIÇÃO","COMP 083_SEE","CORRIMÃO PISO - SEDUC","M",null,null,null,143.18,147.41000000000003]
[null,"AGETOP_I",25,"OFICIAL \"B\"","h     ",1,13.95,16.16,13.95,16.16]
[null,"AGETOP_I",8,"AJUDANTE","h     ",1,8.75,10.14,8.75,10.14]
[null,"MÃO DE OBRA (B) - TOTAL",null,null,null,null,null,null,22.7,26.3]
[null,"AGETOP_I",2376,"TUBO INDUSTRIAL 2\" CHAPA 13 ","Kg",8.2197499999999994,5.23,5.23,42.99,42.99]
[null,"AGETOP_I",2504,"TUBO INDUSTRIAL D=25 MM CHAPA 13 ","Kg",1.1000000000000001,5.07,5.07,5.58,5.58]
[null,"AGETOP_I",2417,"MASSA PLASTICA","Kg",0.2041,10.58,10.58,2.16,2.16]
[null,"AGETOP_I",2246,"ELETRODO 2.5 OK","Kg",0.11459999999999999,8.6999999999999993,8.6999999999999993,1,1]
[null,"AGETOP_I",1672,"LIXA PARA FERRO ( NÚMERO 100 )","un",0.125,2.12,2.12,0.27,0.27]
[null,"AGETOP_I",1264,"DISCO DE DESBASTE 7/8\" P/ CONC./FERRO (1/4\" X 7\")","un",2.5000000000000001E-2,7,7,0.18,0.18]
[null,"AGETOP_I",1334,"DISCO DE CORTE DIAM. 5/8\"- 10\"","un",0.1865,5.5,5.5,1.03,1.03]
[null,"AGETOP_I",2902,"FABRICAÇÃO / MONTAGEM","un",1,50.44,50.44,50.44,50.44]
[null,"AGETOP_I",2150,"CHAPA DE FERRO DOBRADA No.13","Kg",0.43519999999999998,5.28,5.28,2.2999999999999998,2.2999999999999998]
[null,"AGETOP_I",2719,"CHAPA PERFILADA 3/16\"","Kg",1.1644000000000001,5.04,5.04,5.87,5.87]
[null,"AGETOP_I",2436,"ACO CA-25 - 6,3 MM (1/4\") - BARRA LISA A-36","Kg",0.48150000000000004,5.13,5.13,2.4700000000000002,2.4700000000000002]
[null,"AGETOP",261602,"PINT.ESMALTE/ESQUAD.FERRO C/FUNDO ANTICOR.","m2    ",0.44,14.07,15.51,6.19,6.82]
[null,"MATERIAL (C) - TOTAL",null,null,null,null,null,null,120.48,121.11000000000001]
[]
[83,"FONTE","CÓDIGO","DESCRIÇÃO","UNIDADE","COEFIC.","CUSTO UNITÁRIO",null,"CUSTO  TOTAL (A) + (B) + (C) + (D) + (E)"]
[null,null,null,null,null,null,"DESONERADO","NÃO DESONER.","DESONERADO","NÃO DESONER."]
[null,"COMPOSIÇÃO","COMP 083_SEE","CORRIMÃO PISO - SEDUC","M",null,null,null,143.18,147.41000000000003]
[null,"AGETOP_I",25,"OFICIAL \"B\"","h     ",1,13.95,16.16,13.95,16.16]
[null,"AGETOP_I",8,"AJUDANTE","h     ",1,8.75,10.14,8.75,10.14]
[null,"MÃO DE OBRA (B) - TOTAL",null,null,null,null,null,null,22.7,26.3]
[null,"AGETOP_I",2376,"TUBO INDUSTRIAL 2\" CHAPA 13 ","Kg",8.2197499999999994,5.23,5.23,42.99,42.99]
[null,"AGETOP_I",2504,"TUBO INDUSTRIAL D=25 MM CHAPA 13 ","Kg",1.1000000000000001,5.07,5.07,5.58,5.58]
[null,"AGETOP_I",2417,"MASSA PLASTICA","Kg",0.2041,10.58,10.58,2.16,2.16]
[null,"AGETOP_I",2246,"ELETRODO 2.5 OK","Kg",0.11459999999999999,8.6999999999999993,8.6999999999999993,1,1]
[null,"AGETOP_I",1672,"LIXA PARA FERRO ( NÚMERO 100 )","un",0.125,2.12,2.12,0.27,0.27]
[null,"AGETOP_I",1264,"DISCO DE DESBASTE 7/8\" P/ CONC./FERRO (1/4\" X 7\")","un",2.5000000000000001E-2,7,7,0.18,0.18]
[null,"AGETOP_I",1334,"DISCO DE CORTE DIAM. 5/8\"- 10\"","un",0.1865,5.5,5.5,1.03,1.03]
[null,"AGETOP_I",2902,"FABRICAÇÃO / MONTAGEM","un",1,50.44,50.44,50.44,50.44]
[null,"AGETOP_I",2150,"CHAPA DE FERRO DOBRADA No.13","Kg",0.43519999999999998,5.28,5.28,2.2999999999999998,2.2999999999999998]
[null,"AGETOP_I",2719,"CHAPA PERFILADA 3/16\"","Kg",1.1644000000000001,5.04,5.04,5.87,5.87]
[null,"AGETOP_I",2436,"ACO CA-25 - 6,3 MM (1/4\") - BARRA LISA A-36","Kg",0.48150000000000004,5.13,5.13,2.4700000000000002,2.4700000000000002]
[null,"AGETOP",261602,"PINT.ESMALTE/ESQUAD.FERRO C/FUNDO ANTICOR.","m2    ",0.44,14.07,15.51,6.19,6.82]
[null,"MATERIAL (C) - TOTAL",null,null,null,null,null,null,120.48,121.11000000000001]
[]
[206,"FONTE","CÓDIGO","DESCRIÇÃO","UNIDADE","COEFIC.","CUSTO UNITÁRIO",null,"CUSTO  TOTAL (A) + (B) + (C) + (D) + (E)"]
[null,null,null,null,null,null,"DESONERADO","NÃO DESONER.","DESONERADO","NÃO DESONER."]
[null,"COMPOSIÇÃO","COMP 206_SEE","BANCO ARTICULADO PARA BANHO, EM ACO INOX POLIDO, 70* CM X 45* CM","UN ",null,null,null,692.61,694]
[null,"AGETOP_I",8,"AJUDANTE","h     ",1,8.75,10.14,8.75,10.14]
[null,"AGETOP_I",11,"MATERIAL ELÉTRICO",0,1,0,0,0,0]
[null,"MÃO DE OBRA (B) - TOTAL",null,null,null,null,null,null,8.75,10.14]
[null,"SINAPI_I",36215,"BANCO ARTICULADO PARA BANHO, EM ACO INOX POLIDO, 70* CM X 45* CM","UN    ",1,682.26,682.26,682.26,682.26]
[null,"AGETOP_I",2221,"PARAFUSO COM BUCHA S-8","un",8,0.2,0.2,1.6,1.6]
[null,"MATERIAL (C) - TOTAL",null,null,null,null,null,null,683.86,683.86]
[]
[387,"FONTE","CÓDIGO","DESCRIÇÃO","UNIDADE","COEFIC.","CUSTO UNITÁRIO",null,"CUSTO  TOTAL (A) + (B) + (C) + (D) + (E)"]
[null,null,null,null,null,null,"DESONERADO","NÃO DESONER.","DESONERADO","NÃO DESONER."]
[null,"COMPOSIÇÃO","COMP 387_SEE","LÂMPADA LED TUBULAR 18W ","UN ",null,null,null,22.09,22.11]
[null,"AGETOP_I",8,"AJUDANTE","h     ",1.4999999999999999E-2,8.75,10.14,0.13,0.15]
[null,"AGETOP_I",12,"MATERIAL HIDRO-SANITÁRIO",0,1.4999999999999999E-2,0,0,0,0]
[null,"MÃO DE OBRA (B) - TOTAL",null,null,null,null,null,null,0.13,0.15]
[null,"COTAÇÃO","COT 195_SEE","LÂMPADA LED TUBULAR 18W ","UN",1,21.959999999999997,21.959999999999997,21.96,21.96]
[null,"MATERIAL (C) - TOTAL",null,null,null,null,null,null,21.96,21.96]
[]
[209,"FONTE","CÓDIGO","DESCRIÇÃO","UNIDADE","COEFIC.","CUSTO UNITÁRIO",null,"CUSTO  TOTAL (A) + (B) + (C) + (D) + (E)"]
[null,null,null,null,null,null,"DESONERADO","NÃO DESONER.","DESONERADO","NÃO DESONER."]
[null,"COMPOSIÇÃO","COMP 209_SEE","TOALHEIRO PLÁSTICO TIPO DISPENSER PARA PAPEL TOALHA INTERFOLHADO","UN ",null,null,null,49.58,50.48]
[null,"AGETOP_I",8,"AJUDANTE","h     ",0.25,8.75,10.14,2.19,2.54]
[null,"AGETOP_I",4,"PEDREIRO","h     ",0.25,13.95,16.16,3.49,4.04]
[null,"MÃO DE OBRA (B) - TOTAL",null,null,null,null,null,null,5.68,6.58]
[null,"SINAPI_I",37401,"TOALHEIRO PLASTICO TIPO DISPENSER PARA PAPEL TOALHA INTERFOLHADO","UN    ",1,43.1,43.1,43.1,43.1]
[null,"AGETOP_I",2221,"PARAFUSO COM BUCHA S-8","un",4,0.2,0.2,0.8,0.8]
[null,"MATERIAL (C) - TOTAL",null,null,null,null,null,null,43.9,43.9]