{"text_format":"1","workbook":"xlsx","n_sheets":8,"sheets":["Orçamento","Resumo ","Somatório","Cronog_90_Dias","Composição BDI","Relatório CENTRAL","Parc Maior Relev","Composições"],"not_rendered":{"charts":0,"images":4,"macros":1,"external_links":1,"defined_names":105,"comments":2,"pivot_tables":0},"unopened":[],"bounds":{"document_bytes":16777216,"sheet_cells":100000,"rows_first":2000,"rows_last":500,"rows_between":2000,"halvings":0,"cell_chars":16384,"cell_head_chars":4096},"cells_cut":0,"cells_raw":0,"read":"whole","date_system":"1900"}

{"sheet":"Orçamento","index":0,"n_rows":486,"n_cols":27,"rows_kept":486,"cut":false,"hidden":false,"merged":[[473,15,473,17],[473,18,473,22],[474,15,474,17],[474,18,474,22],[475,15,475,17],[475,18,475,22],[9,24,9,25],[8,23,8,25],[467,18,467,22],[468,15,468,17],[468,18,468,22],[469,15,469,17],[469,18,469,22],[464,15,464,17],[464,18,464,22],[465,15,465,17],[465,18,465,22],[466,15,466,17],[466,18,466,22],[460,14,460,26],[461,18,461,22],[462,15,462,17],[462,18,462,22],[447,15,447,17],[479,23,479,25],[480,23,480,25],[481,23,481,25],[482,23,482,25],[483,23,483,25],[484,23,484,25],[485,23,485,25],[454,14,454,17],[461,15,461,17],[427,15,427,17],[482,18,482,22],[470,15,470,17],[470,18,470,22],[471,15,471,17],[471,18,471,22],[472,15,472,17],[472,18,472,22],[476,15,476,17],[476,18,476,22],[477,15,477,17],[477,18,477,22],[478,15,478,17],[467,15,467,17],[485,18,485,22],[482,14,482,17],[479,15,479,17],[479,18,479,22],[480,15,480,17],[480,18,480,22],[481,15,481,17],[481,18,481,22],[484,18,484,22],[483,18,483,22],[418,16,418,24],[419,16,419,24],[420,16,420,24],[10,14,10,26],[13,14,13,26],[2,14,2,22],[3,14,3,22],[5,18,5,22],[6,18,6,22],[11,18,11,22],[12,18,12,22],[6,14,6,17],[5,14,5,17],[3,23,3,25],[2,23,2,25],[5,23,5,25],[6,23,6,25],[8,18,8,20],[410,17,415,17],[416,22,416,24],[410,22,410,24],[411,22,411,24],[412,22,412,24],[421,16,421,24],[427,23,427,25],[443,23,443,25],[444,23,444,25],[463,15,463,17],[463,18,463,22],[422,16,422,24],[440,15,440,17],[441,15,441,17],[426,14,426,26],[427,18,427,22],[428,18,428,22],[436,18,436,22],[437,18,437,22],[438,18,438,22],[439,18,439,22],[451,18,451,22],[448,15,448,17],[428,15,428,17],[429,15,429,17],[430,15,430,17],[431,15,431,17],[432,15,432,17],[433,15,433,17],[434,15,434,17],[435,15,435,17],[436,15,436,17],[445,23,445,25],[446,23,446,25],[444,15,444,17],[445,15,445,17],[446,15,446,17],[447,23,447,25],[442,15,442,17],[443,15,443,17],[441,23,441,25],[442,23,442,25],[440,23,440,25],[457,18,457,22],[433,18,433,22],[434,18,434,22],[432,18,432,22],[441,18,441,22],[423,18,423,24],[429,18,429,22],[430,18,430,22],[431,18,431,22],[454,18,454,22],[452,18,452,22],[453,18,453,22],[443,18,443,22],[450,18,450,22],[446,18,446,22],[448,18,448,22],[444,18,444,22],[445,18,445,22],[454,23,454,25],[448,23,448,25],[449,23,449,25],[450,23,450,25],[451,23,451,25],[452,23,452,25],[456,18,456,22],[0,14,0,24],[8,14,8,16],[9,14,9,16],[11,14,11,16],[12,14,12,16],[14,14,14,24],[1,14,1,24],[4,14,4,24],[7,14,7,24],[440,18,440,22],[437,15,437,17],[438,15,438,17],[439,15,439,17],[449,18,449,22],[447,18,447,22],[455,18,455,22],[442,18,442,22],[435,18,435,22],[449,15,449,17],[450,15,450,17],[452,15,452,17],[453,15,453,17],[455,23,455,25],[476,23,476,25],[477,23,477,25],[478,23,478,25],[461,23,461,25],[462,23,462,25],[463,23,463,25],[464,23,464,25],[465,23,465,25],[466,23,466,25],[467,23,467,25],[468,23,468,25],[469,23,469,25],[470,23,470,25],[471,23,471,25],[472,23,472,25],[473,23,473,25],[474,23,474,25],[475,23,475,25],[451,15,451,17],[456,23,456,25],[457,23,457,25],[478,18,478,22],[414,22,414,24],[415,22,415,24],[6,12,6,13],[5,12,5,13],[12,23,12,25],[11,23,11,25],[9,19,9,22],[453,23,453,25],[428,23,428,25],[429,23,429,25],[430,23,430,25],[431,23,431,25],[432,23,432,25],[433,23,433,25],[434,23,434,25],[435,23,435,25],[436,23,436,25],[437,23,437,25],[438,23,438,25],[439,23,439,25]]}
[]
[]
[null,null,null,null,null,null,null,null,null,null,null,null,null,null,"UNIDADE ESCOLAR",null,null,null,null,null,null,null,null,"CÓDIGO INEP"]
[null,null,null,null,null,null,null,null,null,null,null,null,{"$f":"IF($M$7=\"MANUAL\",\"DESPROTEJA A PLANILHA PARA FORMATAR\",\"\")","v":""},null,"CENTRO DE ENSINO EM PERÍODO INTEGRAL VISCONDE DE MAUÁ",null,null,null,null,null,null,null,null,52035662]
[]
["Nmax",null,null,null,null,null,null,null,null,null,null,null,null,null,"OBRA",null,null,null,"DATA",null,null,null,null,"CIDADE"]
[{"$f":"MAX($C$18:$C$410)","v":4},null,null,null,null,null,null,null,null,null,null,null,null,null,"AMPLIAÇÃO E REFORMA",null,null,null,"2020-07-28",null,null,null,null,"GOIÂNIA"]
[]
[null,null,null,null,null,null,null,null,null,null,null,null,null,null,"CRE",null,null,"ENDEREÇO","REFERÊNCIA AGETOP",null,null,null,null,"REFERÊNCIA SINAPI"]
[null,null,null,null,null,null,null,null,null,null,null,null,null,null,"CRE-GOIÂNIA",null,null," RUA 1016 COM RUA 1007 S/N , SETOR PEDRO LUDOVICO , CEP:74820-290","ABR/19","ONERADA",null,null,null,"ABR/20","ONERADA"]
[]
[null,null,null,null,null,null,null,null,null,null,null,null,null,null,"ÁREA EXISTENTE (M²)",null,null,"ÁREA A CONSTRUIR (M²)","ÁREA A DEMOLIR (M²)",null,null,null,null,"ÁREA TOTAL CONSTRUÍDA (M²)"]
[null,null,null,null,null,null,null,null,null,null,null,null,null,null,1805.48,null,null,23.32,null,null,null,null,null,1828.8]
[]
[null,null,null,null,null,null,null,null,null,null,null,"FILTRO",null,null,"PLANILHA ORÇAMENTÁRIA"]
["Nível E","Save Nivel","Nível C","Altura","n1","n2","n3","n4","n5","Czero","Cnível","↓","Nível","Nível Corrigido","ITEM","TABELA","CODIGO","DESCRIÇÃO DOS SERVIÇOS","UNID","QUANT","REPET","QUANT TOTAL","MAT","MO","T.SERVIÇO UNIT","VALOR TOTAL","OBSERVAÇÕES¹"]
[{"$f":"CHOOSE(1+LOG(1+2*(ORÇAMENTO.Nivel=\"Nível 1\")+4*(ORÇAMENTO.Nivel=\"Nível 2\")+8*(ORÇAMENTO.Nivel=\"Nível 3\")+16*(ORÇAMENTO.Nivel=\"Nível 4\")+32*(ORÇAMENTO.Nivel=\"Serviço\"),2),0,1,2,3,4,\"S\")","v":"S"},{"$f":"IF(OR(C17=\"s\",C17=0),OFFSET(B17,-1,0),C17)","v":"Save Nivel"},{"$f":"IF(OFFSET(C17,-1,0)=\"L\",1,IF(OFFSET(C17,-1,0)=1,2,IF(OR(A17=\"s\",A17=0),\"S\",IF(AND(OFFSET(C17,-1,0)=2,A17=4),3,IF(AND(OR(OFFSET(C17,-1,0)=\"s\",OFFSET(C17,-1,0)=0),A17<>\"s\",A17>OFFSET(B17,-1,0)),OFFSET(B17,-1,0),A17)))))","v":"S"},{"$f":"IF(OR(C17=\"S\",C17=0),0,IF(ISERROR(K17),J17,SMALL(J17:K17,1)))","v":0},{"$f":"IF($C17=1,OFFSET(E17,-1,0)+1,OFFSET(E17,-1,0))","v":"n1"},{"$f":"IF($C17=1,0,IF($C17=2,OFFSET(F17,-1,0)+1,OFFSET(F17,-1,0)))","v":"n2"},{"$f":"IF(AND($C17<=2,$C17<>0),0,IF($C17=3,OFFSET(G17,-1,0)+1,OFFSET(G17,-1,0)))","v":"n3"},{"$f":"IF(AND($C17<=3,$C17<>0),0,IF($C17=4,OFFSET(H17,-1,0)+1,OFFSET(H17,-1,0)))","v":"n4"},{"$f":"IF(AND($C17<=4,$C17<>0),0,IF(AND($C17=\"S\",$Y17>0),OFFSET(I17,-1,0)+1,OFFSET(I17,-1,0)))","v":"n5"},{"$f":"IF(OR($C17=\"S\",$C17=0),0,MATCH(0,OFFSET($D17,1,$C17,ROW($C$410)-ROW($C17)),0))","v":0},{"$f":"IF(OR($C17=\"S\",$C17=0),0,MATCH(OFFSET($D17,0,$C17)+1,OFFSET($D17,1,$C17,ROW($C$410)-ROW($C17)),0))","v":0},{"$f":"IF(OR(Y17>0,$C17=1),\"F\",\"\")","v":""},"Serviço",{"$f":"CHOOSE(1+LOG(1+2*(C17=1)+4*(C17=2)+8*(C17=3)+16*(C17=4)+32*(C17=\"S\"),2),\"\",\"Nível 1\",\"Nível 2\",\"Nível 3\",\"Nível 4\",\"Serviço\")","v":"Serviço"},"-","SINAPI",null,"(sem código)","-",null,"REPET","-",0,0,0,"-",""]
[0,null,"L",{"$f":"COUNTA(OFFSET(D18,1,0):D$410)","v":391},{"$f":"LEFT(O19,1)-1","v":0},null,null,null,null,null,null,"F","LOTE","LOTE","AMPLIAÇÃO E REFORMA - CENTRO DE ENSINO EM PERÍODO INTEGRAL VISCONDE DE MAUÁ",null,null,null,null,null,null,null,null,null,null,0]
[{"$f":"CHOOSE(1+LOG(1+2*(ORÇAMENTO.Nivel=\"Nível 1\")+4*(ORÇAMENTO.Nivel=\"Nível 2\")+8*(ORÇAMENTO.Nivel=\"Nível 3\")+16*(ORÇAMENTO.Nivel=\"Nível 4\")+32*(ORÇAMENTO.Nivel=\"Serviço\"),2),0,1,2,3,4,\"S\")","v":1},{"$f":"IF(OR(C19=\"s\",C19=0),OFFSET(B19,-1,0),C19)","v":1},{"$f":"IF(OFFSET(C19,-1,0)=\"L\",1,IF(OFFSET(C19,-1,0)=1,2,IF(OR(A19=\"s\",A19=0),\"S\",IF(AND(OFFSET(C19,-1,0)=2,A19=4),3,IF(AND(OR(OFFSET(C19,-1,0)=\"s\",OFFSET(C19,-1,0)=0),A19<>\"s\",A19>OFFSET(B19,-1,0)),OFFSET(B19,-1,0),A19)))))","v":1},{"$f":"IF(OR(C19=\"S\",C19=0),0,IF(ISERROR(K19),J19,SMALL(J19:K19,1)))","v":16},{"$f":"IF($C19=1,OFFSET(E19,-1,0)+1,OFFSET(E19,-1,0))","v":1},{"$f":"IF($C19=1,0,IF($C19=2,OFFSET(F19,-1,0)+1,OFFSET(F19,-1,0)))","v":0},{"$f":"IF(AND($C19<=2,$C19<>0),0,IF($C19=3,OFFSET(G19,-1,0)+1,OFFSET(G19,-1,0)))","v":0},{"$f":"IF(AND($C19<=3,$C19<>0),0,IF($C19=4,OFFSET(H19,-1,0)+1,OFFSET(H19,-1,0)))","v":0},{"$f":"IF(AND($C19<=4,$C19<>0),0,IF(AND($C19=\"S\",$Y19>0),OFFSET(I19,-1,0)+1,OFFSET(I19,-1,0)))","v":0},{"$f":"IF(OR($C19=\"S\",$C19=0),0,MATCH(0,OFFSET($D19,1,$C19,ROW($C$410)-ROW($C19)),0))","v":391},{"$f":"IF(OR($C19=\"S\",$C19=0),0,MATCH(OFFSET($D19,0,$C19)+1,OFFSET($D19,1,$C19,ROW($C$410)-ROW($C19)),0))","v":16},{"$f":"IF(OR(Y19>0,$C19=1),\"F\",\"\")","v":"F"},"Nível 1",{"$f":"CHOOSE(1+LOG(1+2*(C19=1)+4*(C19=2)+8*(C19=3)+16*(C19=4)+32*(C19=\"S\"),2),\"\",\"Nível 1\",\"Nível 2\",\"Nível 3\",\"Nível 4\",\"Serviço\")","v":"Nível 1"},"1.","AGETOP",null,"ACESSIBILIDADE","UN",1,1,1,null,null,0,0]
[2,2,2,4,1,1,0,0,0,15,4,"","Nível 2","Nível 2","-","AGETOP",null,"SERVIÇOS PRELIMINARES","-",null,1,"-",null,null,0,0]
["S",2,"S",0,1,1,0,0,0,0,0,"","Serviço","Serviço","-","AGETOP",67010,"ESCARIFICAÇÃO MANUAL, CORTE DE CONCRETO ATÉ 3CM DE PROFUNDIDADE","m3    ",0.72,1,0.72,null,null,0,0,""]
["S",2,"S",0,1,1,0,0,0,0,0,"","Serviço","Serviço","-","AGETOP",20109,"DEM.PISO CIMENT.SOBRE LASTRO CONC.C/TR.ATE CB. E CARGA","m2    ",1.1200000000000001,1,1.1200000000000001,null,null,0,0,""]
["S",2,"S",0,1,1,0,0,0,0,0,"","Serviço","Serviço","-","COMPOSIÇÃO","COMP 010_SEE","DEMOLIÇÃO DE GRADE/GRELHA/CORRIMÃO/GUARDA CORPO - METÁLICO","M2",15.09,1,15.09,null,null,0,0,""]
[2,2,2,3,1,2,0,0,0,11,3,"","Nível 2","Nível 2","-","AGETOP",null,"TRANSPORTES","-",null,1,"-",null,null,0,0,""]
["S",2,"S",0,1,2,0,0,0,0,0,"","Serviço","Serviço","-","SINAPI",72900,"TRANSPORTE DE ENTULHO COM CAMINHAO BASCULANTE 6 M3, RODOVIA PAVIMENTADA, DMT 0,5 A 1,0 KM","M3",1.53,1,1.53,null,null,0,0,""]
["S",2,"S",0,1,2,0,0,0,0,0,"","Serviço","Serviço","-","SINAPI",72897,"CARGA MANUAL DE ENTULHO EM CAMINHAO BASCULANTE 6 M3","M3",1.53,1,1.53,null,null,0,0,""]
[2,2,2,6,1,3,0,0,0,8,6,"","Nível 2","Nível 2","-","SINAPI",null,"REVESTIMENTO DE PISO","-",null,1,"-",null,null,0,0,""]
[{"$f":"CHOOSE(1+LOG(1+2*(ORÇAMENTO.Nivel=\"Nível 1\")+4*(ORÇAMENTO.Nivel=\"Nível 2\")+8*(ORÇAMENTO.Nivel=\"Nível 3\")+16*(ORÇAMENTO.Nivel=\"Nível 4\")+32*(ORÇAMENTO.Nivel=\"Serviço\"),2),0,1,2,3,4,\"S\")","v":3},{"$f":"IF(OR(C28=\"s\",C28=0),OFFSET(B28,-1,0),C28)","v":3},{"$f":"IF(OFFSET(C28,-1,0)=\"L\",1,IF(OFFSET(C28,-1,0)=1,2,IF(OR(A28=\"s\",A28=0),\"S\",IF(AND(OFFSET(C28,-1,0)=2,A28=4),3,IF(AND(OR(OFFSET(C28,-1,0)=\"s\",OFFSET(C28,-1,0)=0),A28<>\"s\",A28>OFFSET(B28,-1,0)),OFFSET(B28,-1,0),A28)))))","v":3},{"$f":"IF(OR(C28=\"S\",C28=0),0,IF(ISERROR(K28),J28,SMALL(J28:K28,1)))","v":2},{"$f":"IF($C28=1,OFFSET(E28,-1,0)+1,OFFSET(E28,-1,0))","v":1},{"$f":"IF($C28=1,0,IF($C28=2,OFFSET(F28,-1,0)+1,OFFSET(F28,-1,0)))","v":3},{"$f":"IF(AND($C28<=2,$C28<>0),0,IF($C28=3,OFFSET(G28,-1,0)+1,OFFSET(G28,-1,0)))","v":1},{"$f":"IF(AND($C28<=3,$C28<>0),0,IF($C28=4,OFFSET(H28,-1,0)+1,OFFSET(H28,-1,0)))","v":0},{"$f":"IF(AND($C28<=4,$C28<>0),0,IF(AND($C28=\"S\",$Y28>0),OFFSET(I28,-1,0)+1,OFFSET(I28,-1,0)))","v":0},5,2,{"$f":"IF(OR(Y28>0,$C28=1),\"F\",\"\")","v":""},"Nível 3",{"$f":"CHOOSE(1+LOG(1+2*(C28=1)+4*(C28=2)+8*(C28=3)+16*(C28=4)+32*(C28=\"S\"),2),\"\",\"Nível 1\",\"Nível 2\",\"Nível 3\",\"Nível 4\",\"Serviço\")","v":"Nível 3"},"-","SINAPI",null,"CONCRETO","-",null,1,"-",null,null,0,0,""]
["S",3,"S",0,1,3,1,0,0,0,0,"","Serviço","Serviço","-","AGETOP",220102,"PISO CONCRETO DESEMPENADO ESPESSURA = 5 CM  1:2,5:3,5","m2    ",22.47,1,22.47,null,null,0,0,""]
[3,3,3,3,1,3,2,0,0,3,239,"","Nível 3","Nível 3","-",null,null,"PODOTÁTIL","-",null,1,"-",null,null,0,0,""]
["S",3,"S",0,1,3,2,0,0,0,0,"","Serviço","Serviço","-","AGETOP",221120,"PISO DE BORRACHA COLORIDO MODELO TÁTIL ( ALERTA OU DIRECIONAL) INCLUSO CONTRAPISO (1CI:3ARML) C/ E=2CM E NATA DE CIMENTO","m2    ",1.56,1,1.56,null,null,0,0,""]
["S",3,"S",0,1,3,2,0,0,0,0,"","Serviço","Serviço","-","AGETOP",221126,"PISO DE LADRILHO HIDRÁULICO COLORIDO MODELO TÁTIL ( ALERTA OU DIRECIONAL) SEM LASTRO","m2    ",72.09,1,72.09,null,null,0,0,""]
[{"$f":"CHOOSE(1+LOG(1+2*(ORÇAMENTO.Nivel=\"Nível 1\")+4*(ORÇAMENTO.Nivel=\"Nível 2\")+8*(ORÇAMENTO.Nivel=\"Nível 3\")+16*(ORÇAMENTO.Nivel=\"Nível 4\")+32*(ORÇAMENTO.Nivel=\"Serviço\"),2),0,1,2,3,4,\"S\")","v":2},{"$f":"IF(OR(C33=\"s\",C33=0),OFFSET(B33,-1,0),C33)","v":2},{"$f":"IF(OFFSET(C33,-1,0)=\"L\",1,IF(OFFSET(C33,-1,0)=1,2,IF(OR(A33=\"s\",A33=0),\"S\",IF(AND(OFFSET(C33,-1,0)=2,A33=4),3,IF(AND(OR(OFFSET(C33,-1,0)=\"s\",OFFSET(C33,-1,0)=0),A33<>\"s\",A33>OFFSET(B33,-1,0)),OFFSET(B33,-1,0),A33)))))","v":2},{"$f":"IF(OR(C33=\"S\",C33=0),0,IF(ISERROR(K33),J33,SMALL(J33:K33,1)))","v":2},{"$f":"IF($C33=1,OFFSET(E33,-1,0)+1,OFFSET(E33,-1,0))","v":1},{"$f":"IF($C33=1,0,IF($C33=2,OFFSET(F33,-1,0)+1,OFFSET(F33,-1,0)))","v":4},{"$f":"IF(AND($C33<=2,$C33<>0),0,IF($C33=3,OFFSET(G33,-1,0)+1,OFFSET(G33,-1,0)))","v":0},{"$f":"IF(AND($C33<=3,$C33<>0),0,IF($C33=4,OFFSET(H33,-1,0)+1,OFFSET(H33,-1,0)))","v":0},{"$f":"IF(AND($C33<=4,$C33<>0),0,IF(AND($C33=\"S\",$Y33>0),OFFSET(I33,-1,0)+1,OFFSET(I33,-1,0)))","v":0},2,26,{"$f":"IF(OR(Y33>0,$C33=1),\"F\",\"\")","v":""},"Nível 2",{"$f":"CHOOSE(1+LOG(1+2*(C33=1)+4*(C33=2)+8*(C33=3)+16*(C33=4)+32*(C33=\"S\"),2),\"\",\"Nível 1\",\"Nível 2\",\"Nível 3\",\"Nível 4\",\"Serviço\")","v":"Nível 2"},"-","SINAPI",null,"ESQUADRIAS METÁLICAS","-",null,1,"-",null,null,0,0,""]
["S",2,"S",0,1,4,0,0,0,0,0,"","Serviço","Serviço","-","COMPOSIÇÃO","COMP 084_SEE","GUARDA-CORPO COM CORRIMÃO - SEDUC","M",12.8,1,12.8,null,null,0,0,""]
[1,1,1,8,2,0,0,0,0,375,8,"F","Nível 1","Nível 1","2.","SINAPI",null,"COBERTURA ENTRADA","UN",1,1,1,null,null,0,0,""]
[2,2,2,2,2,1,0,0,0,7,2,"","Nível 2","Nível 2","-","SINAPI",null,"PINTURA","-",null,1,"-",null,null,0,0,""]
["S",2,"S",0,2,1,0,0,0,0,0,"","Serviço","Serviço","-","AGETOP",261609,"PINTURA ESMALTE ALQUIDICO ESTR.METALICA 2 DEMAOS","m2    ",23.32,1,23.32,null,null,0,0,""]
[2,2,2,5,2,2,0,0,0,5,17,"","Nível 2","Nível 2","-","SINAPI",null,"COBERTURAS","-",null,1,"-",null,null,0,0,""]
["S",2,"S",0,2,2,0,0,0,0,0,"","Serviço","Serviço","-","AGETOP",160100,"COBERTURA COM TELHA AMERICANA  RESINADA COR VERMELHA","m2    ",23.32,1,23.32,null,null,0,0,""]
["S",2,"S",0,2,2,0,0,0,0,0,"","Serviço","Serviço","-","AGETOP",160101,"CUMEEIRA PARA TELHA AMERICANA RESINADA COR VERMELHA","m     ",5,1,5,null,null,0,0,""]
["S",2,"S",0,2,2,0,0,0,0,0,"","Serviço","Serviço","-","AGETOP",160403,"EMBOCAMENTO LATERAL  (OITOES)","m     ",9.33,1,9.33,null,null,0,0,""]
["S",2,"S",0,2,2,0,0,0,0,0,"","Serviço","Serviço","-","AGETOP",160601,"CALHA DE CHAPA GALVANIZADA","m     ",10,1,10,null,null,0,0,""]
[1,1,1,29,3,0,0,0,0,367,29,"F","Nível 1","Nível 1","3.","SINAPI",null,"REFORMA BANHEIRO MASCULINO","UN",1,1,1,null,null,0,0,""]
[2,2,2,8,3,1,0,0,0,28,8,"","Nível 2","Nível 2","-","SINAPI",null,"SERVIÇOS PRELIMINARES","-",null,1,"-",null,null,0,0,""]
["S",2,"S",0,3,1,0,0,0,0,0,"","Serviço","Serviço","-","SINAPI",97644,"REMOÇÃO DE PORTAS, DE FORMA MANUAL, SEM REAPROVEITAMENTO. AF_12/2017","M2",6.91,1,6.91,null,null,0,0,"Referência: AGETOP - 20106"]
["S",2,"S",0,3,1,0,0,0,0,0,"","Serviço","Serviço","-","AGETOP",20137,"DEMOLIÇAO BACIA SANITARIA C/ TRANSP. ATÉ CB. E CARGA","Un    ",4,1,4,null,null,0,0,""]
["S",2,"S",0,3,1,0,0,0,0,0,"","Serviço","Serviço","-","AGETOP",20138,"DEMOLIÇAO DE LAVATÓRIO C/ TRANSP. ATÉ CB. E CARGA","Un    ",2,1,2,null,null,0,0,""]
[{"$f":"CHOOSE(1+LOG(1+2*(ORÇAMENTO.Nivel=\"Nível 1\")+4*(ORÇAMENTO.Nivel=\"Nível 2\")+8*(ORÇAMENTO.Nivel=\"Nível 3\")+16*(ORÇAMENTO.Nivel=\"Nível 4\")+32*(ORÇAMENTO.Nivel=\"Serviço\"),2),0,1,2,3,4,\"S\")","v":"S"},{"$f":"IF(OR(C48=\"s\",C48=0),OFFSET(B48,-1,0),C48)","v":2},{"$f":"IF(OFFSET(C48,-1,0)=\"L\",1,IF(OFFSET(C48,-1,0)=1,2,IF(OR(A48=\"s\",A48=0),\"S\",IF(AND(OFFSET(C48,-1,0)=2,A48=4),3,IF(AND(OR(OFFSET(C48,-1,0)=\"s\",OFFSET(C48,-1,0)=0),A48<>\"s\",A48>OFFSET(B48,-1,0)),OFFSET(B48,-1,0),A48)))))","v":"S"},{"$f":"IF(OR(C48=\"S\",C48=0),0,IF(ISERROR(K48),J48,SMALL(J48:K48,1)))","v":0},{"$f":"IF($C48=1,OFFSET(E48,-1,0)+1,OFFSET(E48,-1,0))","v":3},{"$f":"IF($C48=1,0,IF($C48=2,OFFSET(F48,-1,0)+1,OFFSET(F48,-1,0)))","v":1},{"$f":"IF(AND($C48<=2,$C48<>0),0,IF($C48=3,OFFSET(G48,-1,0)+1,OFFSET(G48,-1,0)))","v":0},{"$f":"IF(AND($C48<=3,$C48<>0),0,IF($C48=4,OFFSET(H48,-1,0)+1,OFFSET(H48,-1,0)))","v":0},{"$f":"IF(AND($C48<=4,$C48<>0),0,IF(AND($C48=\"S\",$Y48>0),OFFSET(I48,-1,0)+1,OFFSET(I48,-1,0)))","v":0},0,0,{"$f":"IF(OR(Y48>0,$C48=1),\"F\",\"\")","v":""},"Serviço",{"$f":"CHOOSE(1+LOG(1+2*(C48=1)+4*(C48=2)+8*(C48=3)+16*(C48=4)+32*(C48=\"S\"),2),\"\",\"Nível 1\",\"Nível 2\",\"Nível 3\",\"Nível 4\",\"Serviço\")","v":"Serviço"},"-","AGETOP",20163,"DEMOLIÇÃO DAS INSTALAÇÕES HIDROSANITÁRIAS E AFINS C/ TRANSP. ATÉ CB. E CARGA","H     ",0.33,1,0.33,null,null,0,0,""]
["S",2,"S",0,3,1,0,0,0,0,0,"","Serviço","Serviço","-","AGETOP",20115,"DEMOLIÇÃO DE REVESTIMENTOS COM AZULEJOS C/TRANSP.ATE CB. E CARGA","m2    ",100.18,1,100.18,null,null,0,0,""]
[{"$f":"CHOOSE(1+LOG(1+2*(ORÇAMENTO.Nivel=\"Nível 1\")+4*(ORÇAMENTO.Nivel=\"Nível 2\")+8*(ORÇAMENTO.Nivel=\"Nível 3\")+16*(ORÇAMENTO.Nivel=\"Nível 4\")+32*(ORÇAMENTO.Nivel=\"Serviço\"),2),0,1,2,3,4,\"S\")","v":"S"},{"$f":"IF(OR(C50=\"s\",C50=0),OFFSET(B50,-1,0),C50)","v":2},{"$f":"IF(OFFSET(C50,-1,0)=\"L\",1,IF(OFFSET(C50,-1,0)=1,2,IF(OR(A50=\"s\",A50=0),\"S\",IF(AND(OFFSET(C50,-1,0)=2,A50=4),3,IF(AND(OR(OFFSET(C50,-1,0)=\"s\",OFFSET(C50,-1,0)=0),A50<>\"s\",A50>OFFSET(B50,-1,0)),OFFSET(B50,-1,0),A50)))))","v":"S"},{"$f":"IF(OR(C50=\"S\",C50=0),0,IF(ISERROR(K50),J50,SMALL(J50:K50,1)))","v":0},{"$f":"IF($C50=1,OFFSET(E50,-1,0)+1,OFFSET(E50,-1,0))","v":3},{"$f":"IF($C50=1,0,IF($C50=2,OFFSET(F50,-1,0)+1,OFFSET(F50,-1,0)))","v":1},{"$f":"IF(AND($C50<=2,$C50<>0),0,IF($C50=3,OFFSET(G50,-1,0)+1,OFFSET(G50,-1,0)))","v":0},{"$f":"IF(AND($C50<=3,$C50<>0),0,IF($C50=4,OFFSET(H50,-1,0)+1,OFFSET(H50,-1,0)))","v":0},{"$f":"IF(AND($C50<=4,$C50<>0),0,IF(AND($C50=\"S\",$Y50>0),OFFSET(I50,-1,0)+1,OFFSET(I50,-1,0)))","v":0},0,0,{"$f":"IF(OR(Y50>0,$C50=1),\"F\",\"\")","v":""},"Serviço",{"$f":"CHOOSE(1+LOG(1+2*(C50=1)+4*(C50=2)+8*(C50=3)+16*(C50=4)+32*(C50=\"S\"),2),\"\",\"Nível 1\",\"Nível 2\",\"Nível 3\",\"Nível 4\",\"Serviço\")","v":"Serviço"},"-","AGETOP",20111,"DEM.PISO CERAM.SOBRE LASTRO CONC.C/TR.CB.E CARGA","m2    ",21.24,1,21.24,null,null,0,0,""]
["S",2,"S",0,3,1,0,0,0,0,0,"","Serviço","Serviço","-","SINAPI",97622,"DEMOLIÇÃO DE ALVENARIA DE BLOCO FURADO, DE FORMA MANUAL, SEM REAPROVEITAMENTO. AF_12/2017","M3",3.13,1,3.13,null,null,0,0,"Referência: AGETOP - 20118"]
[2,2,2,3,3,2,0,0,0,20,3,"","Nível 2","Nível 2","-","AGETOP",null,"TRANSPORTES","-",null,1,"-",null,null,0,0,""]
["S",2,"S",0,3,2,0,0,0,0,0,"","Serviço","Serviço","-","SINAPI",72900,"TRANSPORTE DE ENTULHO COM CAMINHAO BASCULANTE 6 M3, RODOVIA PAVIMENTADA, DMT 0,5 A 1,0 KM","M3",16.89,1,16.89,null,null,0,0,""]
["S",2,"S",0,3,2,0,0,0,0,0,"","Serviço","Serviço","-","SINAPI",72897,"CARGA MANUAL DE ENTULHO EM CAMINHAO BASCULANTE 6 M3","M3",16.89,1,16.89,null,null,0,0,""]
[2,2,2,2,3,3,0,0,0,17,2,"","Nível 2","Nível 2","-","SINAPI",null,"ALVENARIAS E DIVISÓRIAS","-",null,1,"-",null,null,0,0,""]
["S",2,"S",0,3,3,0,0,0,0,0,"","Serviço","Serviço","-","AGETOP",100102,"ALVENARIA DE TIJOLO COMUM 1/2 VEZ - ARG. (1CI : 2CH : 8ARML)","m2    ",3.19,1,3.19,null,null,0,0,""]
[2,2,2,2,3,4,0,0,0,15,2,"","Nível 2","Nível 2","-","SINAPI",null,"REVESTIMENTO DE PISO","-",null,1,"-",null,null,0,0,""]
["S",2,"S",0,3,4,0,0,0,0,0,"","Serviço","Serviço","-","SINAPI",87251,"REVESTIMENTO CERÂMICO PARA PISO COM PLACAS TIPO ESMALTADA EXTRA DE DIMENSÕES 45X45 CM APLICADA EM AMBIENTES DE ÁREA MAIOR QUE 10 M2. AF_06/2014","M2",21.24,1,21.24,null,null,0,0,""]
[2,2,2,2,3,5,0,0,0,13,2,"","Nível 2","Nível 2","-","SINAPI",null,"REVESTIMENTO DE PAREDE","-",null,1,"-",null,null,0,0,""]
["S",2,"S",0,3,5,0,0,0,0,0,"","Serviço","Serviço","-","SINAPI",87273,"REVESTIMENTO CERÂMICO PARA PAREDES INTERNAS COM PLACAS TIPO ESMALTADA EXTRA DE DIMENSÕES 33X45 CM APLICADAS EM AMBIENTES DE ÁREA MAIOR QUE 5 M² NA ALTURA INTEIRA DAS PAREDES. AF_06/2014","M2",62.37,1,62.37,null,null,0,0,""]
[2,2,2,3,3,6,0,0,0,11,3,"","Nível 2","Nível 2","-","SINAPI",null,"DIVERSOS","-",null,1,"-",null,null,0,0,""]
["S",2,"S",0,3,6,0,0,0,0,0,"","Serviço","Serviço","-","AGETOP",100320,"DIVISORIA DE GRANITO POLIDO","m2    ",16.52,1,16.52,null,null,0,0,""]
["S",2,"S",0,3,6,0,0,0,0,0,"","Serviço","Serviço","-","AGETOP",271608,"BANCADA DE GRANITO C/ESPELHO","m2    ",2.23,1,2.23,null,null,0,0,""]
[2,2,2,3,3,7,0,0,0,8,3,"","Nível 2","Nível 2","-","SINAPI",null,"ESQUADRIAS METÁLICAS","-",null,1,"-",null,null,0,0,""]
["S",2,"S",0,3,7,0,0,0,0,0,"","Serviço","Serviço","-","AGETOP",180509,"PORTA ABRIR CH.P/WC PF-10 C/FERRAGENS","m2    ",5.94,1,5.94,null,null,0,0,""]
["S",2,"S",0,3,7,0,0,0,0,0,"","Serviço","Serviço","-","AGETOP",180501,"PORTA DE ABRIR EM CHAPA PF-1 C/FERRAGENS","m2    ",1.78,1,1.78,null,null,0,0,""]
[2,2,2,2,3,8,0,0,0,5,2,"","Nível 2","Nível 2","-","SINAPI",null,"PINTURA","-",null,1,"-",null,null,0,0,""]
["S",2,"S",0,3,8,0,0,0,0,0,"","Serviço","Serviço","-","AGETOP",261602,"PINT.ESMALTE/ESQUAD.FERRO C/FUNDO ANTICOR.","m2    ",23.16,1,23.16,null,null,0,0,""]
[2,2,2,3,3,9,0,0,0,3,87,"","Nível 2","Nível 2","-","SINAPI",null,"FERRAGENS","-",null,1,"-",null,null,0,0,""]
["S",2,"S",0,3,9,0,0,0,0,0,"","Serviço","Serviço","-","AGETOP",230174,"BARRA DE APOIO EM AÇO INOX - 40 CM","un    ",8,1,8,null,null,0,0,""]
["S",2,"S",0,3,9,0,0,0,0,0,"","Serviço","Serviço","-","AGETOP",230176,"BARRA DE APOIO EM AÇO INOX - 80 CM ","un    ",6,1,6,null,null,0,0,""]
[1,1,1,29,4,0,0,0,0,338,29,"F","Nível 1","Nível 1","4.","SINAPI",null,"REFORMA BANHEIRO FEMININO","UN",1,1,1,null,null,0,0,""]
[2,2,2,8,4,1,0,0,0,28,8,"","Nível 2","Nível 2","-","SINAPI",null,"SERVIÇOS PRELIMINARES","-",null,1,"-",null,null,0,0,""]
["S",2,"S",0,4,1,0,0,0,0,0,"","Serviço","Serviço","-","SINAPI",97644,"REMOÇÃO DE PORTAS, DE FORMA MANUAL, SEM REAPROVEITAMENTO. AF_12/2017","M2",12.609999999999998,1,12.609999999999998,null,null,0,0,"Referência: AGETOP - 20106"]
["S",2,"S",0,4,1,0,0,0,0,0,"","Serviço","Serviço","-","AGETOP",20137,"DEMOLIÇAO BACIA SANITARIA C/ TRANSP. ATÉ CB. E CARGA","Un    ",9,1,9,null,null,0,0,""]
["S",2,"S",0,4,1,0,0,0,0,0,"","Serviço","Serviço","-","AGETOP",20138,"DEMOLIÇAO DE LAVATÓRIO C/ TRANSP. ATÉ CB. E CARGA","Un    ",3,1,3,null,null,0,0,""]
["S",2,"S",0,4,1,0,0,0,0,0,"","Serviço","Serviço","-","AGETOP",20115,"DEMOLIÇÃO DE REVESTIMENTOS COM AZULEJOS C/TRANSP.ATE CB. E CARGA","m2    ",123.54,1,123.54,null,null,0,0,""]
[{"$f":"CHOOSE(1+LOG(1+2*(ORÇAMENTO.Nivel=\"Nível 1\")+4*(ORÇAMENTO.Nivel=\"Nível 2\")+8*(ORÇAMENTO.Nivel=\"Nível 3\")+16*(ORÇAMENTO.Nivel=\"Nível 4\")+32*(ORÇAMENTO.Nivel=\"Serviço\"),2),0,1,2,3,4,\"S\")","v":"S"},{"$f":"IF(OR(C78=\"s\",C78=0),OFFSET(B78,-1,0),C78)","v":2},{"$f":"IF(OFFSET(C78,-1,0)=\"L\",1,IF(OFFSET(C78,-1,0)=1,2,IF(OR(A78=\"s\",A78=0),\"S\",IF(AND(OFFSET(C78,-1,0)=2,A78=4),3,IF(AND(OR(OFFSET(C78,-1,0)=\"s\",OFFSET(C78,-1,0)=0),A78<>\"s\",A78>OFFSET(B78,-1,0)),OFFSET(B78,-1,0),A78)))))","v":"S"},{"$f":"IF(OR(C78=\"S\",C78=0),0,IF(ISERROR(K78),J78,SMALL(J78:K78,1)))","v":0},{"$f":"IF($C78=1,OFFSET(E78,-1,0)+1,OFFSET(E78,-1,0))","v":4},{"$f":"IF($C78=1,0,IF($C78=2,OFFSET(F78,-1,0)+1,OFFSET(F78,-1,0)))","v":1},{"$f":"IF(AND($C78<=2,$C78<>0),0,IF($C78=3,OFFSET(G78,-1,0)+1,OFFSET(G78,-1,0)))","v":0},{"$f":"IF(AND($C78<=3,$C78<>0),0,IF($C78=4,OFFSET(H78,-1,0)+1,OFFSET(H78,-1,0)))","v":0},{"$f":"IF(AND($C78<=4,$C78<>0),0,IF(AND($C78=\"S\",$Y78>0),OFFSET(I78,-1,0)+1,OFFSET(I78,-1,0)))","v":0},0,0,{"$f":"IF(OR(Y78>0,$C78=1),\"F\",\"\")","v":""},"Serviço",{"$f":"CHOOSE(1+LOG(1+2*(C78=1)+4*(C78=2)+8*(C78=3)+16*(C78=4)+32*(C78=\"S\"),2),\"\",\"Nível 1\",\"Nível 2\",\"Nível 3\",\"Nível 4\",\"Serviço\")","v":"Serviço"},"-","AGETOP",20111,"DEM.PISO CERAM.SOBRE LASTRO CONC.C/TR.CB.E CARGA","m2    ",27.72,1,27.72,null,null,0,0,""]
[{"$f":"CHOOSE(1+LOG(1+2*(ORÇAMENTO.Nivel=\"Nível 1\")+4*(ORÇAMENTO.Nivel=\"Nível 2\")+8*(ORÇAMENTO.Nivel=\"Nível 3\")+16*(ORÇAMENTO.Nivel=\"Nível 4\")+32*(ORÇAMENTO.Nivel=\"Serviço\"),2),0,1,2,3,4,\"S\")","v":"S"},{"$f":"IF(OR(C79=\"s\",C79=0),OFFSET(B79,-1,0),C79)","v":2},{"$f":"IF(OFFSET(C79,-1,0)=\"L\",1,IF(OFFSET(C79,-1,0)=1,2,IF(OR(A79=\"s\",A79=0),\"S\",IF(AND(OFFSET(C79,-1,0)=2,A79=4),3,IF(AND(OR(OFFSET(C79,-1,0)=\"s\",OFFSET(C79,-1,0)=0),A79<>\"s\",A79>OFFSET(B79,-1,0)),OFFSET(B79,-1,0),A79)))))","v":"S"},{"$f":"IF(OR(C79=\"S\",C79=0),0,IF(ISERROR(K79),J79,SMALL(J79:K79,1)))","v":0},{"$f":"IF($C79=1,OFFSET(E79,-1,0)+1,OFFSET(E79,-1,0))","v":4},{"$f":"IF($C79=1,0,IF($C79=2,OFFSET(F79,-1,0)+1,OFFSET(F79,-1,0)))","v":1},{"$f":"IF(AND($C79<=2,$C79<>0),0,IF($C79=3,OFFSET(G79,-1,0)+1,OFFSET(G79,-1,0)))","v":0},{"$f":"IF(AND($C79<=3,$C79<>0),0,IF($C79=4,OFFSET(H79,-1,0)+1,OFFSET(H79,-1,0)))","v":0},{"$f":"IF(AND($C79<=4,$C79<>0),0,IF(AND($C79=\"S\",$Y79>0),OFFSET(I79,-1,0)+1,OFFSET(I79,-1,0)))","v":0},0,0,{"$f":"IF(OR(Y79>0,$C79=1),\"F\",\"\")","v":""},"Serviço",{"$f":"CHOOSE(1+LOG(1+2*(C79=1)+4*(C79=2)+8*(C79=3)+16*(C79=4)+32*(C79=\"S\"),2),\"\",\"Nível 1\",\"Nível 2\",\"Nível 3\",\"Nível 4\",\"Serviço\")","v":"Serviço"},"-","AGETOP",20163,"DEMOLIÇÃO DAS INSTALAÇÕES HIDROSANITÁRIAS E AFINS C/ TRANSP. ATÉ CB. E CARGA","H     ",0.5,1,0.5,null,null,0,0,""]
["S",2,"S",0,4,1,0,0,0,0,0,"","Serviço","Serviço","-","SINAPI",97622,"DEMOLIÇÃO DE ALVENARIA DE BLOCO FURADO, DE FORMA MANUAL, SEM REAPROVEITAMENTO. AF_12/2017","M3",5.16,1,5.16,null,null,0,0,"Referência: AGETOP - 20118"]
[2,2,2,3,4,2,0,0,0,20,3,"","Nível 2","Nível 2","-","AGETOP",null,"TRANSPORTES","-",null,1,"-",null,null,0,0,""]
["S",2,"S",0,4,2,0,0,0,0,0,"","Serviço","Serviço","-","SINAPI",72900,"TRANSPORTE DE ENTULHO COM CAMINHAO BASCULANTE 6 M3, RODOVIA PAVIMENTADA, DMT 0,5 A 1,0 KM","M3",22.99,1,22.99,null,null,0,0,""]
["S",2,"S",0,4,2,0,0,0,{"$f":"IF(OR($C83=\"S\",$C83=0),0,MATCH(0,OFFSET($D83,1,$C83,ROW($C$410)-ROW($C83)),0))","v":0},{"$f":"IF(OR($C83=\"S\",$C83=0),0,MATCH(OFFSET($D83,0,$C83)+1,OFFSET($D83,1,$C83,ROW($C$410)-ROW($C83)),0))","v":0},"","Serviço","Serviço","-","SINAPI",72897,"CARGA MANUAL DE ENTULHO EM CAMINHAO BASCULANTE 6 M3","M3",22.99,1,22.99,null,null,0,0,""]
[2,2,2,2,4,3,0,0,0,17,2,"","Nível 2","Nível 2","-","SINAPI",null,"ALVENARIAS E DIVISÓRIAS","-",null,1,"-",null,null,0,0,""]
["S",2,"S",0,4,3,0,0,0,0,0,"","Serviço","Serviço","-","AGETOP",100102,"ALVENARIA DE TIJOLO COMUM 1/2 VEZ - ARG. (1CI : 2CH : 8ARML)","m2    ",3.19,1,3.19,null,null,0,0,""]
[2,2,2,2,4,4,0,0,0,15,2,"","Nível 2","Nível 2","-","SINAPI",null,"REVESTIMENTO DE PISO","-",null,1,"-",null,null,0,0,""]
["S",2,"S",0,4,4,0,0,0,0,0,"","Serviço","Serviço","-","SINAPI",87251,"REVESTIMENTO CERÂMICO PARA PISO COM PLACAS TIPO ESMALTADA EXTRA DE DIMENSÕES 45X45 CM APLICADA EM AMBIENTES DE ÁREA MAIOR QUE 10 M2. AF_06/2014","M2",27.72,1,27.72,null,null,0,0,""]
[2,2,2,2,4,5,0,0,0,13,2,"","Nível 2","Nível 2","-","SINAPI",null,"REVESTIMENTO DE PAREDE","-",null,1,"-",null,null,0,0,""]
["S",2,"S",0,4,5,0,0,0,0,0,"","Serviço","Serviço","-","SINAPI",87273,"REVESTIMENTO CERÂMICO PARA PAREDES INTERNAS COM PLACAS TIPO ESMALTADA EXTRA DE DIMENSÕES 33X45 CM APLICADAS EM AMBIENTES DE ÁREA MAIOR QUE 5 M² NA ALTURA INTEIRA DAS PAREDES. AF_06/2014","M2",63.7,1,63.7,null,null,0,0,""]
[2,2,2,3,4,6,0,0,0,11,3,"","Nível 2","Nível 2","-","SINAPI",null,"DIVERSOS","-",null,1,"-",null,null,0,0,""]
["S",2,"S",0,4,6,0,0,0,0,0,"","Serviço","Serviço","-","AGETOP",100320,"DIVISORIA DE GRANITO POLIDO","m2    ",30.28,1,30.28,null,null,0,0,""]
["S",2,"S",0,4,6,0,0,0,0,0,"","Serviço","Serviço","-","AGETOP",271608,"BANCADA DE GRANITO C/ESPELHO","m2    ",2.21,1,2.21,null,null,0,0,""]
[2,2,2,3,4,7,0,0,0,8,3,"","Nível 2","Nível 2","-","SINAPI",null,"ESQUADRIAS METÁLICAS","-",null,1,"-",null,null,0,0,""]
["S",2,"S",0,4,7,0,0,0,0,0,"","Serviço","Serviço","-","AGETOP",180509,"PORTA ABRIR CH.P/WC PF-10 C/FERRAGENS","m2    ",10.260000000000002,1,10.260000000000002,null,null,0,0,""]
["S",2,"S",0,4,7,0,0,0,0,0,"","Serviço","Serviço","-","AGETOP",180501,"PORTA DE ABRIR EM CHAPA PF-1 C/FERRAGENS","m2    ",1.78,1,1.78,null,null,0,0,""]
[2,2,2,2,4,8,0,0,0,5,2,"","Nível 2","Nível 2","-","SINAPI",null,"PINTURA","-",null,1,"-",null,null,0,0,""]
["S",2,"S",0,4,8,0,0,0,0,0,"","Serviço","Serviço","-","AGETOP",261602,"PINT.ESMALTE/ESQUAD.FERRO C/FUNDO ANTICOR.","m2    ",36.130000000000003,1,36.130000000000003,null,null,0,0,""]
[2,2,2,3,4,9,0,0,0,3,58,"","Nível 2","Nível 2","-","SINAPI",null,"FERRAGENS","-",null,1,"-",null,null,0,0,""]
["S",2,"S",0,4,9,0,0,0,0,0,"","Serviço","Serviço","-","AGETOP",230174,"BARRA DE APOIO EM AÇO INOX - 40 CM","un    ",8,1,8,null,null,0,0,""]
["S",2,"S",0,4,9,0,0,0,0,0,"","Serviço","Serviço","-","AGETOP",230176,"BARRA DE APOIO EM AÇO INOX - 80 CM ","un    ",6,1,6,null,null,0,0,""]
[1,1,1,19,5,0,0,0,0,309,19,"F","Nível 1","Nível 1","5.","SINAPI",null,"REFORMA COBERTURA BLOCO A","UN",1,1,1,null,null,0,0,""]
[2,2,2,3,5,1,0,0,0,18,3,"","Nível 2","Nível 2","-","SINAPI",null,"SERVIÇOS PRELIMINARES","-",null,1,"-",null,null,0,0,""]
["S",2,"S",0,5,1,0,0,0,0,0,"","Serviço","Serviço","-","AGETOP",20101,"DEMOLICAO COBERTURA TELHA CERAMICA C/ TRANSP. ATÉ CB. E CARGA","m2    ",179.58999999999997,1,179.58999999999997,null,null,0,0,""]
["S",2,"S",0,5,1,0,0,0,0,0,"","Serviço","Serviço","-","AGETOP",20103,"DEMOLIÇÃO ESTRUTURA EM MADEIRA TELHADO C/ TRANSP. ATÉ CB. E CARGA","m2    ",379.59,1,379.59,null,null,0,0,""]
[2,2,2,3,5,2,0,0,0,15,3,"","Nível 2","Nível 2","-","AGETOP",null,"TRANSPORTES","-",null,1,"-",null,null,0,0,""]
["S",2,"S",0,5,2,0,0,0,0,0,"","Serviço","Serviço","-","SINAPI",72900,"TRANSPORTE DE ENTULHO COM CAMINHAO BASCULANTE 6 M3, RODOVIA PAVIMENTADA, DMT 0,5 A 1,0 KM","M3",27.95,1,27.95,null,null,0,0,""]
["S",2,"S",0,5,2,0,0,0,0,0,"","Serviço","Serviço","-","SINAPI",72897,"CARGA MANUAL DE ENTULHO EM CAMINHAO BASCULANTE 6 M3","M3",27.95,1,27.95,null,null,0,0,""]
[2,2,2,7,5,3,0,0,0,12,7,"","Nível 2","Nível 2","-","SINAPI",null,"PINTURA","-",null,1,"-",null,null,0,0,""]
[3,3,3,4,5,3,1,0,0,6,4,"","Nível 3","Nível 3","-","AGETOP",null,"TETO","-",null,1,"-",null,null,0,0,""]
["S",3,"S",0,5,3,1,0,0,0,0,"","Serviço","Serviço","-","AGETOP",260104,"REMOCAO DE PINTURA ANTIGA A LATEX","m2    ",379.59,1,379.59,null,null,0,0,""]
[{"$f":"CHOOSE(1+LOG(1+2*(ORÇAMENTO.Nivel=\"Nível 1\")+4*(ORÇAMENTO.Nivel=\"Nível 2\")+8*(ORÇAMENTO.Nivel=\"Nível 3\")+16*(ORÇAMENTO.Nivel=\"Nível 4\")+32*(ORÇAMENTO.Nivel=\"Serviço\"),2),0,1,2,3,4,\"S\")","v":"S"},{"$f":"IF(OR(C111=\"s\",C111=0),OFFSET(B111,-1,0),C111)","v":3},{"$f":"IF(OFFSET(C111,-1,0)=\"L\",1,IF(OFFSET(C111,-1,0)=1,2,IF(OR(A111=\"s\",A111=0),\"S\",IF(AND(OFFSET(C111,-1,0)=2,A111=4),3,IF(AND(OR(OFFSET(C111,-1,0)=\"s\",OFFSET(C111,-1,0)=0),A111<>\"s\",A111>OFFSET(B111,-1,0)),OFFSET(B111,-1,0),A111)))))","v":"S"},{"$f":"IF(OR(C111=\"S\",C111=0),0,IF(ISERROR(K111),J111,SMALL(J111:K111,1)))","v":0},{"$f":"IF($C111=1,OFFSET(E111,-1,0)+1,OFFSET(E111,-1,0))","v":5},{"$f":"IF($C111=1,0,IF($C111=2,OFFSET(F111,-1,0)+1,OFFSET(F111,-1,0)))","v":3},{"$f":"IF(AND($C111<=2,$C111<>0),0,IF($C111=3,OFFSET(G111,-1,0)+1,OFFSET(G111,-1,0)))","v":1},{"$f":"IF(AND($C111<=3,$C111<>0),0,IF($C111=4,OFFSET(H111,-1,0)+1,OFFSET(H111,-1,0)))","v":0},{"$f":"IF(AND($C111<=4,$C111<>0),0,IF(AND($C111=\"S\",$Y111>0),OFFSET(I111,-1,0)+1,OFFSET(I111,-1,0)))","v":0},0,0,{"$f":"IF(OR(Y111>0,$C111=1),\"F\",\"\")","v":""},"Serviço",{"$f":"CHOOSE(1+LOG(1+2*(C111=1)+4*(C111=2)+8*(C111=3)+16*(C111=4)+32*(C111=\"S\"),2),\"\",\"Nível 1\",\"Nível 2\",\"Nível 3\",\"Nível 4\",\"Serviço\")","v":"Serviço"},"-","AGETOP",261300,"EMASSAMENTO COM MASSA PVA DUAS DEMAOS","m2    ",379.59,1,379.59,null,null,0,0,""]
["S",3,"S",0,5,3,1,0,0,0,0,"","Serviço","Serviço","-","AGETOP",261307,"PINTURA PVA LATEX 2 DEMAOS SEM SELADOR","m2    ",379.59,1,379.59,null,null,0,0,""]
[3,3,3,2,5,3,2,0,0,2,156,"","Nível 3","Nível 3","-","SINAPI",null,"ESTRUTURA METÁLICA","-",null,1,"-",null,null,0,0,""]
["S",3,"S",0,5,3,2,0,0,0,0,"","Serviço","Serviço","-","AGETOP",261609,"PINTURA ESMALTE ALQUIDICO ESTR.METALICA 2 DEMAOS","m2    ",379.59,1,379.59,null,null,0,0,""]
[2,2,2,5,5,4,0,0,0,5,26,"","Nível 2","Nível 2","-","SINAPI",null,"COBERTURAS","-",null,1,"-",null,null,0,0,""]
["S",2,"S",0,5,4,0,0,0,0,0,"","Serviço","Serviço","-","AGETOP",160421,"MAO DE OBRA PARA COBERTURA C/TELHA COLONIAL PLAN","m2    ",400,1,400,null,null,0,0,""]
["S",2,"S",0,5,4,0,0,0,0,0,"","Serviço","Serviço","-","AGETOP",160100,"COBERTURA COM TELHA AMERICANA  RESINADA COR VERMELHA","m2    ",179.59,1,179.59,null,null,0,0,""]
["S",2,"S",0,5,4,0,0,0,0,0,"","Serviço","Serviço","-","AGETOP",160402,"CUMEEIRA  P/ TELHA PLAN RESINADA COR VERMELHA","m     ",38.15,1,38.15,null,null,0,0,""]
["S",2,"S",0,5,4,0,0,0,0,0,"","Serviço","Serviço","-","AGETOP",160403,"EMBOCAMENTO LATERAL  (OITOES)","m     ",19.899999999999999,1,19.899999999999999,null,null,0,0,""]
[1,1,1,42,6,0,0,0,0,290,42,"F","Nível 1","Nível 1","6.","SINAPI",null,"REFORMA PÁTIO COBERTO","UN",1,1,1,null,null,0,0,""]
[2,2,2,5,6,1,0,0,0,41,5,"","Nível 2","Nível 2","-","SINAPI",null,"SERVIÇOS PRELIMINARES","-",null,1,"-",null,null,0,0,""]
[{"$f":"CHOOSE(1+LOG(1+2*(ORÇAMENTO.Nivel=\"Nível 1\")+4*(ORÇAMENTO.Nivel=\"Nível 2\")+8*(ORÇAMENTO.Nivel=\"Nível 3\")+16*(ORÇAMENTO.Nivel=\"Nível 4\")+32*(ORÇAMENTO.Nivel=\"Serviço\"),2),0,1,2,3,4,\"S\")","v":"S"},{"$f":"IF(OR(C122=\"s\",C122=0),OFFSET(B122,-1,0),C122)","v":2},{"$f":"IF(OFFSET(C122,-1,0)=\"L\",1,IF(OFFSET(C122,-1,0)=1,2,IF(OR(A122=\"s\",A122=0),\"S\",IF(AND(OFFSET(C122,-1,0)=2,A122=4),3,IF(AND(OR(OFFSET(C122,-1,0)=\"s\",OFFSET(C122,-1,0)=0),A122<>\"s\",A122>OFFSET(B122,-1,0)),OFFSET(B122,-1,0),A122)))))","v":"S"},{"$f":"IF(OR(C122=\"S\",C122=0),0,IF(ISERROR(K122),J122,SMALL(J122:K122,1)))","v":0},{"$f":"IF($C122=1,OFFSET(E122,-1,0)+1,OFFSET(E122,-1,0))","v":6},{"$f":"IF($C122=1,0,IF($C122=2,OFFSET(F122,-1,0)+1,OFFSET(F122,-1,0)))","v":1},{"$f":"IF(AND($C122<=2,$C122<>0),0,IF($C122=3,OFFSET(G122,-1,0)+1,OFFSET(G122,-1,0)))","v":0},{"$f":"IF(AND($C122<=3,$C122<>0),0,IF($C122=4,OFFSET(H122,-1,0)+1,OFFSET(H122,-1,0)))","v":0},{"$f":"IF(AND($C122<=4,$C122<>0),0,IF(AND($C122=\"S\",$Y122>0),OFFSET(I122,-1,0)+1,OFFSET(I122,-1,0)))","v":0},0,0,{"$f":"IF(OR(Y122>0,$C122=1),\"F\",\"\")","v":""},"Serviço",{"$f":"CHOOSE(1+LOG(1+2*(C122=1)+4*(C122=2)+8*(C122=3)+16*(C122=4)+32*(C122=\"S\"),2),\"\",\"Nível 1\",\"Nível 2\",\"Nível 3\",\"Nível 4\",\"Serviço\")","v":"Serviço"},"-","AGETOP",20121,"DEM. MANUAL EM CONCR.SIMPLES C/TR.ATE CB.E CARGA (O.C.)","m3    ",1.08,1,1.08,null,null,0,0,""]
[{"$f":"CHOOSE(1+LOG(1+2*(ORÇAMENTO.Nivel=\"Nível 1\")+4*(ORÇAMENTO.Nivel=\"Nível 2\")+8*(ORÇAMENTO.Nivel=\"Nível 3\")+16*(ORÇAMENTO.Nivel=\"Nível 4\")+32*(ORÇAMENTO.Nivel=\"Serviço\"),2),0,1,2,3,4,\"S\")","v":"S"},{"$f":"IF(OR(C123=\"s\",C123=0),OFFSET(B123,-1,0),C123)","v":2},{"$f":"IF(OFFSET(C123,-1,0)=\"L\",1,IF(OFFSET(C123,-1,0)=1,2,IF(OR(A123=\"s\",A123=0),\"S\",IF(AND(OFFSET(C123,-1,0)=2,A123=4),3,IF(AND(OR(OFFSET(C123,-1,0)=\"s\",OFFSET(C123,-1,0)=0),A123<>\"s\",A123>OFFSET(B123,-1,0)),OFFSET(B123,-1,0),A123)))))","v":"S"},{"$f":"IF(OR(C123=\"S\",C123=0),0,IF(ISERROR(K123),J123,SMALL(J123:K123,1)))","v":0},{"$f":"IF($C123=1,OFFSET(E123,-1,0)+1,OFFSET(E123,-1,0))","v":6},{"$f":"IF($C123=1,0,IF($C123=2,OFFSET(F123,-1,0)+1,OFFSET(F123,-1,0)))","v":1},{"$f":"IF(AND($C123<=2,$C123<>0),0,IF($C123=3,OFFSET(G123,-1,0)+1,OFFSET(G123,-1,0)))","v":0},{"$f":"IF(AND($C123<=3,$C123<>0),0,IF($C123=4,OFFSET(H123,-1,0)+1,OFFSET(H123,-1,0)))","v":0},{"$f":"IF(AND($C123<=4,$C123<>0),0,IF(AND($C123=\"S\",$Y123>0),OFFSET(I123,-1,0)+1,OFFSET(I123,-1,0)))","v":0},0,0,{"$f":"IF(OR(Y123>0,$C123=1),\"F\",\"\")","v":""},"Serviço",{"$f":"CHOOSE(1+LOG(1+2*(C123=1)+4*(C123=2)+8*(C123=3)+16*(C123=4)+32*(C123=\"S\"),2),\"\",\"Nível 1\",\"Nível 2\",\"Nível 3\",\"Nível 4\",\"Serviço\")","v":"Serviço"},"-","SINAPI",97622,"DEMOLIÇÃO DE ALVENARIA DE BLOCO FURADO, DE FORMA MANUAL, SEM REAPROVEITAMENTO. AF_12/2017","M3",2.1,1,2.1,null,null,0,0,"Referência: AGETOP - 20118"]
["S",2,"S",0,6,1,0,0,0,0,0,"","Serviço","Serviço","-","AGETOP",20115,"DEMOLIÇÃO DE REVESTIMENTOS COM AZULEJOS C/TRANSP.ATE CB. E CARGA","m2    ",9.9600000000000009,1,9.9600000000000009,null,null,0,0,""]
["S",2,"S",0,6,1,0,0,0,0,0,"","Serviço","Serviço","-","SINAPI",97622,"DEMOLIÇÃO DE ALVENARIA DE BLOCO FURADO, DE FORMA MANUAL, SEM REAPROVEITAMENTO. AF_12/2017","M3",0.85,1,0.85,null,null,0,0,"Referência: AGETOP - 20118"]
[2,2,2,3,6,2,0,0,0,36,3,"","Nível 2","Nível 2","-","AGETOP",null,"TRANSPORTES","-",null,1,"-",null,null,0,0,""]
["S",2,"S",0,6,2,0,0,0,0,0,"","Serviço","Serviço","-","SINAPI",72900,"TRANSPORTE DE ENTULHO COM CAMINHAO BASCULANTE 6 M3, RODOVIA PAVIMENTADA, DMT 0,5 A 1,0 KM","M3",3.44,1,3.44,null,null,0,0,""]
["S",2,"S",0,6,2,0,0,0,0,0,"","Serviço","Serviço","-","SINAPI",72897,"CARGA MANUAL DE ENTULHO EM CAMINHAO BASCULANTE 6 M3","M3",3.44,1,3.44,null,null,0,0,""]
[2,2,2,5,6,3,0,0,0,33,5,"","Nível 2","Nível 2","-","SINAPI",null,"SERVIÇO EM TERRA","-",null,1,"-",null,null,0,0,""]
["S",2,"S",0,6,3,0,0,0,0,0,"","Serviço","Serviço","-","AGETOP",41006,"TRANSPORTE DE MATERIAL ESCAVADO M3.KM","m3km  ",184.875,1,184.875,null,null,0,0,""]
["S",2,"S",0,6,3,0,0,0,0,0,"","Serviço","Serviço","-","AGETOP",41010,"TRANSPORTE COM LÂMINA ATE 100 M - (OBRAS CIVIS)","m3    ",14.79,1,14.79,null,null,0,0,""]
["S",2,"S",0,6,3,0,0,0,0,0,"","Serviço","Serviço","-","AGETOP",41140,"REGULARIZAÇÃO DO TERRENO SEM APILOAMENTO COM TRANSPORTE MANUAL DA TERRA ESCAVADA ","m2    ",21.75,1,21.75,null,null,0,0,""]
["S",2,"S",0,6,3,0,0,0,0,0,"","Serviço","Serviço","-","AGETOP",41002,"APILOAMENTO","m2    ",21.75,1,21.75,null,null,0,0,""]
[2,2,2,7,6,4,0,0,0,28,7,"","Nível 2","Nível 2","-",null,null,"PINTURA","-",null,1,"-",null,null,0,0,""]
[3,3,3,4,6,4,1,0,0,6,4,"","Nível 3","Nível 3","-","AGETOP",null,"LÁTEX ACRÍLICA","-",null,1,"-",null,null,0,0,""]
["S",3,"S",0,6,4,1,0,0,0,0,"","Serviço","Serviço","-","AGETOP",260104,"REMOCAO DE PINTURA ANTIGA A LATEX","m2    ",19.399999999999999,1,19.399999999999999,null,null,0,0,""]
["S",3,"S",0,6,4,1,0,0,0,0,"","Serviço","Serviço","-","AGETOP",261300,"EMASSAMENTO COM MASSA PVA DUAS DEMAOS","m2    ",77.240000000000009,1,77.240000000000009,null,null,0,0,""]
["S",3,"S",0,6,4,1,0,0,0,0,"","Serviço","Serviço","-","AGETOP",261001,"PINTURA LATEX ACRILICO 2 DEMAOS","m2    ",118.16,1,118.16,null,null,0,0,""]
[3,3,3,2,6,4,2,0,0,2,130,"","Nível 3","Nível 3","-","AGETOP",null,"ESQUADRIAS NOVAS","-",null,1,"-",null,null,0,0,""]
["S",3,"S",0,6,4,2,0,0,0,0,"","Serviço","Serviço","-","AGETOP",261602,"PINT.ESMALTE/ESQUAD.FERRO C/FUNDO ANTICOR.","m2    ",129.15,1,129.15,null,null,0,0,""]
[2,2,2,2,6,5,0,0,0,21,2,"","Nível 2","Nível 2","-","SINAPI",null,"REVESTIMENTO DE PISO","-",null,1,"-",null,null,0,0,""]
["S",2,"S",0,6,5,0,0,0,0,0,"","Serviço","Serviço","-","AGETOP",220102,"PISO CONCRETO DESEMPENADO ESPESSURA = 5 CM  1:2,5:3,5","m2    ",21.75,1,21.75,null,null,0,0,""]
[2,2,2,3,6,6,0,0,0,19,3,"","Nível 2","Nível 2","-","SINAPI",null,"ALVENARIAS E DIVISÓRIAS","-",null,1,"-",null,null,0,0,""]
["S",2,"S",0,6,6,0,0,0,0,0,"","Serviço","Serviço","-","AGETOP",100102,"ALVENARIA DE TIJOLO COMUM 1/2 VEZ - ARG. (1CI : 2CH : 8ARML)","m2    ",28.92,1,28.92,null,null,0,0,""]
["S",{"$f":"IF(OR(C145=\"s\",C145=0),OFFSET(B145,-1,0),C145)","v":2},{"$f":"IF(OFFSET(C145,-1,0)=\"L\",1,IF(OFFSET(C145,-1,0)=1,2,IF(OR(A145=\"s\",A145=0),\"S\",IF(AND(OFFSET(C145,-1,0)=2,A145=4),3,IF(AND(OR(OFFSET(C145,-1,0)=\"s\",OFFSET(C145,-1,0)=0),A145<>\"s\",A145>OFFSET(B145,-1,0)),OFFSET(B145,-1,0),A145)))))","v":"S"},{"$f":"IF(OR(C145=\"S\",C145=0),0,IF(ISERROR(K145),J145,SMALL(J145:K145,1)))","v":0},{"$f":"IF($C145=1,OFFSET(E145,-1,0)+1,OFFSET(E145,-1,0))","v":6},{"$f":"IF($C145=1,0,IF($C145=2,OFFSET(F145,-1,0)+1,OFFSET(F145,-1,0)))","v":6},{"$f":"IF(AND($C145<=2,$C145<>0),0,IF($C145=3,OFFSET(G145,-1,0)+1,OFFSET(G145,-1,0)))","v":0},{"$f":"IF(AND($C145<=3,$C145<>0),0,IF($C145=4,OFFSET(H145,-1,0)+1,OFFSET(H145,-1,0)))","v":0},{"$f":"IF(AND($C145<=4,$C145<>0),0,IF(AND($C145=\"S\",$Y145>0),OFFSET(I145,-1,0)+1,OFFSET(I145,-1,0)))","v":0},0,0,{"$f":"IF(OR(Y145>0,$C145=1),\"F\",\"\")","v":""},"Serviço",{"$f":"CHOOSE(1+LOG(1+2*(C145=1)+4*(C145=2)+8*(C145=3)+16*(C145=4)+32*(C145=\"S\"),2),\"\",\"Nível 1\",\"Nível 2\",\"Nível 3\",\"Nível 4\",\"Serviço\")","v":"Serviço"},"-","AGETOP",100201,"ALVENARIA DE TIJOLO FURADO 1/2 VEZ - 9 x 19 x 19 - ARG. (1CALH:4ARML+100KG DE CI/M3)","m2    ",3.24,1,3.24,null,null,0,0,""]
[2,2,2,5,6,7,0,0,0,16,5,"","Nível 2","Nível 2","-","SINAPI",null,"REVESTIMENTO DE PAREDE","-",null,1,"-",null,null,0,0,""]
["S",2,"S",0,6,7,0,0,0,{"$f":"IF(OR($C147=\"S\",$C147=0),0,MATCH(0,OFFSET($D147,1,$C147,ROW($C$410)-ROW($C147)),0))","v":0},{"$f":"IF(OR($C147=\"S\",$C147=0),0,MATCH(OFFSET($D147,0,$C147)+1,OFFSET($D147,1,$C147,ROW($C$410)-ROW($C147)),0))","v":0},"","Serviço","Serviço","-","SINAPI",87553,"EMBOÇO, PARA RECEBIMENTO DE CERÂMICA, EM ARGAMASSA TRAÇO 1:2:8, PREPARO MECÂNICO COM BETONEIRA 400L, APLICADO MANUALMENTE EM FACES INTERNAS DE PAREDES, PARA AMBIENTE COM ÁREA MAIOR QUE 10M2, ESPESSURA DE 10MM, COM EXECUÇÃO DE TALISCAS. AF_06/2014","M2",6.48,1,6.48,null,null,0,0,""]
["S",2,"S",0,6,7,0,0,0,0,0,"","Serviço","Serviço","-","AGETOP",200101,"CHAPISCO COMUM","m2    ",64.320000000000007,1,64.320000000000007,null,null,0,0,""]
["S",2,"S",0,6,7,0,0,0,0,0,"","Serviço","Serviço","-","AGETOP",200499,"REBOCO PAULISTA A-14 (1CALH:4ARMLC+100kgCI/M3)","m2    ",57.84,1,57.84,null,null,0,0,""]
["S",2,"S",0,6,7,0,0,0,0,0,"","Serviço","Serviço","-","SINAPI",87273,"REVESTIMENTO CERÂMICO PARA PAREDES INTERNAS COM PLACAS TIPO ESMALTADA EXTRA DE DIMENSÕES 33X45 CM APLICADAS EM AMBIENTES DE ÁREA MAIOR QUE 5 M² NA ALTURA INTEIRA DAS PAREDES. AF_06/2014","M2",9.56,1,9.56,null,null,0,0,""]
[{"$f":"CHOOSE(1+LOG(1+2*(ORÇAMENTO.Nivel=\"Nível 1\")+4*(ORÇAMENTO.Nivel=\"Nível 2\")+8*(ORÇAMENTO.Nivel=\"Nível 3\")+16*(ORÇAMENTO.Nivel=\"Nível 4\")+32*(ORÇAMENTO.Nivel=\"Serviço\"),2),0,1,2,3,4,\"S\")","v":2},2,2,3,6,8,0,0,0,11,3,"","Nível 2","Nível 2","-","SINAPI",null,"ESQUADRIAS METÁLICAS","-",null,1,"-",null,null,0,0,""]
["S",2,"S",0,6,8,0,0,0,0,0,"","Serviço","Serviço","-","AGETOP",180403,"ESQ.MAXIMO AR CHAPA/VIDRO J1/J2/J7/J15 C/FERRAGENS","m2    ",23.4,1,23.4,null,null,0,0,""]
["S",2,"S",0,6,8,0,0,0,0,0,"","Serviço","Serviço","-","AGETOP",180506,"PORTA DE CORRER/VIDRO (4) FOLHAS PF-6 C/ FERRAGENS","m2    ",18.37,1,18.37,null,null,0,0,""]
[2,2,2,2,6,9,0,0,0,8,2,"","Nível 2","Nível 2","-","SINAPI",null,"VIDROS","-",null,1,"-",null,null,0,0,""]
["S",2,"S",0,6,9,0,0,0,0,0,"","Serviço","Serviço","-","SINAPI",72117,"VIDRO LISO COMUM TRANSPARENTE, ESPESSURA 4MM","M2",41.769999999999996,1,41.769999999999996,null,null,0,0,"Referência: AGETOP - 190102"]
[2,2,2,3,6,10,0,0,0,6,3,"","Nível 2","Nível 2","-","SINAPI",null,"DIVERSOS","-",null,1,"-",null,null,0,0,""]
["S",2,"S",0,6,10,0,0,0,0,0,"","Serviço","Serviço","-","AGETOP",270621,"ALAMBRADO EM TUBO INDUSTRIAL 2\"#2,28 E TELA MALHA 4\" FIO 12 (QUADRA ESPORTE EXISTENTE) SEM PINTURA","m2    ",18.16,1,18.16,null,null,0,0,""]
[{"$f":"CHOOSE(1+LOG(1+2*(ORÇAMENTO.Nivel=\"Nível 1\")+4*(ORÇAMENTO.Nivel=\"Nível 2\")+8*(ORÇAMENTO.Nivel=\"Nível 3\")+16*(ORÇAMENTO.Nivel=\"Nível 4\")+32*(ORÇAMENTO.Nivel=\"Serviço\"),2),0,1,2,3,4,\"S\")","v":"S"},{"$f":"IF(OR(C158=\"s\",C158=0),OFFSET(B158,-1,0),C158)","v":2},{"$f":"IF(OFFSET(C158,-1,0)=\"L\",1,IF(OFFSET(C158,-1,0)=1,2,IF(OR(A158=\"s\",A158=0),\"S\",IF(AND(OFFSET(C158,-1,0)=2,A158=4),3,IF(AND(OR(OFFSET(C158,-1,0)=\"s\",OFFSET(C158,-1,0)=0),A158<>\"s\",A158>OFFSET(B158,-1,0)),OFFSET(B158,-1,0),A158)))))","v":"S"},{"$f":"IF(OR(C158=\"S\",C158=0),0,IF(ISERROR(K158),J158,SMALL(J158:K158,1)))","v":0},{"$f":"IF($C158=1,OFFSET(E158,-1,0)+1,OFFSET(E158,-1,0))","v":6},{"$f":"IF($C158=1,0,IF($C158=2,OFFSET(F158,-1,0)+1,OFFSET(F158,-1,0)))","v":10},{"$f":"IF(AND($C158<=2,$C158<>0),0,IF($C158=3,OFFSET(G158,-1,0)+1,OFFSET(G158,-1,0)))","v":0},{"$f":"IF(AND($C158<=3,$C158<>0),0,IF($C158=4,OFFSET(H158,-1,0)+1,OFFSET(H158,-1,0)))","v":0},{"$f":"IF(AND($C158<=4,$C158<>0),0,IF(AND($C158=\"S\",$Y158>0),OFFSET(I158,-1,0)+1,OFFSET(I158,-1,0)))","v":0},0,0,{"$f":"IF(OR(Y158>0,$C158=1),\"F\",\"\")","v":""},"Serviço",{"$f":"CHOOSE(1+LOG(1+2*(C158=1)+4*(C158=2)+8*(C158=3)+16*(C158=4)+32*(C158=\"S\"),2),\"\",\"Nível 1\",\"Nível 2\",\"Nível 3\",\"Nível 4\",\"Serviço\")","v":"Serviço"},"-","AGETOP",60010,"VERGA/CONTRAVERGA EM CONCRETO ARMADO FCK = 20 MPA","m3    ",0.38,1,0.38,null,null,0,0,""]
[2,2,2,3,6,11,0,0,0,3,{"$error":"#N/A"},"","Nível 2","Nível 2","-","SINAPI",null,"FORROS","-",null,1,"-",null,null,0,0,""]
[3,3,3,2,6,11,1,0,0,2,68,"","Nível 3","Nível 3","-","SINAPI",null,"PVC COM ESTRUTURA","-",null,1,"-",null,null,0,0,""]
["S",3,"S",0,6,11,1,0,0,0,0,"","Serviço","Serviço","-","AGETOP",210460,"FORRO DE PVC COM ESTRUTURA EM METALON PINTADA COM TINTA ALQUÍDICA D.F.","m2    ",105.06,1,105.06,null,null,0,0,""]
[1,1,1,5,7,0,0,0,0,248,5,"F","Nível 1","Nível 1","7.","SINAPI",null,"ADMINISTRAÇÃO LOCAL","UN",1,1,1,null,null,0,0,""]
[2,2,2,4,7,1,0,0,0,4,14,"","Nível 2","Nível 2","-",null,null,"ADMINISTRAÇÃO","-",null,1,"-",null,null,0,0,""]
[3,3,3,3,7,1,1,0,0,3,64,"","Nível 3","Nível 3","-",null,null,"MENSALISTAS","-",null,1,"-",null,null,0,0,""]
["S",3,"S",0,7,1,1,0,0,0,0,"","Serviço","Serviço","-","SINAPI",90778,"ENGENHEIRO CIVIL DE OBRA PLENO COM ENCARGOS COMPLEMENTARES","H",111.55517435733918,1,111.55517435733918,null,null,0,0,"Referência: AGETOP - 250101"]
["S",3,"S",0,7,1,1,0,0,0,0,"","Serviço","Serviço","-","SINAPI",90776,"ENCARREGADO GERAL COM ENCARGOS COMPLEMENTARES","H",660,1,660,null,null,0,0,"Referência: AGETOP - 250103"]
[1,1,1,5,8,0,0,0,0,243,5,"F","Nível 1","Nível 1","8.","SINAPI",null,"OBRA","UN",1,1,1,null,null,0,0,""]
[2,2,2,4,8,1,0,0,0,4,9,"","Nível 2","Nível 2","-","SINAPI",null,"DIVERSOS","-",null,1,"-",null,null,0,0,""]
["S",2,"S",0,8,1,0,0,0,0,0,"","Serviço","Serviço","-","AGETOP",270501,"LIMPEZA FINAL DE OBRA - (OBRAS CIVIS)","m2    ",600,1,600,null,null,0,0,""]
["S",2,"S",0,8,1,0,0,0,0,0,"","Serviço","Serviço","-","AGETOP",21301,"PLACA DE OBRA PLOTADA EM CHAPA METÁLICA 26 , AFIXADA EM CAVALETES DE MADEIRA DE LEI (VIGOTAS 6X12CM) - PADRÃO GOINFRA","m2    ",7.5,1,7.5,null,null,0,0,""]
["S",2,"S",0,8,1,0,0,0,0,0,"","Serviço","Serviço","-","AGETOP",270804,"PLACA DE INAUGURAÇÃO AÇO ESCOVADO 60 X 120 CM","un    ",1,1,1,null,null,0,0,""]
[1,1,1,81,9,0,0,0,0,238,81,"F","Nível 1","Nível 1","9.","AGETOP",null,"PROJETO ELÉTRICO","UN",1,1,1,null,null,0,0,""]
[2,2,2,4,9,1,0,0,0,80,4,"","Nível 2","Nível 2","-","AGETOP",null,"SERVIÇOS PRELIMINARES","-",null,1,"-",null,null,0,0,""]
["S",2,"S",0,9,1,0,0,0,0,0,"","Serviço","Serviço","-","SINAPI",97661,"REMOÇÃO DE CABOS ELÉTRICOS, DE FORMA MANUAL, SEM REAPROVEITAMENTO. AF_12/2017","M",1500,1,1500,null,null,0,0,""]
["S",2,"S",0,9,1,0,0,0,0,0,"","Serviço","Serviço","-","SINAPI",97660,"REMOÇÃO DE INTERRUPTORES/TOMADAS ELÉTRICAS, DE FORMA MANUAL, SEM REAPROVEITAMENTO. AF_12/2017","UN",58,1,58,null,null,0,0,""]
["S",2,"S",0,9,1,0,0,0,0,0,"","Serviço","Serviço","-","SINAPI",97665,"REMOÇÃO DE LUMINÁRIAS, DE FORMA MANUAL, SEM REAPROVEITAMENTO. AF_12/2017","UN",118,1,118,null,null,0,0,""]
[2,2,2,3,9,2,0,0,0,76,3,"","Nível 2","Nível 2","-","AGETOP",null,"SERVIÇO EM TERRA","-",null,1,"-",null,null,0,0,""]
["S",2,"S",0,9,2,0,0,0,0,0,"","Serviço","Serviço","-","SINAPI",93358,"ESCAVAÇÃO MANUAL DE VALA COM PROFUNDIDADE MENOR OU IGUAL A 1,30 M. AF_03/2016","M3",12.5,1,12.5,null,null,0,0,"Referência: AGETOP - 40101"]
["S",2,"S",0,9,2,0,0,0,0,0,"","Serviço","Serviço","-","SINAPI",96995,"REATERRO MANUAL APILOADO COM SOQUETE. AF_10/2017","M3",12.5,1,12.5,null,null,0,0,"Referência: AGETOP - 40902"]
[2,2,2,71,9,3,0,0,0,73,71,"","Nível 2","Nível 2","-",null,null,"INSTALAÇÕES ELÉTRICAS","-",null,1,"-",null,null,0,0,""]
[{"$f":"CHOOSE(1+LOG(1+2*(ORÇAMENTO.Nivel=\"Nível 1\")+4*(ORÇAMENTO.Nivel=\"Nível 2\")+8*(ORÇAMENTO.Nivel=\"Nível 3\")+16*(ORÇAMENTO.Nivel=\"Nível 4\")+32*(ORÇAMENTO.Nivel=\"Serviço\"),2),0,1,2,3,4,\"S\")","v":3},{"$f":"IF(OR(C181=\"s\",C181=0),OFFSET(B181,-1,0),C181)","v":3},{"$f":"IF(OFFSET(C181,-1,0)=\"L\",1,IF(OFFSET(C181,-1,0)=1,2,IF(OR(A181=\"s\",A181=0),\"S\",IF(AND(OFFSET(C181,-1,0)=2,A181=4),3,IF(AND(OR(OFFSET(C181,-1,0)=\"s\",OFFSET(C181,-1,0)=0),A181<>\"s\",A181>OFFSET(B181,-1,0)),OFFSET(B181,-1,0),A181)))))","v":3},{"$f":"IF(OR(C181=\"S\",C181=0),0,IF(ISERROR(K181),J181,SMALL(J181:K181,1)))","v":47},{"$f":"IF($C181=1,OFFSET(E181,-1,0)+1,OFFSET(E181,-1,0))","v":9},{"$f":"IF($C181=1,0,IF($C181=2,OFFSET(F181,-1,0)+1,OFFSET(F181,-1,0)))","v":3},{"$f":"IF(AND($C181<=2,$C181<>0),0,IF($C181=3,OFFSET(G181,-1,0)+1,OFFSET(G181,-1,0)))","v":1},{"$f":"IF(AND($C181<=3,$C181<>0),0,IF($C181=4,OFFSET(H181,-1,0)+1,OFFSET(H181,-1,0)))","v":0},{"$f":"IF(AND($C181<=4,$C181<>0),0,IF(AND($C181=\"S\",$Y181>0),OFFSET(I181,-1,0)+1,OFFSET(I181,-1,0)))","v":0},70,47,{"$f":"IF(OR(Y181>0,$C181=1),\"F\",\"\")","v":""},"Nível 3",{"$f":"CHOOSE(1+LOG(1+2*(C181=1)+4*(C181=2)+8*(C181=3)+16*(C181=4)+32*(C181=\"S\"),2),\"\",\"Nível 1\",\"Nível 2\",\"Nível 3\",\"Nível 4\",\"Serviço\")","v":"Nível 3"},"-","SINAPI",null,"GERAL","-",null,1,"-",null,null,0,0,""]
["S",3,"S",0,9,3,1,0,0,0,0,"","Serviço","Serviço","-","AGETOP",70351,"BRACADEIRA METALICA TIPO \"U\" DIAM. 3/4\"","Un    ",320,1,320,null,null,0,0,""]
["S",3,"S",0,9,3,1,0,0,0,0,"","Serviço","Serviço","-","AGETOP",70352,"BRACADEIRA METALICA TIPO \"U\" DIAM. 1\"","Un    ",60,1,60,null,null,0,0,""]
["S",3,"S",0,9,3,1,0,0,0,0,"","Serviço","Serviço","-","AGETOP",70354,"BRACADEIRA METALICA TIPO \"U\" DIAM. 1.1/2\"","Un    ",30,1,30,null,null,0,0,""]
["S",3,"S",0,9,3,1,0,0,0,0,"","Serviço","Serviço","-","AGETOP",70355,"BRACADEIRA METALICA TIPO \"U\" DIAM. 2\"","Un    ",12,1,12,null,null,0,0,""]
["S",3,"S",0,9,3,1,0,0,0,0,"","Serviço","Serviço","-","AGETOP",70421,"BUCHA E ARRUELA METALICA DIAM. 3/4\"","PR    ",8,1,8,null,null,0,0,""]
["S",3,"S",0,9,3,1,0,0,0,0,"","Serviço","Serviço","-","AGETOP",70422,"BUCHA E ARRUELA METALICA DIAM. 1\"","PR    ",2,1,2,null,null,0,0,""]
["S",3,"S",0,9,3,1,0,0,0,0,"","Serviço","Serviço","-","AGETOP",70424,"BUCHA E ARRUELA METALICA DIAM. 1.1/2\"","PR    ",2,1,2,null,null,0,0,""]
["S",3,"S",0,9,3,1,0,0,0,0,"","Serviço","Serviço","-","AGETOP",70425,"BUCHA E ARRUELA METALICA DIAM. 2\"","PR    ",2,1,2,null,null,0,0,""]
["S",3,"S",0,9,3,1,0,0,0,0,"","Serviço","Serviço","-","AGETOP",70565,"CABO ISOLADO PVC 750 V. No. 6 MM2","m     ",600,1,600,null,null,0,0,""]
["S",3,"S",0,9,3,1,0,0,0,0,"","Serviço","Serviço","-","AGETOP",70584,"CABO PVC (70ºC) 1 KV No. 10 MM2","M     ",300,1,300,null,null,0,0,""]
["S",3,"S",0,9,3,1,0,0,0,0,"","Serviço","Serviço","-","SINAPI",92984,"CABO DE COBRE FLEXÍVEL ISOLADO, 25 MM², ANTI-CHAMA 0,6/1,0 KV, PARA DISTRIBUIÇÃO - FORNECIMENTO E INSTALAÇÃO. AF_12/2015","M",120,1,120,null,null,0,0,"Referência: AGETOP - 70511"]
["S",3,"S",0,9,3,1,0,0,0,0,"","Serviço","Serviço","-","SINAPI",96971,"CORDOALHA DE COBRE NU 16 MM², NÃO ENTERRADA, COM ISOLADOR - FORNECIMENTO E INSTALAÇÃO. AF_12/2017","M",50,1,50,null,null,0,0,"Referência: AGETOP - 70541"]
["S",3,"S",0,9,3,1,0,0,0,0,"","Serviço","Serviço","-","SINAPI",91927,"CABO DE COBRE FLEXÍVEL ISOLADO, 2,5 MM², ANTI-CHAMA 0,6/1,0 KV, PARA CIRCUITOS TERMINAIS - FORNECIMENTO E INSTALAÇÃO. AF_12/2015","M",3000,1,3000,null,null,0,0,"Referência: AGETOP - 70581"]
["S",3,"S",0,9,3,1,0,0,0,0,"","Serviço","Serviço","-","SINAPI",91929,"CABO DE COBRE FLEXÍVEL ISOLADO, 4 MM², ANTI-CHAMA 0,6/1,0 KV, PARA CIRCUITOS TERMINAIS - FORNECIMENTO E INSTALAÇÃO. AF_12/2015","M",1200,1,1200,null,null,0,0,"Referência: AGETOP - 70582"]
["S",3,"S",0,9,3,1,0,0,0,0,"","Serviço","Serviço","-","AGETOP",70646,"CAIXA DE PASSAGEM METÁLICA DE EMBUTIR 20X20X10 CM","Un    ",2,1,2,null,null,0,0,""]
["S",3,"S",0,9,3,1,0,0,0,0,"","Serviço","Serviço","-","AGETOP",70691,"CAIXA METALICA RET. 4\" X 2\" X 2\"","Un    ",64,1,64,null,null,0,0,""]
["S",3,"S",0,9,3,1,0,0,0,0,"","Serviço","Serviço","-","AGETOP",70720,"CAIXA METÁLICA PARA MEDIDOR POLIFÁSICO PADRÃO ENEL 500X380X166MM","Un    ",1,1,1,null,null,0,0,""]
["S",3,"S",0,9,3,1,0,0,0,0,"","Serviço","Serviço","-","SINAPI",95801,"CONDULETE DE ALUMÍNIO, TIPO X, PARA ELETRODUTO DE AÇO GALVANIZADO DN 20 MM (3/4''), APARENTE - FORNECIMENTO E INSTALAÇÃO. AF_11/2016_P","UN",7,1,7,null,null,0,0,"Referência: AGETOP - 70929"]
["S",3,"S",0,9,3,1,0,0,0,0,"","Serviço","Serviço","-","AGETOP",70930,"CONDULETE METÁLICO - ADAPTADOR DE SAÍDA 3/4\" ","un    ",7,1,7,null,null,0,0,""]
["S",3,"S",0,9,3,1,0,0,0,0,"","Serviço","Serviço","-","SINAPI",93653,"DISJUNTOR MONOPOLAR TIPO DIN, CORRENTE NOMINAL DE 10A - FORNECIMENTO E INSTALAÇÃO. AF_04/2016","UN",11,1,11,null,null,0,0,""]
["S",3,"S",0,9,3,1,0,0,0,0,"","Serviço","Serviço","-","SINAPI",93655,"DISJUNTOR MONOPOLAR TIPO DIN, CORRENTE NOMINAL DE 20A - FORNECIMENTO E INSTALAÇÃO. AF_04/2016","UN",19,1,19,null,null,0,0,""]
["S",3,"S",0,9,3,1,0,0,0,0,"","Serviço","Serviço","-","SINAPI",93654,"DISJUNTOR MONOPOLAR TIPO DIN, CORRENTE NOMINAL DE 16A - FORNECIMENTO E INSTALAÇÃO. AF_04/2016","UN",8,1,8,null,null,0,0,""]
["S",3,"S",0,9,3,1,0,0,0,0,"","Serviço","Serviço","-","SINAPI",93658,"DISJUNTOR MONOPOLAR TIPO DIN, CORRENTE NOMINAL DE 40A - FORNECIMENTO E INSTALAÇÃO. AF_04/2016","UN",4,1,4,null,null,0,0,""]
["S",3,"S",0,9,3,1,0,0,0,0,"","Serviço","Serviço","-","AGETOP",71175,"DISJUNTOR TRIPOLAR DE 60 A 100-A","Un    ",2,1,2,null,null,0,0,""]
["S",3,"S",0,9,3,1,0,0,0,0,"","Serviço","Serviço","-","AGETOP",71184,"DISPOSITIVO DE PROTEÇÃO CONTRA SURTOS (D.P.S.) 275V DE 8 A 40KA","Un    ",4,1,4,null,null,0,0,""]
["S",3,"S",0,9,3,1,0,0,0,0,"","Serviço","Serviço","-","SINAPI",91844,"ELETRODUTO FLEXÍVEL CORRUGADO, PVC, DN 25 MM (3/4\"), PARA CIRCUITOS TERMINAIS, INSTALADO EM LAJE - FORNECIMENTO E INSTALAÇÃO. AF_12/2015","M",640,1,640,null,null,0,0,""]
["S",3,"S",0,9,3,1,0,0,0,0,"","Serviço","Serviço","-","SINAPI",91846,"ELETRODUTO FLEXÍVEL CORRUGADO, PVC, DN 32 MM (1\"), PARA CIRCUITOS TERMINAIS, INSTALADO EM LAJE - FORNECIMENTO E INSTALAÇÃO. AF_12/2015","M",120,1,120,null,null,0,0,""]
["S",3,"S",0,9,3,1,0,0,0,0,"","Serviço","Serviço","-","SINAPI",93008,"ELETRODUTO RÍGIDO ROSCÁVEL, PVC, DN 50 MM (1 1/2\") - FORNECIMENTO E INSTALAÇÃO. AF_12/2015","M",60,1,60,null,null,0,0,""]
["S",3,"S",0,9,3,1,0,0,0,0,"","Serviço","Serviço","-","SINAPI",93009,"ELETRODUTO RÍGIDO ROSCÁVEL, PVC, DN 60 MM (2\") - FORNECIMENTO E INSTALAÇÃO. AF_12/2015","M",50,1,50,null,null,0,0,""]
["S",3,"S",0,9,3,1,0,0,{"$f":"IF(OR($C211=\"S\",$C211=0),0,MATCH(0,OFFSET($D211,1,$C211,ROW($C$410)-ROW($C211)),0))","v":0},{"$f":"IF(OR($C211=\"S\",$C211=0),0,MATCH(OFFSET($D211,0,$C211)+1,OFFSET($D211,1,$C211,ROW($C$410)-ROW($C211)),0))","v":0},"","Serviço","Serviço","-","AGETOP",71321,"FITA DE AUTO FUSAO, ROLO E 10,00 MM","Un    ",5,1,5,null,null,0,0,""]
["S",3,"S",0,9,3,1,0,0,0,0,"","Serviço","Serviço","-","AGETOP",71331,"FITA ISOLANTE, ROLO DE 20,00 M","Un    ",15,1,15,null,null,0,0,""]
["S",3,"S",0,9,3,1,0,0,0,0,"","Serviço","Serviço","-","AGETOP",71381,"HASTE REV.COBRE(COPPERWELD)  5/8\" X 3,00 M C/CONECTOR","Un    ",3,1,3,null,null,0,0,""]
["S",3,"S",0,9,3,1,0,0,0,0,"","Serviço","Serviço","-","AGETOP",71450,"INTERRUPTOR DIFERENCIAL RESIDUAL (D.R.) BIPOLAR DE 25A-30mA","Un    ",2,1,2,null,null,0,0,""]
["S",3,"S",0,9,3,1,0,0,0,0,"","Serviço","Serviço","-","SINAPI",91953,"INTERRUPTOR SIMPLES (1 MÓDULO), 10A/250V, INCLUINDO SUPORTE E PLACA - FORNECIMENTO E INSTALAÇÃO. AF_12/2015","UN",34,1,34,null,null,0,0,"Referência: AGETOP - 71440"]
["S",3,"S",0,9,3,1,0,0,0,0,"","Serviço","Serviço","-","SINAPI",97586,"LUMINÁRIA TIPO CALHA, DE SOBREPOR, COM 2 LÂMPADAS TUBULARES FLUORESCENTES DE 36 W, COM REATOR DE PARTIDA RÁPIDA - FORNECIMENTO E INSTALAÇÃO. AF_02/2020","UN",118,1,118,null,null,0,0,""]
["S",3,"S",0,9,3,1,0,0,0,0,"","Serviço","Serviço","-","SINAPI",91885,"LUVA PARA ELETRODUTO, PVC, ROSCÁVEL, DN 32 MM (1\"), PARA CIRCUITOS TERMINAIS, INSTALADA EM PAREDE - FORNECIMENTO E INSTALAÇÃO. AF_12/2015","UN",15,1,15,null,null,0,0,"Referência: AGETOP - 71742"]
["S",3,"S",0,9,3,1,0,0,0,0,"","Serviço","Serviço","-","SINAPI",93013,"LUVA PARA ELETRODUTO, PVC, ROSCÁVEL, DN 50 MM (1 1/2\") - FORNECIMENTO E INSTALAÇÃO. AF_12/2015","UN",30,1,30,null,null,0,0,"Referência: AGETOP - 71744"]
["S",3,"S",0,9,3,1,0,0,0,0,"","Serviço","Serviço","-","SINAPI",93014,"LUVA PARA ELETRODUTO, PVC, ROSCÁVEL, DN 60 MM (2\") - FORNECIMENTO E INSTALAÇÃO. AF_12/2015","UN",9,1,9,null,null,0,0,"Referência: AGETOP - 71745"]
["S",3,"S",0,9,3,1,0,0,0,0,"","Serviço","Serviço","-","AGETOP",71826,"PADRÃO TRIFASICO 25 MM H=7 METROS","Un    ",1,1,1,null,null,0,0,""]
["S",3,"S",0,9,3,1,0,0,0,0,"","Serviço","Serviço","-","SINAPI","74131/5","QUADRO DE DISTRIBUICAO DE ENERGIA DE EMBUTIR, EM CHAPA METALICA, PARA 24 DISJUNTORES TERMOMAGNETICOS MONOPOLARES, COM BARRAMENTO TRIFASICO E NEUTRO, FORNECIMENTO E INSTALACAO","UN",2,1,2,null,null,0,0,""]
["S",3,"S",0,9,3,1,0,0,0,0,"","Serviço","Serviço","-","SINAPI","74131/6","QUADRO DE DISTRIBUICAO DE ENERGIA DE EMBUTIR, EM CHAPA METALICA, PARA 32 DISJUNTORES TERMOMAGNETICOS MONOPOLARES, COM BARRAMENTO TRIFASICO E NEUTRO, FORNECIMENTO E INSTALACAO","UN",1,1,1,null,null,0,0,""]
["S",3,"S",0,9,3,1,0,0,0,0,"","Serviço","Serviço","-","COMPOSIÇÃO","COMP 375_SEE","REFLETOR DE LED HOLOFORTE 50W","UN ",5,1,5,null,null,0,0,""]
["S",3,"S",0,9,3,1,0,0,0,0,"","Serviço","Serviço","-","AGETOP",72395,"TAMPA CEGA PARA CONDULETE METÁLICO","Un    ",7,1,7,null,null,0,0,""]
["S",3,"S",0,9,3,1,0,0,0,0,"","Serviço","Serviço","-","AGETOP",72425,"TAMPA CEGA PLASTICA RETANGULAR 4\"X2\"","Un    ",74,1,74,null,null,0,0,""]
["S",3,"S",0,9,3,1,0,0,0,0,"","Serviço","Serviço","-","AGETOP",72578,"TOMADA HEXAGONAL 2P + T - 10A - 250V","Un    ",40,1,40,null,null,0,0,""]
["S",3,"S",0,9,3,1,0,0,0,0,"","Serviço","Serviço","-","AGETOP",72585,"TOMADA HEXAGONAL 2P + T - 20A - 250V","Un    ",7,1,7,null,null,0,0,""]
[3,3,3,23,9,3,2,0,0,23,41,"","Nível 3","Nível 3","-",null,null,"INSTALAÇÕES ELÉTRICAS PARA SISTEMA DE COMBATE A INCÊNDIO","-",null,1,"-",null,null,0,0,""]
[{"$f":"CHOOSE(1+LOG(1+2*(ORÇAMENTO.Nivel=\"Nível 1\")+4*(ORÇAMENTO.Nivel=\"Nível 2\")+8*(ORÇAMENTO.Nivel=\"Nível 3\")+16*(ORÇAMENTO.Nivel=\"Nível 4\")+32*(ORÇAMENTO.Nivel=\"Serviço\"),2),0,1,2,3,4,\"S\")","v":"S"},{"$f":"IF(OR(C229=\"s\",C229=0),OFFSET(B229,-1,0),C229)","v":3},{"$f":"IF(OFFSET(C229,-1,0)=\"L\",1,IF(OFFSET(C229,-1,0)=1,2,IF(OR(A229=\"s\",A229=0),\"S\",IF(AND(OFFSET(C229,-1,0)=2,A229=4),3,IF(AND(OR(OFFSET(C229,-1,0)=\"s\",OFFSET(C229,-1,0)=0),A229<>\"s\",A229>OFFSET(B229,-1,0)),OFFSET(B229,-1,0),A229)))))","v":"S"},{"$f":"IF(OR(C229=\"S\",C229=0),0,IF(ISERROR(K229),J229,SMALL(J229:K229,1)))","v":0},{"$f":"IF($C229=1,OFFSET(E229,-1,0)+1,OFFSET(E229,-1,0))","v":9},{"$f":"IF($C229=1,0,IF($C229=2,OFFSET(F229,-1,0)+1,OFFSET(F229,-1,0)))","v":3},{"$f":"IF(AND($C229<=2,$C229<>0),0,IF($C229=3,OFFSET(G229,-1,0)+1,OFFSET(G229,-1,0)))","v":2},{"$f":"IF(AND($C229<=3,$C229<>0),0,IF($C229=4,OFFSET(H229,-1,0)+1,OFFSET(H229,-1,0)))","v":0},{"$f":"IF(AND($C229<=4,$C229<>0),0,IF(AND($C229=\"S\",$Y229>0),OFFSET(I229,-1,0)+1,OFFSET(I229,-1,0)))","v":0},0,0,{"$f":"IF(OR(Y229>0,$C229=1),\"F\",\"\")","v":""},"Serviço",{"$f":"CHOOSE(1+LOG(1+2*(C229=1)+4*(C229=2)+8*(C229=3)+16*(C229=4)+32*(C229=\"S\"),2),\"\",\"Nível 1\",\"Nível 2\",\"Nível 3\",\"Nível 4\",\"Serviço\")","v":"Serviço"},"-","AGETOP",70584,"CABO PVC (70ºC) 1 KV No. 10 MM2","M     ",60,1,60,null,null,0,0,""]
["S",3,"S",0,9,3,2,0,0,0,0,"","Serviço","Serviço","-","AGETOP",71203,"ELETRODUTO DE PVC RIGIDO DIAMETRO 1.1/2\"","M     ",18,1,18,null,null,0,0,""]
["S",3,"S",0,9,3,2,0,0,0,0,"","Serviço","Serviço","-","AGETOP",71744,"LUVA PVC ROSQUEAVEL DIAMETRO 1.1/2\"","Un    ",2,1,2,null,null,0,0,""]
["S",3,"S",0,9,3,2,0,0,0,0,"","Serviço","Serviço","-","AGETOP",71144,"CURVA DE 90 GRAUS DE PVC RIGIDO DIAM. 1.1/2\"","Un    ",1,1,1,null,null,0,0,""]
["S",3,"S",0,9,3,2,0,0,0,0,"","Serviço","Serviço","-","AGETOP",72518,"TERMINAL DE PRESSAO 10 MM2","Un    ",4,1,4,null,null,0,0,""]
["S",3,"S",0,9,3,2,0,0,0,0,"","Serviço","Serviço","-","AGETOP",70700,"CAIXA PARA QUADRO DE COMANDO METÁLICA DE SOBREPOR 40X30X20 CM","Un    ",1,1,1,null,null,0,0,""]
["S",3,"S",0,9,3,2,0,0,0,0,"","Serviço","Serviço","-","AGETOP",71250,"ELETRODUTO EM AÇO ZINCADO DIÂMETRO 1/2\"","M     ",27,1,27,null,null,0,0,""]
["S",3,"S",0,9,3,2,0,0,0,0,"","Serviço","Serviço","-","AGETOP",70305,"BOTOEIRA \"LIGA-DESLIGA\" P/INST.EM PORTA  DE QUADRO","Un    ",1,1,1,null,null,0,0,""]
["S",3,"S",0,9,3,2,0,0,0,0,"","Serviço","Serviço","-","AGETOP",70779,"CH.PARTIDA MOTOR TRIF.C/RELE FALTA DE FASE 7 1/2CV","Un    ",1,1,1,null,null,0,0,""]
["S",3,"S",0,9,3,2,0,0,0,0,"","Serviço","Serviço","-","AGETOP",71063,"CONTATOR 3 TF 43 - 25A","Un    ",1,1,1,null,null,0,0,""]
["S",3,"S",0,9,3,2,0,0,0,0,"","Serviço","Serviço","-","AGETOP",70892,"CHAVE TRIPOLAR TIPO PACCO 32A","Un    ",1,1,1,null,null,0,0,""]
["S",3,"S",0,9,3,2,0,0,0,0,"","Serviço","Serviço","-","SINAPI",91926,"CABO DE COBRE FLEXÍVEL ISOLADO, 2,5 MM², ANTI-CHAMA 450/750 V, PARA CIRCUITOS TERMINAIS - FORNECIMENTO E INSTALAÇÃO. AF_12/2015","M",20,1,20,null,null,0,0,"Referência: AGETOP - 70563"]
["S",3,"S",0,9,3,2,0,0,0,0,"","Serviço","Serviço","-","AGETOP",70555,"CABO FLEXIVEL PARALELO 2 X 1,5 MM2","M     ",700,1,700,null,null,0,0,""]
["S",3,"S",0,9,3,2,0,0,0,0,"","Serviço","Serviço","-","AGETOP",71174,"DISJUNTOR TRIPOLAR 40 A 50A","Un    ",1,1,1,null,null,0,0,""]
["S",3,"S",0,9,3,2,0,0,0,0,"","Serviço","Serviço","-","AGETOP",71171,"DISJUNTOR MONOPOLAR DE 10 A 32-A","Un    ",3,1,3,null,null,0,0,""]
["S",3,"S",0,9,3,2,0,0,0,0,"","Serviço","Serviço","-","SINAPI",91928,"CABO DE COBRE FLEXÍVEL ISOLADO, 4 MM², ANTI-CHAMA 450/750 V, PARA CIRCUITOS TERMINAIS - FORNECIMENTO E INSTALAÇÃO. AF_12/2015","M",40,1,40,null,null,0,0,"Referência: AGETOP - 70564"]
["S",3,"S",0,9,3,2,0,0,0,0,"","Serviço","Serviço","-","AGETOP",71184,"DISPOSITIVO DE PROTEÇÃO CONTRA SURTOS (D.P.S.) 275V DE 8 A 40KA","Un    ",3,1,3,null,null,0,0,""]
["S",3,"S",0,9,3,2,0,0,0,0,"","Serviço","Serviço","-","AGETOP",71032,"CONECTOR TIPO PARAFUSO FENDIDO 10 MM2","Un    ",4,1,4,null,null,0,0,""]
["S",3,"S",0,9,3,2,0,0,0,0,"","Serviço","Serviço","-","AGETOP",70924,"CONDULETE DE PVC - CAIXA COM 5 ENTRADAS ","un    ",16,1,16,null,null,0,0,""]
["S",3,"S",0,9,3,2,0,0,0,0,"","Serviço","Serviço","-","AGETOP",70925,"CONDULETE DE PVC - ADAPTADOR DE SAÍDA 3/4\"  ","un    ",16,1,16,null,null,0,0,""]
["S",3,"S",0,9,3,2,0,0,0,0,"","Serviço","Serviço","-","AGETOP",72578,"TOMADA HEXAGONAL 2P + T - 10A - 250V","Un    ",10,1,10,null,null,0,0,""]
["S",3,"S",0,9,3,2,0,0,0,0,"","Serviço","Serviço","-","AGETOP",71193,"ELETRODUTO PVC FLEXÍVEL - MANGUEIRA CORRUGADA LEVE - DIAM. 20MM","M     ",60,1,60,null,null,0,0,""]
[2,2,2,2,9,4,0,0,0,2,157,"","Nível 2","Nível 2","-",null,null,"REVESTIMENTO DE PISO","-",null,1,"-",null,null,0,0,""]
["S",2,"S",0,9,4,0,0,0,0,0,"","Serviço","Serviço","-","SINAPI",68325,"PISO EM CONCRETO 20 MPA PREPARO MECANICO, ESPESSURA 7CM, INCLUSO SELANTE ELASTICO A BASE DE POLIURETANO","M2",25,1,25,null,null,0,0,""]
[1,1,1,18,10,0,0,0,0,157,18,"F","Nível 1","Nível 1","10.","AGETOP",null,"PROJETO ESTRUTURAL","UN",1,1,1,null,null,0,0,""]
[2,2,2,17,10,1,0,0,0,17,97,"","Nível 2","Nível 2","-","AGETOP",null,"FUNDAÇÕES E SONDAGENS","-",null,1,"-",null,null,0,0,""]
[3,3,3,4,10,1,1,0,0,16,4,"","Nível 3","Nível 3","-","SINAPI",null,"ESTACAS","-",null,1,"-",null,null,0,0,""]
["S",3,"S",0,10,1,1,0,0,0,0,"","Serviço","Serviço","-","AGETOP",50302,"ESTACA A TRADO DIAM.30 CM SEM FERRO","M     ",4,1,4,null,null,0,0,""]
["S",3,"S",0,10,1,1,0,0,0,0,"","Serviço","Serviço","-","AGETOP",52005,"ACO CA-50A - 10,0 MM (3/8\") - (OBRAS CIVIS)","Kg    ",15,1,15,null,null,0,0,""]
["S",3,"S",0,10,1,1,0,0,0,0,"","Serviço","Serviço","-","AGETOP",52014,"ACO CA-60 - 5,0 MM - (OBRAS CIVIS)","Kg    ",4.82,1,4.82,null,null,0,0,""]
[3,3,3,10,10,1,2,0,0,12,10,"","Nível 3","Nível 3","-","SINAPI",null,"VIGAS BALDRAMES","-",null,1,"-",null,null,0,0,""]
["S",3,"S",0,10,1,2,0,0,0,0,"","Serviço","Serviço","-","AGETOP",40101,"ESCAVACAO MANUAL DE VALAS < 1 MTS. (OBRAS CIVIS)","m3    ",0.33,1,0.33,null,null,0,0,""]
["S",3,"S",0,10,1,2,0,0,0,0,"","Serviço","Serviço","-","AGETOP",50902,"APILOAMENTO (BLOCOS/SAPATAS)","m2    ",0.46,1,0.46,null,null,0,0,""]
["S",3,"S",0,10,1,2,0,0,0,0,"","Serviço","Serviço","-","AGETOP",60470,"LASTRO DE BRITA - (OBRAS CIVIS)","m3    ",2.3000000000000003E-2,1,2.3000000000000003E-2,null,null,0,0,""]
["S",3,"S",0,10,1,2,0,0,0,0,"","Serviço","Serviço","-","AGETOP",60191,"FORMA DE TABUA CINTA BALDRAME U=8 VEZES","m2    ",1.87,1,1.87,null,null,0,0,""]
["S",3,"S",0,10,1,2,0,0,0,0,"","Serviço","Serviço","-","AGETOP",51030,"PREPARO COM BETONEIRA E TRANSPORTE MANUAL DE CONCRETO FCK=25 MPA","m3    ",0.14000000000000001,1,0.14000000000000001,null,null,0,0,""]
["S",3,"S",0,10,1,2,0,0,0,0,"","Serviço","Serviço","-","AGETOP",51055,"LANÇAMENTO/APLICAÇÃO/ADENSAMENTO MANUAL DE CONCRETO - (O.C.)","m3    ",0.14000000000000001,1,0.14000000000000001,null,null,0,0,""]
["S",3,"S",0,10,1,2,0,0,0,0,"","Serviço","Serviço","-","AGETOP",40902,"REATERRO COM APILOAMENTO","m3    ",0.19,1,0.19,null,null,0,0,""]
["S",3,"S",0,10,1,2,0,0,0,0,"","Serviço","Serviço","-","AGETOP",52004,"ACO CA 50-A - 8,0 MM (5/16\") - (OBRAS CIVIS)","Kg    ",5.0999999999999996,1,5.0999999999999996,null,null,0,0,""]
["S",3,"S",0,10,1,2,0,0,0,0,"","Serviço","Serviço","-","AGETOP",52014,"ACO CA-60 - 5,0 MM - (OBRAS CIVIS)","Kg    ",1.5,1,1.5,null,null,0,0,""]
[3,3,3,2,10,1,3,0,0,2,79,"","Nível 3","Nível 3","-","SINAPI",null,"OUTROS","-",null,1,"-",null,null,0,0,""]
["S",3,"S",0,10,1,3,0,0,0,0,"","Serviço","Serviço","-","AGETOP",120902,"IMPERMEABILIZACAO VIGAS BALDRAMES E=2,0 CM","m2    ",2.25,1,2.25,null,null,0,0,""]
[1,1,1,3,11,0,0,0,0,139,3,"F","Nível 1","Nível 1","11.","SINAPI",null,"PROJETO ESTRUTURAS METÁLICAS","UN",1,1,1,null,null,0,0,""]
[2,2,2,2,11,1,0,0,0,2,79,"","Nível 2","Nível 2","-","SINAPI",null,"ESTRUTURAS METÁLICAS","-",null,1,"-",null,null,0,0,""]
["S",2,"S",0,11,1,0,0,0,0,0,"","Serviço","Serviço","-","AGETOP",150204,"ESTRUTURA METÁLICA CONVENCIONAL EM AÇO DO TIPO MR-250 / ASTM A36 COM FUNDO ANTICORROSIVO","Kg    ",5022.24,1,5022.24,null,null,0,0,""]
[1,1,1,81,12,0,0,0,0,136,81,"F","Nível 1","Nível 1","12.","AGETOP",null,"PROJETO HIDROSSANITÁRIO","UN",1,1,1,null,null,0,0,""]
[2,2,2,76,12,1,0,0,0,{"$f":"IF(OR($C275=\"S\",$C275=0),0,MATCH(0,OFFSET($D275,1,$C275,ROW($C$410)-ROW($C275)),0))","v":80},{"$f":"IF(OR($C275=\"S\",$C275=0),0,MATCH(OFFSET($D275,0,$C275)+1,OFFSET($D275,1,$C275,ROW($C$410)-ROW($C275)),0))","v":76},"","Nível 2","Nível 2","-","AGETOP",null,"INSTALAÇÕES HIDROSSANITÁRIAS","-",null,1,"-",null,null,0,0,""]
[3,3,3,23,12,1,1,0,0,75,23,"","Nível 3","Nível 3","-","SINAPI",null,"PEÇAS E ACESSÓRIOS","-",null,1,"-",null,null,0,0,""]
[4,4,4,9,12,1,1,1,0,22,9,"","Nível 4","Nível 4","-","SINAPI",null,"VASO SANITÁRIO E ACESSÓRIOS","-",null,1,"-",null,null,0,0,""]
["S",4,"S",0,12,1,1,1,0,0,0,"","Serviço","Serviço","-","AGETOP",80502,"VASO SANITARIO","Un    ",11,1,11,null,null,0,0,""]
["S",4,"S",0,12,1,1,1,0,0,0,"","Serviço","Serviço","-","AGETOP",80517,"VÁLVULA DE DESCARGA DUPLO ACIONAMENTO COM ACABAMENTO CROMADO ANTIVANDALISMO","Un    ",11,1,11,null,null,0,0,""]
["S",4,"S",0,12,1,1,1,0,0,0,"","Serviço","Serviço","-","AGETOP",80520,"CONJUNTO DE FIXACAO P/VASO SANITARIO (PAR)","CJ    ",11,1,11,null,null,0,0,""]
["S",4,"S",0,12,1,1,1,0,0,0,"","Serviço","Serviço","-","AGETOP",80510,"ANEL DE VEDAÇÃO PARA VASO SANITÁRIO","Un    ",11,1,11,null,null,0,0,""]
["S",4,"S",0,12,1,1,1,0,0,0,"","Serviço","Serviço","-","AGETOP",80513,"TUBO PARA VÁLVULA DE DESCARGA ( CURTO 1.1/4\" )","Un    ",11,1,11,null,null,0,0,""]
["S",4,"S",0,12,1,1,1,0,0,0,"","Serviço","Serviço","-","AGETOP",80526,"ASSENTO EM POLIPROPILENO COM SISTEMA DE FECHAMENTO SUAVE PARA VASO SANITÁRIO","Un    ",11,1,11,null,null,0,0,""]
["S",4,"S",0,12,1,1,1,0,0,0,"","Serviço","Serviço","-","SINAPI",95544,"PAPELEIRA DE PAREDE EM METAL CROMADO SEM TAMPA, INCLUSO FIXAÇÃO. AF_01/2020","UN",11,1,11,null,null,0,0,""]
["S",4,"S",0,12,1,1,1,0,0,0,"","Serviço","Serviço","-","AGETOP",80721,"CHUVEIRO ELÉTRICO EM PVC COM BRAÇO METÁLICO","Un    ",3,1,3,null,null,0,0,""]
[4,4,4,9,12,1,1,2,0,13,9,"","Nível 4","Nível 4","-","SINAPI",null,"LAVATÓRIO E ACESSÓRIOS","-",null,1,"-",null,null,0,0,""]
["S",4,"S",0,12,1,1,2,0,0,0,"","Serviço","Serviço","-","AGETOP",80542,"LAVATÓRIO MÉDIO SEM COLUNA","Un    ",2,1,2,null,null,0,0,""]
["S",4,"S",0,12,1,1,2,0,0,0,"","Serviço","Serviço","-","AGETOP",80590,"CUBA DE LOUCA DE EMBUTIR OVAL MÉDIA ","Un    ",8,1,8,null,null,0,0,""]
["S",4,"S",0,12,1,1,2,0,0,0,"","Serviço","Serviço","-","AGETOP",80550,"FIXACAO P/LAVATORIO (PAR)","PAR   ",2,1,2,null,null,0,0,""]
["S",4,"S",0,12,1,1,2,0,0,0,"","Serviço","Serviço","-","AGETOP",80556,"LIGAÇÃO FLEXÍVEL PVC DIAM.1/2\" (ENGATE)","Un    ",10,1,10,null,null,0,0,""]
["S",4,"S",0,12,1,1,2,0,0,0,"","Serviço","Serviço","-","SINAPI",86883,"SIFÃO DO TIPO FLEXÍVEL EM PVC 1  X 1.1/2  - FORNECIMENTO E INSTALAÇÃO. AF_01/2020","UN",12,1,12,null,null,0,0,""]
["S",4,"S",0,12,1,1,2,0,0,0,"","Serviço","Serviço","-","SINAPI",86915,"TORNEIRA CROMADA DE MESA, 1/2\u0094 OU 3/4\u0094, PARA LAVATÓRIO, PADRÃO MÉDIO - FORNECIMENTO E INSTALAÇÃO. AF_01/2020","UN",10,1,10,null,null,0,0,"Referência: AGETOP - 80570"]
["S",4,"S",0,12,1,1,2,0,0,0,"","Serviço","Serviço","-","SINAPI",86877,"VÁLVULA EM METAL CROMADO 1.1/2\u0094 X 1.1/2\u0094 PARA TANQUE OU LAVATÓRIO, COM OU SEM LADRÃO - FORNECIMENTO E INSTALAÇÃO. AF_01/2020","UN",12,1,12,null,null,0,0,"Referência: AGETOP - 80580"]
["S",4,"S",0,12,1,1,2,0,0,0,"","Serviço","Serviço","-","AGETOP",80660,"TORNEIRA DE PAREDE PARA PIA OU BEBEDOURO DIÂMETRO DE 1/2\" E 3/4\" ","Un    ",6,1,6,null,null,0,0,""]
[4,4,4,4,12,1,1,3,0,4,17,"","Nível 4","Nível 4","-","SINAPI",null,"REGISTROS","-",null,1,"-",null,null,0,0,""]
["S",4,"S",0,12,1,1,3,0,0,0,"","Serviço","Serviço","-","AGETOP",80905,"REGISTRO DE GAVETA BRUTO DIAMETRO 1.1/2\"","Un    ",1,1,1,null,null,0,0,""]
["S",4,"S",0,12,1,1,3,0,0,0,"","Serviço","Serviço","-","AGETOP",80906,"REGISTRO DE GAVETA BRUTO DIAMETRO 2\"","Un    ",2,1,2,null,null,0,0,""]
["S",4,"S",0,12,1,1,3,0,0,0,"","Serviço","Serviço","-","AGETOP",80946,"REGISTRO DE PRESSAO C/CANOPLA CROMADA DIAM.3/4\"","Un    ",3,1,3,null,null,0,0,""]
[3,3,3,23,12,1,2,0,0,52,23,"","Nível 3","Nível 3","-","SINAPI",null,"ÁGUA FRIA","-",null,1,"-",null,null,0,0,""]
[4,4,4,4,12,1,2,1,0,22,4,"","Nível 4","Nível 4","-","SINAPI",null,"TUBOS DE PVC SOLDÁVEL","-",null,1,"-",null,null,0,0,""]
["S",4,"S",0,12,1,2,1,0,0,0,"","Serviço","Serviço","-","SINAPI",89402,"TUBO, PVC, SOLDÁVEL, DN 25MM, INSTALADO EM RAMAL DE DISTRIBUIÇÃO DE ÁGUA - FORNECIMENTO E INSTALAÇÃO. AF_12/2014","M",24,1,24,null,null,0,0,"Referência: AGETOP - 81003"]
["S",4,"S",0,12,1,2,1,0,0,0,"","Serviço","Serviço","-","SINAPI",89449,"TUBO, PVC, SOLDÁVEL, DN 50MM, INSTALADO EM PRUMADA DE ÁGUA - FORNECIMENTO E INSTALAÇÃO. AF_12/2014","M",18,1,18,null,null,0,0,""]
["S",4,"S",0,12,1,2,1,0,0,0,"","Serviço","Serviço","-","SINAPI",89450,"TUBO, PVC, SOLDÁVEL, DN 60MM, INSTALADO EM PRUMADA DE ÁGUA - FORNECIMENTO E INSTALAÇÃO. AF_12/2014","M",24,1,24,null,null,0,0,""]
[4,4,4,5,12,1,2,2,0,18,5,"","Nível 4","Nível 4","-","SINAPI",null,"JOELHO","-",null,1,"-",null,null,0,0,""]
["S",4,"S",0,12,1,2,2,0,0,0,"","Serviço","Serviço","-","SINAPI",89481,"JOELHO 90 GRAUS, PVC, SOLDÁVEL, DN 25MM, INSTALADO EM PRUMADA DE ÁGUA - FORNECIMENTO E INSTALAÇÃO. AF_12/2014","UN",8,1,8,null,null,0,0,""]
["S",4,"S",0,12,1,2,2,0,0,0,"","Serviço","Serviço","-","SINAPI",89501,"JOELHO 90 GRAUS, PVC, SOLDÁVEL, DN 50MM, INSTALADO EM PRUMADA DE ÁGUA - FORNECIMENTO E INSTALAÇÃO. AF_12/2014","UN",3,1,3,null,null,0,0,""]
["S",4,"S",0,12,1,2,2,0,0,0,"","Serviço","Serviço","-","SINAPI",89505,"JOELHO 90 GRAUS, PVC, SOLDÁVEL, DN 60MM, INSTALADO EM PRUMADA DE ÁGUA - FORNECIMENTO E INSTALAÇÃO. AF_12/2014","UN",4,1,4,null,null,0,0,""]
["S",4,"S",0,12,1,2,2,0,0,0,"","Serviço","Serviço","-","SINAPI",94672,"JOELHO 90 GRAUS COM BUCHA DE LATÃO, PVC, SOLDÁVEL, DN  25 MM, X 3/4\u0094 INSTALADO EM RESERVAÇÃO DE ÁGUA DE EDIFICAÇÃO QUE POSSUA RESERVATÓRIO DE FIBRA/FIBROCIMENTO   FORNECIMENTO E INSTALAÇÃO. AF_06/2016","UN",13,1,13,null,null,0,0,""]
[4,4,4,3,12,1,2,3,0,13,3,"","Nível 4","Nível 4","-","SINAPI",null,"TÊ","-",null,1,"-",null,null,0,0,""]
["S",4,"S",0,12,1,2,3,0,0,0,"","Serviço","Serviço","-","SINAPI",89625,"TE, PVC, SOLDÁVEL, DN 50MM, INSTALADO EM PRUMADA DE ÁGUA - FORNECIMENTO E INSTALAÇÃO. AF_12/2014","UN",3,1,3,null,null,0,0,""]
["S",4,"S",0,12,1,2,3,0,0,0,"","Serviço","Serviço","-","SINAPI",89627,"TÊ DE REDUÇÃO, PVC, SOLDÁVEL, DN 50MM X 25MM, INSTALADO EM PRUMADA DE ÁGUA - FORNECIMENTO E INSTALAÇÃO. AF_12/2014","UN",4,1,4,null,null,0,0,""]
[4,4,4,4,12,1,2,4,0,10,4,"","Nível 4","Nível 4","-","SINAPI",null,"ADAPTADORES","-",null,1,"-",null,null,0,0,""]
["S",4,"S",0,12,1,2,4,0,0,0,"","Serviço","Serviço","-","SINAPI",89596,"ADAPTADOR CURTO COM BOLSA E ROSCA PARA REGISTRO, PVC, SOLDÁVEL, DN 50MM X 1.1/2\u0094, INSTALADO EM PRUMADA DE ÁGUA - FORNECIMENTO E INSTALAÇÃO. AF_12/2014","UN",22,1,22,null,null,0,0,"Referência: AGETOP - 81069"]
["S",4,"S",0,12,1,2,4,0,0,0,"","Serviço","Serviço","-","SINAPI",89610,"ADAPTADOR CURTO COM BOLSA E ROSCA PARA REGISTRO, PVC, SOLDÁVEL, DN 60MM X 2\u0094, INSTALADO EM PRUMADA DE ÁGUA - FORNECIMENTO E INSTALAÇÃO. AF_12/2014","UN",4,1,4,null,null,0,0,""]
["S",{"$f":"IF(OR(C315=\"s\",C315=0),OFFSET(B315,-1,0),C315)","v":4},{"$f":"IF(OFFSET(C315,-1,0)=\"L\",1,IF(OFFSET(C315,-1,0)=1,2,IF(OR(A315=\"s\",A315=0),\"S\",IF(AND(OFFSET(C315,-1,0)=2,A315=4),3,IF(AND(OR(OFFSET(C315,-1,0)=\"s\",OFFSET(C315,-1,0)=0),A315<>\"s\",A315>OFFSET(B315,-1,0)),OFFSET(B315,-1,0),A315)))))","v":"S"},{"$f":"IF(OR(C315=\"S\",C315=0),0,IF(ISERROR(K315),J315,SMALL(J315:K315,1)))","v":0},{"$f":"IF($C315=1,OFFSET(E315,-1,0)+1,OFFSET(E315,-1,0))","v":12},{"$f":"IF($C315=1,0,IF($C315=2,OFFSET(F315,-1,0)+1,OFFSET(F315,-1,0)))","v":1},{"$f":"IF(AND($C315<=2,$C315<>0),0,IF($C315=3,OFFSET(G315,-1,0)+1,OFFSET(G315,-1,0)))","v":2},{"$f":"IF(AND($C315<=3,$C315<>0),0,IF($C315=4,OFFSET(H315,-1,0)+1,OFFSET(H315,-1,0)))","v":4},{"$f":"IF(AND($C315<=4,$C315<>0),0,IF(AND($C315=\"S\",$Y315>0),OFFSET(I315,-1,0)+1,OFFSET(I315,-1,0)))","v":0},0,0,{"$f":"IF(OR(Y315>0,$C315=1),\"F\",\"\")","v":""},"Serviço",{"$f":"CHOOSE(1+LOG(1+2*(C315=1)+4*(C315=2)+8*(C315=3)+16*(C315=4)+32*(C315=\"S\"),2),\"\",\"Nível 1\",\"Nível 2\",\"Nível 3\",\"Nível 4\",\"Serviço\")","v":"Serviço"},"-","SINAPI",89429,"ADAPTADOR CURTO COM BOLSA E ROSCA PARA REGISTRO, PVC, SOLDÁVEL, DN 25MM X 3/4\u0094, INSTALADO EM RAMAL DE DISTRIBUIÇÃO DE ÁGUA - FORNECIMENTO E INSTALAÇÃO. AF_12/2014","UN",8,1,8,null,null,0,0,"Referência: AGETOP - 81066"]
[4,4,4,3,12,1,2,5,0,6,3,"","Nível 4","Nível 4","-","SINAPI",null,"BUCHA DE REDUÇÃO","-",null,1,"-",null,null,0,0,""]
["S",4,"S",0,12,1,2,5,0,0,0,"","Serviço","Serviço","-","AGETOP",81165,"BUCHA DE REDUCAO SOLD. CURTA 60 X 50 mm","Un    ",5,1,5,null,null,0,0,""]
["S",4,"S",0,12,1,2,5,0,0,0,"","Serviço","Serviço","-","AGETOP",81179,"BUCHA DE REDUCAO SOLDAVEL LONGA 50 X 25 mm","Un    ",2,1,2,null,null,0,0,""]
[4,4,4,3,12,1,2,6,0,3,{"$error":"#N/A"},"","Nível 4","Nível 4","-","SINAPI",null,"ADESIVOS","-",null,1,"-",null,null,0,0,""]
["S",4,"S",0,12,1,2,6,0,0,0,"","Serviço","Serviço","-","AGETOP",81501,"ADESIVO PLASTICO - FRASCO 850 G","Un    ",1,1,1,null,null,0,0,""]
["S",4,"S",0,12,1,2,6,0,0,0,"","Serviço","Serviço","-","AGETOP",81504,"SOLUCAO LIMPADORA 1000 CM3","Un    ",1,1,1,null,null,0,0,""]
[3,3,3,26,12,1,3,0,0,29,26,"","Nível 3","Nível 3","-","SINAPI",null,"ESGOTO SANITÁRIO","-",null,1,"-",null,null,0,0,""]
[4,4,4,5,12,1,3,1,0,25,5,"","Nível 4","Nível 4","-","SINAPI",null,"CORPO DE CAIXA SIFONADA / RALO","-",null,1,"-",null,null,0,0,""]
["S",4,"S",0,12,1,3,1,0,0,0,"","Serviço","Serviço","-","AGETOP",81663,"CORPO CX. SIFONADA DIAM. 150 X 150 X 50","Un    ",3,1,3,null,null,0,0,""]
["S",4,"S",0,12,1,3,1,0,0,0,"","Serviço","Serviço","-","AGETOP",81791,"GRELHA REDONDA BRANCA DIAM. 150 MM","Un    ",3,1,3,null,null,0,0,""]
["S",4,"S",0,12,1,3,1,0,0,0,"","Serviço","Serviço","-","AGETOP",81681,"CORPO RALO SECO CILINDRICO 100 X 40","Un    ",3,1,3,null,null,0,0,""]
["S",4,"S",0,12,1,3,1,0,0,0,"","Serviço","Serviço","-","AGETOP",81790,"GRELHA REDONDA BRANCA DIAM. 100 MM","Un    ",3,1,3,null,null,0,0,""]
[4,4,4,8,12,1,3,2,0,20,8,"","Nível 4","Nível 4","-","SINAPI",null,"JOELHOS","-",null,1,"-",null,null,0,0,""]
["S",4,"S",0,12,1,3,2,0,0,0,"","Serviço","Serviço","-","AGETOP",81927,"JOELHO 90 GRAUS C/ANEL 40 mm ","Un    ",10,1,10,null,null,0,0,""]
["S",4,"S",0,12,1,3,2,0,0,0,"","Serviço","Serviço","-","AGETOP",81938,"JOELHO 90 GRAUS DIAMETRO 100 MM","Un    ",8,1,8,null,null,0,0,""]
["S",4,"S",0,12,1,3,2,0,0,0,"","Serviço","Serviço","-","AGETOP",81936,"JOELHO 90 GRAUS DIAMETRO 50 MM","Un    ",8,1,8,null,null,0,0,""]
["S",4,"S",0,12,1,3,2,0,0,0,"","Serviço","Serviço","-","AGETOP",81935,"JOELHO 90 GRAUS DIAMETRO 40 MM","Un    ",3,1,3,null,null,0,0,""]
["S",4,"S",0,12,1,3,2,0,0,0,"","Serviço","Serviço","-","SINAPI",89726,"JOELHO 45 GRAUS, PVC, SERIE NORMAL, ESGOTO PREDIAL, DN 40 MM, JUNTA SOLDÁVEL, FORNECIDO E INSTALADO EM RAMAL DE DESCARGA OU RAMAL DE ESGOTO SANITÁRIO. AF_12/2014","UN",8,1,8,null,null,0,0,""]
["S",4,"S",0,12,1,3,2,0,0,0,"","Serviço","Serviço","-","SINAPI",89802,"JOELHO 45 GRAUS, PVC, SERIE NORMAL, ESGOTO PREDIAL, DN 50 MM, JUNTA ELÁSTICA, FORNECIDO E INSTALADO EM PRUMADA DE ESGOTO SANITÁRIO OU VENTILAÇÃO. AF_12/2014","UN",5,1,5,null,null,0,0,""]
["S",4,"S",0,12,1,3,2,0,0,0,"","Serviço","Serviço","-","AGETOP",81924,"JOELHO 45 GRAUS DIAMETRO 100 MM","Un    ",4,1,4,null,null,0,0,""]
[4,4,4,4,12,1,3,3,0,12,4,"","Nível 4","Nível 4","-","SINAPI",null,"JUNÇÕES","-",null,1,"-",null,null,0,0,""]
["S",4,"S",0,12,1,3,3,0,0,0,"","Serviço","Serviço","-","SINAPI",89785,"JUNÇÃO SIMPLES, PVC, SERIE NORMAL, ESGOTO PREDIAL, DN 50 X 50 MM, JUNTA ELÁSTICA, FORNECIDO E INSTALADO EM RAMAL DE DESCARGA OU RAMAL DE ESGOTO SANITÁRIO. AF_12/2014","UN",3,1,3,null,null,0,0,"Referência: AGETOP - 81970"]
["S",4,"S",0,12,1,3,3,0,0,0,"","Serviço","Serviço","-","SINAPI",89797,"JUNÇÃO SIMPLES, PVC, SERIE NORMAL, ESGOTO PREDIAL, DN 100 X 100 MM, JUNTA ELÁSTICA, FORNECIDO E INSTALADO EM RAMAL DE DESCARGA OU RAMAL DE ESGOTO SANITÁRIO. AF_12/2014","UN",3,1,3,null,null,0,0,"Referência: AGETOP - 81975"]
["S",4,"S",0,12,1,3,3,0,{"$f":"IF(OR($C339=\"S\",$C339=0),0,MATCH(0,OFFSET($D339,1,$C339,ROW($C$410)-ROW($C339)),0))","v":0},{"$f":"IF(OR($C339=\"S\",$C339=0),0,MATCH(OFFSET($D339,0,$C339)+1,OFFSET($D339,1,$C339,ROW($C$410)-ROW($C339)),0))","v":0},"","Serviço","Serviço","-","AGETOP",81973,"JUNCAO SIMPLES DIAM. 100 X 50 MM","Un    ",4,1,4,null,null,0,0,""]
[{"$f":"CHOOSE(1+LOG(1+2*(ORÇAMENTO.Nivel=\"Nível 1\")+4*(ORÇAMENTO.Nivel=\"Nível 2\")+8*(ORÇAMENTO.Nivel=\"Nível 3\")+16*(ORÇAMENTO.Nivel=\"Nível 4\")+32*(ORÇAMENTO.Nivel=\"Serviço\"),2),0,1,2,3,4,\"S\")","v":4},4,4,4,12,1,3,4,0,8,4,"","Nível 4","Nível 4","-","SINAPI",null,"LUVAS","-",null,1,"-",null,null,0,0,""]
["S",4,"S",0,12,1,3,4,0,0,0,"","Serviço","Serviço","-","SINAPI",89752,"LUVA SIMPLES, PVC, SERIE NORMAL, ESGOTO PREDIAL, DN 40 MM, JUNTA SOLDÁVEL, FORNECIDO E INSTALADO EM RAMAL DE DESCARGA OU RAMAL DE ESGOTO SANITÁRIO. AF_12/2014","UN",3,1,3,null,null,0,0,""]
["S",4,"S",0,12,1,3,4,0,0,0,"","Serviço","Serviço","-","SINAPI",89753,"LUVA SIMPLES, PVC, SERIE NORMAL, ESGOTO PREDIAL, DN 50 MM, JUNTA ELÁSTICA, FORNECIDO E INSTALADO EM RAMAL DE DESCARGA OU RAMAL DE ESGOTO SANITÁRIO. AF_12/2014","UN",3,1,3,null,null,0,0,"Referência: AGETOP - 82002"]
["S",4,"S",0,12,1,3,4,0,0,0,"","Serviço","Serviço","-","SINAPI",89778,"LUVA SIMPLES, PVC, SERIE NORMAL, ESGOTO PREDIAL, DN 100 MM, JUNTA ELÁSTICA, FORNECIDO E INSTALADO EM RAMAL DE DESCARGA OU RAMAL DE ESGOTO SANITÁRIO. AF_12/2014","UN",3,1,3,null,null,0,0,"Referência: AGETOP - 82004"]
[4,4,4,4,12,1,3,5,0,4,{"$error":"#N/A"},"","Nível 4","Nível 4","-","SINAPI",null,"TUBOS","-",null,1,"-",null,null,0,0,""]
["S",4,"S",0,12,1,3,5,0,0,0,"","Serviço","Serviço","-","SINAPI",89711,"TUBO PVC, SERIE NORMAL, ESGOTO PREDIAL, DN 40 MM, FORNECIDO E INSTALADO EM RAMAL DE DESCARGA OU RAMAL DE ESGOTO SANITÁRIO. AF_12/2014","M",18,1,18,null,null,0,0,"Referência: AGETOP - 82301"]
["S",4,"S",0,12,1,3,5,0,0,0,"","Serviço","Serviço","-","SINAPI",89798,"TUBO PVC, SERIE NORMAL, ESGOTO PREDIAL, DN 50 MM, FORNECIDO E INSTALADO EM PRUMADA DE ESGOTO SANITÁRIO OU VENTILAÇÃO. AF_12/2014","M",18,1,18,null,null,0,0,""]
["S",4,"S",0,12,1,3,5,0,0,0,"","Serviço","Serviço","-","SINAPI",89800,"TUBO PVC, SERIE NORMAL, ESGOTO PREDIAL, DN 100 MM, FORNECIDO E INSTALADO EM PRUMADA DE ESGOTO SANITÁRIO OU VENTILAÇÃO. AF_12/2014","M",18,1,18,null,null,0,0,""]
[3,3,3,3,12,1,4,0,0,3,{"$error":"#N/A"},"","Nível 3","Nível 3","-","SINAPI",null,"EXTRAS","-",null,1,"-",null,null,0,0,""]
["S",3,"S",0,12,1,4,0,0,0,0,"","Serviço","Serviço","-","AGETOP",81825,"CAIXA DE PASSAGEM 60 X 60 CM SEM TAMPA","Un    ",2,1,2,null,null,0,0,""]
["S",3,"S",0,12,1,4,0,0,0,0,"","Serviço","Serviço","-","AGETOP",81826,"TAMPA EM CONCRETO ARMADO 25 MPA E=5CM PARA A CAIXA DE PASSAGEM 60X60CM","Un    ",2,1,2,null,null,0,0,""]
[2,2,2,4,12,2,0,0,0,4,51,"","Nível 2","Nível 2","-","SINAPI",null,"SERVIÇO EM TERRA","-",null,1,"-",null,null,0,0,""]
[3,3,3,3,12,2,1,0,0,3,{"$error":"#N/A"},"","Nível 3","Nível 3","-","SINAPI",null,"PISO SEM REVESTIMENTO (TERRA)","-",null,1,"-",null,null,0,0,""]
["S",3,"S",0,12,2,1,0,0,0,0,"","Serviço","Serviço","-","AGETOP",40101,"ESCAVACAO MANUAL DE VALAS < 1 MTS. (OBRAS CIVIS)","m3    ",1,1,1,null,null,0,0,""]
["S",3,"S",0,12,2,1,0,0,0,0,"","Serviço","Serviço","-","AGETOP",40902,"REATERRO COM APILOAMENTO","m3    ",1,1,1,null,null,0,0,""]
[1,1,1,55,13,0,0,0,0,55,{"$error":"#N/A"},"F","Nível 1","Nível 1","13.","AGETOP",null,"PROJETO DE PREVENÇÃO E COMBATE A INCÊNDIO","UN",1,1,1,null,null,0,0,""]
[2,2,2,44,13,1,0,0,0,54,44,"","Nível 2","Nível 2","-","AGETOP",null,"INSTALAÇÕES ESPECIAIS","-",null,1,"-",null,null,0,0,""]
[3,3,3,43,13,1,1,0,0,43,{"$error":"#N/A"},"","Nível 3","Nível 3","-","SINAPI",null,"INSTALAÇÕES DE INCENDIO","-",null,1,"-",null,null,0,0,""]
["S",3,"S",0,13,1,1,0,0,0,0,"","Serviço","Serviço","-","COMPOSIÇÃO","COMP 040_SEE","CONJUNTO MOTOR-BOMBA ELÉTRICA TRIFÁSICO 380/220 V PARA VZ= 24,33 M³/H, HM= 46,24 M POTÊNCIA= 7,5 CV","UN ",1,1,1,null,null,0,0,""]
["S",3,"S",0,13,1,1,0,0,0,0,"","Serviço","Serviço","-","AGETOP",81882,"RES.METALICO TAÇA AÇO PATINÁVEL-V=15M3-COL.SEC.H=6M+FUNDAÇÃO+LOGOTIPO","Un    ",1,1,1,null,null,0,0,""]
["S",3,"S",0,13,1,1,0,0,0,0,"","Serviço","Serviço","-","AGETOP",81889,"TORNEIRA BOIA DIAMETRO 1\" (25 MM )","Un    ",1,1,1,null,null,0,0,""]
["S",3,"S",0,13,1,1,0,0,0,0,"","Serviço","Serviço","-","AGETOP",71156,"CURVA DE 90 GRAUS AÇO GALVANIZADO DIAM. 2.1/2\"","Un    ",1,1,1,null,null,0,0,""]
["S",3,"S",0,13,1,1,0,0,0,0,"","Serviço","Serviço","-","AGETOP",80910,"REGISTRO DE GAVETA BRUTO DIAMETRO 2.1/2\"","Un    ",3,1,3,null,null,0,0,""]
["S",3,"S",0,13,1,1,0,0,0,0,"","Serviço","Serviço","-","AGETOP",82379,"TUBO FERRO GALVANIZADO DIAM.2.1/2\"","m     ",157,1,157,null,null,0,0,""]
["S",3,"S",0,13,1,1,0,0,0,0,"","Serviço","Serviço","-","AGETOP",81003,"TUBO SOLDAVEL PVC MARROM DIAMETRO 25 mm","M     ",18,1,18,null,null,0,0,""]
["S",3,"S",0,13,1,1,0,0,0,0,"","Serviço","Serviço","-","AGETOP",81321,"JOELHO 90 GRAUS SOLDAVEL DIAMETRO 25 MM","Un    ",8,1,8,null,null,0,0,""]
["S",3,"S",0,13,1,1,0,0,0,0,"","Serviço","Serviço","-","SINAPI",83635,"EXTINTOR INCENDIO TP PO QUIMICO 6KG - FORNECIMENTO E INSTALACAO","UN",1,1,1,null,null,0,0,""]
["S",3,"S",0,13,1,1,0,0,0,0,"","Serviço","Serviço","-","AGETOP",85006,"EXTINTOR MULTI USO EM PO A B C (6 KG) - CAPACIDADE EXTINTORA 3A 20BC","un    ",6,1,6,null,null,0,0,""]
["S",3,"S",0,13,1,1,0,0,0,0,"","Serviço","Serviço","-","AGETOP",85011,"CAIXA DE INCÊNDIO METÁLICA COM SUPORTE PARA MANGUEIRA, TAMPA E MURETA 17X60X90 CM C/PINTURA","Un    ",4,1,4,null,null,0,0,""]
["S",3,"S",0,13,1,1,0,0,0,0,"","Serviço","Serviço","-","AGETOP",85017,"MANGUEIRA DE INCÊNDIO D.I. = 38 MM TIPO 2 COMP. = 15 M","CJ    ",8,1,8,null,null,0,0,""]
["S",3,"S",0,13,1,1,0,0,0,0,"","Serviço","Serviço","-","AGETOP",85025,"ESGUICHO REGULÁVEL 1.1/2\"","Un    ",4,1,4,null,null,0,0,""]
["S",3,"S",0,13,1,1,0,0,0,0,"","Serviço","Serviço","-","AGETOP",85027,"ADAPTADOR P/ENGATE STORZ 2.1/2\" X 1.1/2\"","Un    ",5,1,5,null,null,0,0,""]
["S",3,"S",0,13,1,1,0,0,0,0,"","Serviço","Serviço","-","AGETOP",85031,"REGISTRO GLOBO ANGULAR 2.1/2\"","Un    ",4,1,4,null,null,0,0,""]
[{"$f":"CHOOSE(1+LOG(1+2*(ORÇAMENTO.Nivel=\"Nível 1\")+4*(ORÇAMENTO.Nivel=\"Nível 2\")+8*(ORÇAMENTO.Nivel=\"Nível 3\")+16*(ORÇAMENTO.Nivel=\"Nível 4\")+32*(ORÇAMENTO.Nivel=\"Serviço\"),2),0,1,2,3,4,\"S\")","v":"S"},3,"S",0,13,1,1,0,0,0,0,"","Serviço","Serviço","-","AGETOP",85035,"TAMPÃO CEGO COM CORRENTE 2.1/2\"","Un    ",1,1,1,null,null,0,0,""]
["S",3,"S",0,13,1,1,0,0,0,0,"","Serviço","Serviço","-","AGETOP",85037,"TANQUE DE PRESSÃO DE 10 L","Un    ",1,1,1,null,null,0,0,""]
["S",3,"S",0,13,1,1,0,0,0,0,"","Serviço","Serviço","-","COMPOSIÇÃO","COMP 078_SEE","TAMPÃO CEGO COM CORRENTE 1 1/2\"","UN ",4,1,4,null,null,0,0,""]
["S",3,"S",0,13,1,1,0,0,0,0,"","Serviço","Serviço","-","AGETOP",85039,"PRESSOSTATO 50 A 80 PSI","Un    ",1,1,1,null,null,0,0,""]
["S",3,"S",0,13,1,1,0,0,0,0,"","Serviço","Serviço","-","AGETOP",85041,"MANOMETRO - 0 A 10 KG/CM2","Un    ",1,1,1,null,null,0,0,""]
["S",3,"S",0,13,1,1,0,0,0,0,"","Serviço","Serviço","-","AGETOP",85047,"NIPLE DUPLO FERRO GALVANIZADO 2.1/2\"","Un    ",7,1,7,null,null,0,0,""]
["S",3,"S",0,13,1,1,0,0,0,0,"","Serviço","Serviço","-","SINAPI",92377,"NIPLE, EM FERRO GALVANIZADO, DN 65 (2 1/2\"), CONEXÃO ROSQUEADA, INSTALADO EM REDE DE ALIMENTAÇÃO PARA HIDRANTE - FORNECIMENTO E INSTALAÇÃO. AF_12/2015","UN",4,1,4,null,null,0,0,""]
["S",{"$f":"IF(OR(C380=\"s\",C380=0),OFFSET(B380,-1,0),C380)","v":3},{"$f":"IF(OFFSET(C380,-1,0)=\"L\",1,IF(OFFSET(C380,-1,0)=1,2,IF(OR(A380=\"s\",A380=0),\"S\",IF(AND(OFFSET(C380,-1,0)=2,A380=4),3,IF(AND(OR(OFFSET(C380,-1,0)=\"s\",OFFSET(C380,-1,0)=0),A380<>\"s\",A380>OFFSET(B380,-1,0)),OFFSET(B380,-1,0),A380)))))","v":"S"},{"$f":"IF(OR(C380=\"S\",C380=0),0,IF(ISERROR(K380),J380,SMALL(J380:K380,1)))","v":0},{"$f":"IF($C380=1,OFFSET(E380,-1,0)+1,OFFSET(E380,-1,0))","v":13},{"$f":"IF($C380=1,0,IF($C380=2,OFFSET(F380,-1,0)+1,OFFSET(F380,-1,0)))","v":1},{"$f":"IF(AND($C380<=2,$C380<>0),0,IF($C380=3,OFFSET(G380,-1,0)+1,OFFSET(G380,-1,0)))","v":1},{"$f":"IF(AND($C380<=3,$C380<>0),0,IF($C380=4,OFFSET(H380,-1,0)+1,OFFSET(H380,-1,0)))","v":0},{"$f":"IF(AND($C380<=4,$C380<>0),0,IF(AND($C380=\"S\",$Y380>0),OFFSET(I380,-1,0)+1,OFFSET(I380,-1,0)))","v":0},0,0,{"$f":"IF(OR(Y380>0,$C380=1),\"F\",\"\")","v":""},"Serviço",{"$f":"CHOOSE(1+LOG(1+2*(C380=1)+4*(C380=2)+8*(C380=3)+16*(C380=4)+32*(C380=\"S\"),2),\"\",\"Nível 1\",\"Nível 2\",\"Nível 3\",\"Nível 4\",\"Serviço\")","v":"Serviço"},"-","AGETOP",85077,"VÁLVULA DE RETENÇÃO HORIZONTAL 2.1/2\"","Un    ",2,1,2,null,null,0,0,""]
["S",3,"S",0,13,1,1,0,0,0,0,"","Serviço","Serviço","-","COMPOSIÇÃO","COMP 017_SEE","REDUCAO GIRATÓRIA TIPO STORZ LATAO P/ INST. PREDIAL COMBATE A INCENDIO ENGATE RAPIDO 2.1/2\" X 1.1/2\"","UN ",4,1,4,null,null,0,0,""]
["S",3,"S",0,13,1,1,0,0,0,0,"","Serviço","Serviço","-","COMPOSIÇÃO","COMP 018_SEE","CHAVE DUPLA P/ CONEXÕES TIPO STORZ EM LATÃO ENGATE RÁPIDO 1 1/2\" X 2 1/2\"","UN ",4,1,4,null,null,0,0,""]
["S",3,"S",0,13,1,1,0,0,0,0,"","Serviço","Serviço","-","COMPOSIÇÃO","COMP 087_SEE","REGISTRO DE GAVETA COM HASTE ASCENDENTE DE BRONZE 2 1/2\"","UN ",1,1,1,null,null,0,0,""]
["S",3,"S",0,13,1,1,0,0,0,0,"","Serviço","Serviço","-","AGETOP",85056,"TÊ DE FERRO GALVANIZADO 90º X 2 1/2\"","un    ",7,1,7,null,null,0,0,""]
["S",3,"S",0,13,1,1,0,0,0,0,"","Serviço","Serviço","-","COMPOSIÇÃO","COMP 030_SEE","COTOVELO DE FERRO GALV. 90° X 2 1/2\"","UN ",19,1,19,null,null,0,0,""]
["S",3,"S",0,13,1,1,0,0,0,0,"","Serviço","Serviço","-","COMPOSIÇÃO","COMP 077_SEE","UNIAO FERRO GALV C/ASSENTO CONICO BRONZE 2 1/2\"","UN ",4,1,4,null,null,0,0,""]
["S",3,"S",0,13,1,1,0,0,0,0,"","Serviço","Serviço","-","COMPOSIÇÃO","COMP 347_SEE","ADAPTADOR PVC SOLDAVEL, COM FLANGES LIVRES, 75 MM X 2 1/2\", PARA CAIXA D' AGUA","UN ",1,1,1,null,null,0,0,""]
["S",3,"S",0,13,1,1,0,0,0,0,"","Serviço","Serviço","-","COMPOSIÇÃO","COMP 022_SEE","TAMPÃO FOFO 40X50CM C/INSCRIÇÃO ","UN ",1,1,1,null,null,0,0,""]
["S",3,"S",0,13,1,1,0,0,0,0,"","Serviço","Serviço","-","COMPOSIÇÃO","COMP 546_SEE","BUJÃO DE REBORDO 2.1/2\"","UN ",1,1,1,null,null,0,0,""]
["S",3,"S",0,13,1,1,0,0,0,0,"","Serviço","Serviço","-","COMPOSIÇÃO","COMP 186_SEE","BOTOEIRA BOMBA DE INCÊNDIO C/ MARTELO CONVENCIONAL/ ANALÓGICA","UN ",4,1,4,null,null,0,0,""]
["S",3,"S",0,13,1,1,0,0,0,0,"","Serviço","Serviço","-","COMPOSIÇÃO","COMP 188_SEE","ACIONADOR MANUAL DE ALARME","UN ",1,1,1,null,null,0,0,""]
["S",3,"S",0,13,1,1,0,0,0,0,"","Serviço","Serviço","-","COMPOSIÇÃO","COMP 190_SEE","CENTRAL DE DETECÇÃO E ALARME DE 40 SETORES COM BATERIA","UN ",1,1,1,null,null,0,0,""]
["S",3,"S",0,13,1,1,0,0,0,0,"","Serviço","Serviço","-","AGETOP",72338,"SIRENE METALICA ALCANCE 500 M","Un    ",1,1,1,null,null,0,0,""]
["S",3,"S",0,13,1,1,0,0,0,0,"","Serviço","Serviço","-","SINAPI",97599,"LUMINÁRIA DE EMERGÊNCIA, COM 30 LÂMPADAS LED DE 2 W, SEM REATOR - FORNECIMENTO E INSTALAÇÃO. AF_02/2020","UN",11,1,11,null,null,0,0,""]
["S",3,"S",0,13,1,1,0,0,0,0,"","Serviço","Serviço","-","COMPOSIÇÃO","COMP 024_SEE","SINALIZADOR FOTOLUMINESCENTE PARA EXTINTOR","UN ",6,1,6,null,null,0,0,""]
["S",3,"S",0,13,1,1,0,0,0,0,"","Serviço","Serviço","-","COMPOSIÇÃO","COMP 025_SEE","SINALIZADOR FOTOLUMINESCENTE DE EMERGÊNCIA","UN ",10,1,10,null,null,0,0,""]
["S",3,"S",0,13,1,1,0,0,0,0,"","Serviço","Serviço","-","COMPOSIÇÃO","COMP 277_SEE","MARCAÇÃO NO PISO - 1X1 M PARA EXTINTOR","M2",6,1,6,null,null,0,0,""]
["S",3,"S",0,13,1,1,0,0,0,0,"","Serviço","Serviço","-","COMPOSIÇÃO","COMP 235_SEE","PLACA DE SINALIZAÇÃO EM PVC COD 01 - (300X300) PROIBIDO FUMAR","UN ",1,1,1,null,null,0,0,""]
["S",3,"S",0,13,1,1,0,0,0,0,"","Serviço","Serviço","-","COMPOSIÇÃO","COMP 236_SEE","PLACA DE SINALIZAÇÃO EM PVC COD 06 - (300X300) PERIGO INFLAMÁVEL","UN ",1,1,1,null,null,0,0,""]
[2,2,2,2,13,2,0,0,0,10,2,"","Nível 2","Nível 2","-","SINAPI",null,"SERVIÇOS PRELIMINARES","-",null,1,"-",null,null,0,0,""]
["S",2,"S",0,13,2,0,0,0,0,0,"","Serviço","Serviço","-","AGETOP",20121,"DEM. MANUAL EM CONCR.SIMPLES C/TR.ATE CB.E CARGA (O.C.)","m3    ",1,1,1,null,null,0,0,""]
[2,2,2,3,13,3,0,0,0,{"$f":"IF(OR($C402=\"S\",$C402=0),0,MATCH(0,OFFSET($D402,1,$C402,ROW($C$410)-ROW($C402)),0))","v":8},{"$f":"IF(OR($C402=\"S\",$C402=0),0,MATCH(OFFSET($D402,0,$C402)+1,OFFSET($D402,1,$C402,ROW($C$410)-ROW($C402)),0))","v":3},"","Nível 2","Nível 2","-","AGETOP",null,"TRANSPORTES","-",null,1,"-",null,null,0,0,""]
["S",2,"S",0,13,3,0,0,0,0,0,"","Serviço","Serviço","-","SINAPI",72900,"TRANSPORTE DE ENTULHO COM CAMINHAO BASCULANTE 6 M3, RODOVIA PAVIMENTADA, DMT 0,5 A 1,0 KM","M3",1,1,1,null,null,0,0,""]
["S",2,"S",0,13,3,0,0,0,0,0,"","Serviço","Serviço","-","SINAPI",72897,"CARGA MANUAL DE ENTULHO EM CAMINHAO BASCULANTE 6 M3","M3",1,1,1,null,null,0,0,""]
[2,2,2,3,13,4,0,0,0,5,3,"","Nível 2","Nível 2","-","SINAPI",null,"SERVIÇO EM TERRA","-",null,1,"-",null,null,0,0,""]
["S",2,"S",0,13,4,0,0,0,{"$f":"IF(OR($C406=\"S\",$C406=0),0,MATCH(0,OFFSET($D406,1,$C406,ROW($C$410)-ROW($C406)),0))","v":0},{"$f":"IF(OR($C406=\"S\",$C406=0),0,MATCH(OFFSET($D406,0,$C406)+1,OFFSET($D406,1,$C406,ROW($C$410)-ROW($C406)),0))","v":0},"","Serviço","Serviço","-","AGETOP",40101,"ESCAVACAO MANUAL DE VALAS < 1 MTS. (OBRAS CIVIS)","m3    ",13,1,13,null,null,0,0,""]
["S",2,"S",0,13,4,0,0,0,{"$f":"IF(OR($C407=\"S\",$C407=0),0,MATCH(0,OFFSET($D407,1,$C407,ROW($C$410)-ROW($C407)),0))","v":0},{"$f":"IF(OR($C407=\"S\",$C407=0),0,MATCH(OFFSET($D407,0,$C407)+1,OFFSET($D407,1,$C407,ROW($C$410)-ROW($C407)),0))","v":0},"","Serviço","Serviço","-","AGETOP",40902,"REATERRO COM APILOAMENTO","m3    ",13,1,13,null,null,0,0,""]
[{"$f":"CHOOSE(1+LOG(1+2*(ORÇAMENTO.Nivel=\"Nível 1\")+4*(ORÇAMENTO.Nivel=\"Nível 2\")+8*(ORÇAMENTO.Nivel=\"Nível 3\")+16*(ORÇAMENTO.Nivel=\"Nível 4\")+32*(ORÇAMENTO.Nivel=\"Serviço\"),2),0,1,2,3,4,\"S\")","v":2},{"$f":"IF(OR(C408=\"s\",C408=0),OFFSET(B408,-1,0),C408)","v":2},{"$f":"IF(OFFSET(C408,-1,0)=\"L\",1,IF(OFFSET(C408,-1,0)=1,2,IF(OR(A408=\"s\",A408=0),\"S\",IF(AND(OFFSET(C408,-1,0)=2,A408=4),3,IF(AND(OR(OFFSET(C408,-1,0)=\"s\",OFFSET(C408,-1,0)=0),A408<>\"s\",A408>OFFSET(B408,-1,0)),OFFSET(B408,-1,0),A408)))))","v":2},{"$f":"IF(OR(C408=\"S\",C408=0),0,IF(ISERROR(K408),J408,SMALL(J408:K408,1)))","v":2},{"$f":"IF($C408=1,OFFSET(E408,-1,0)+1,OFFSET(E408,-1,0))","v":13},{"$f":"IF($C408=1,0,IF($C408=2,OFFSET(F408,-1,0)+1,OFFSET(F408,-1,0)))","v":5},{"$f":"IF(AND($C408<=2,$C408<>0),0,IF($C408=3,OFFSET(G408,-1,0)+1,OFFSET(G408,-1,0)))","v":0},{"$f":"IF(AND($C408<=3,$C408<>0),0,IF($C408=4,OFFSET(H408,-1,0)+1,OFFSET(H408,-1,0)))","v":0},{"$f":"IF(AND($C408<=4,$C408<>0),0,IF(AND($C408=\"S\",$Y408>0),OFFSET(I408,-1,0)+1,OFFSET(I408,-1,0)))","v":0},{"$f":"IF(OR($C408=\"S\",$C408=0),0,MATCH(0,OFFSET($D408,1,$C408,ROW($C$410)-ROW($C408)),0))","v":2},{"$f":"IF(OR($C408=\"S\",$C408=0),0,MATCH(OFFSET($D408,0,$C408)+1,OFFSET($D408,1,$C408,ROW($C$410)-ROW($C408)),0))","v":{"$error":"#N/A"}},{"$f":"IF(OR(Y408>0,$C408=1),\"F\",\"\")","v":""},"Nível 2",{"$f":"CHOOSE(1+LOG(1+2*(C408=1)+4*(C408=2)+8*(C408=3)+16*(C408=4)+32*(C408=\"S\"),2),\"\",\"Nível 1\",\"Nível 2\",\"Nível 3\",\"Nível 4\",\"Serviço\")","v":"Nível 2"},"-","SINAPI",null,"REVESTIMENTO DE PISO","-",null,1,"-",null,null,0,0,""]
["S",2,"S",0,13,5,0,0,0,{"$f":"IF(OR($C409=\"S\",$C409=0),0,MATCH(0,OFFSET($D409,1,$C409,ROW($C$410)-ROW($C409)),0))","v":0},{"$f":"IF(OR($C409=\"S\",$C409=0),0,MATCH(OFFSET($D409,0,$C409)+1,OFFSET($D409,1,$C409,ROW($C$410)-ROW($C409)),0))","v":0},"","Serviço","Serviço","-","AGETOP",220102,"PISO CONCRETO DESEMPENADO ESPESSURA = 5 CM  1:2,5:3,5","m2    ",12,1,12,null,null,0,0,""]
[-1,null,-1,null,0,0,0,0,0,null,null,"F"]
[null,null,null,null,null,null,null,null,null,null,null,"F",null,null,null,null,null,"OBS: OS QUANTITATIVOS DE MATERIAIS  DAS INSTALAÇÕES HIDROSSANITÁRIAS, ELÉTRICAS E ESPECIAIS SÃO FORNECIDOS PELOS PROFISSIONAIS RESPONSÁVEIS PELOS RESPECTIVOS PROJETOS.",null,null,null,null,"VALOR TOTAL",null,null,0]
[null,null,null,null,null,null,null,null,null,null,null,"F",null,null,null,null,null,null,null,null,null,null,"VALOR BDI (20,34%)",null,null,0]
[null,null,null,null,null,null,null,null,null,null,null,"F",null,null,null,null,null,null,null,null,null,null,"TOTAL ORÇAMENTO",null,null,0]
[null,null,null,null,null,null,null,null,null,null,null,"F"]
[null,null,null,null,null,null,null,null,null,null,null,"F",null,null,null,null,null,null,null,null,null,null,"CUSTO POR M2 ³",null,null,0]
[null,null,null,null,null,null,null,null,null,null,null,"F",null,null,null,null,null,null,null,null,null,null,"MATERIAL S/ BDI",null,null,0]
[null,null,null,null,null,null,null,null,null,null,null,"F",null,null,null,null,null,null,null,null,null,null,"MÃO DE OBRA S/ BDI",null,null,0]
[null,null,null,null,null,null,null,null,null,null,null,"F"]
[null,null,null,null,null,null,null,null,null,null,null,"F",null,null,null,null,"(1) Conforme previsto pelo DECRETO Nº 7.983, DE 8 DE ABRIL DE 2013, os preços adotados são aqueles constantes dos sistemas de referência indicados. Justifica-se o uso dos preços destas composições de custos unitários devido ao seu valor ser menor à mediana de seus correspondentes na tabela SINAPI;"]
[null,null,null,null,null,null,null,null,null,null,null,"F",null,null,null,null,"(2) Optou-se pelo uso das composições de custos da AGETOP para itens não presentes na SINAPI;"]
[null,null,null,null,null,null,null,null,null,null,null,"F",null,null,null,null,"(3) Para itens da AGETOP, os vidros não estão inclusos nas esquadrias e já foram considerados os custos de contramarco para as esquadrias de alumínio;"]
[null,null,null,null,null,null,null,null,null,null,null,"F",null,null,null,null,"(4) Nos casos em que houver execução de granitina e omissão do item AGETOP 221102, considerou-se que o quantitativo para o rodapé, de altura igual a 7cm, foi incorporado na área de piso;"]
[null,null,null,null,null,null,null,null,null,null,null,"F",null,null,null,null,"(5) O custo unitário aproximado por metro quadrado é calculado dividindo-se o valor total do orçamento pela área total de construção."]
[null,null,null,null,null,null,null,null,null,null,null,"F"]
[null,null,null,null,null,null,null,null,null,null,null,"F"]
[]
[null,null,null,null,null,null,null,null,null,null,null,null,null,null,"SOMATÓRIO DE SERVIÇOS"]
[null,null,null,null,null,null,null,null,null,null,null,null,null,null,"ITEM","DESCRIÇÃO DOS SERVIÇOS",null,null,"PREÇO SEM BDI",null,null,null,null,"PREÇO COM BDI",null,null,"PARTICIPAÇÃO ( % )"]
[null,null,null,null,null,null,null,null,null,null,null,null,null,null,"a.","SERVIÇOS PRELIMINARES",null,null,{"$f":"SUMIF($R$19:$R$410,$P429,$Z$19:$Z$410)","v":0},null,null,null,null,{"$f":"ROUND(S429*(1+BDI.Taxa),2)","v":0},null,null,{"$f":"IFERROR(ROUND($X429*100/$Z$413,2),0)","v":0}]
[null,null,null,null,null,null,null,null,null,null,null,null,null,null,"b.","TRANSPORTES",null,null,0,null,null,null,null,0,null,null,0]
[null,null,null,null,null,null,null,null,null,null,null,null,null,null,"c.","SERVIÇO EM TERRA",null,null,0,null,null,null,null,0,null,null,0]
[null,null,null,null,null,null,null,null,null,null,null,null,null,null,"d.","FUNDAÇÕES E SONDAGENS",null,null,0,null,null,null,null,0,null,null,0]
[null,null,null,null,null,null,null,null,null,null,null,null,null,null,"e.","ESTRUTURA",null,null,0,null,null,null,null,0,null,null,0]
[null,null,null,null,null,null,null,null,null,null,null,null,null,null,"f.","INSTALAÇÕES ELÉTRICAS",null,null,0,null,null,null,null,0,null,null,0]
[null,null,null,null,null,null,null,null,null,null,null,null,null,null,"g.","INSTALAÇÕES HIDROSSANITÁRIAS",null,null,0,null,null,null,null,0,null,null,0]
[null,null,null,null,null,null,null,null,null,null,null,null,null,null,"h","INSTALAÇÕES ESPECIAIS",null,null,0,null,null,null,null,0,null,null,0]
[null,null,null,null,null,null,null,null,null,null,null,null,null,null,"i.","ALVENARIAS E DIVISÓRIAS",null,null,0,null,null,null,null,0,null,null,0]
[null,null,null,null,null,null,null,null,null,null,null,null,null,null,"j.","ALVENARIA AUTO-PORTANTE",null,null,0,null,null,null,null,0,null,null,0]
[null,null,null,null,null,null,null,null,null,null,null,null,null,null,"k.","IMPERMEABILIZAÇÃO",null,null,0,null,null,null,null,0,null,null,0]
[null,null,null,null,null,null,null,null,null,null,null,null,null,null,"l.","ISOLAMENTO TÉRMICO E ACÚSTICO",null,null,0,null,null,null,null,0,null,null,0]
[null,null,null,null,null,null,null,null,null,null,null,null,null,null,"m.","ESTRUTURA DE MADEIRA",null,null,0,null,null,null,null,0,null,null,0]
[null,null,null,null,null,null,null,null,null,null,null,null,null,null,"n.","ESTRUTURAS METÁLICAS",null,null,0,null,null,null,null,0,null,null,0]
[null,null,null,null,null,null,null,null,null,null,null,null,null,null,"o.","COBERTURAS",null,null,0,null,null,null,null,0,null,null,0]
[null,null,null,null,null,null,null,null,null,null,null,null,null,null,"p.","ESQUADRIAS DE MADEIRA",null,null,0,null,null,null,null,0,null,null,0]
[null,null,null,null,null,null,null,null,null,null,null,null,null,null,"q.","ESQUADRIAS METÁLICAS",null,null,0,null,null,null,null,{"$f":"ROUND(S445*(1+BDI.Taxa),2)","v":0},null,null,0]
[null,null,null,null,null,null,null,null,null,null,null,null,null,null,"r.","VIDROS",null,null,0,null,null,null,null,0,null,null,0]
[null,null,null,null,null,null,null,null,null,null,null,null,null,null,"s.","REVESTIMENTO DE PAREDE",null,null,0,null,null,null,null,0,null,null,0]
[null,null,null,null,null,null,null,null,null,null,null,null,null,null,"t.","FORROS",null,null,0,null,null,null,null,0,null,null,0]
[null,null,null,null,null,null,null,null,null,null,null,null,null,null,"u.","REVESTIMENTO DE PISO",null,null,0,null,null,null,null,0,null,null,0]
[null,null,null,null,null,null,null,null,null,null,null,null,null,null,"v.","FERRAGENS",null,null,0,null,null,null,null,0,null,null,0]
[null,null,null,null,null,null,null,null,null,null,null,null,null,null,"w.","MARCENARIA",null,null,0,null,null,null,null,0,null,null,0]
[null,null,null,null,null,null,null,null,null,null,null,null,null,null,"x.","ADMINISTRAÇÃO",null,null,0,null,null,null,null,0,null,null,0]
[null,null,null,null,null,null,null,null,null,null,null,null,null,null,"y.","PINTURA",null,null,0,null,null,null,null,{"$f":"ROUND(S453*(1+BDI.Taxa),2)","v":0},null,null,0]
[null,null,null,null,null,null,null,null,null,null,null,null,null,null,"z.","DIVERSOS",null,null,0,null,null,null,null,{"$f":"IF(S454>0,IF((SUM(X429:Y453)+ROUND(S454*(1+BDI.Taxa),2))<>X456,X456-SUM(X429:Y453),ROUND(S454*(1+BDI.Taxa),2)),0)","v":0},null,null,{"$f":"IF(S454>0,IF((SUM(AA429:AA453)+IFERROR(ROUND($X454*100/$Z$413,2),0))<>AA456,AA456-SUM(AA429:AA453),IFERROR(ROUND($X454*100/$Z$413,2),0)),0)","v":0}]
[null,null,null,null,null,null,null,null,null,null,null,null,null,null,"TOTAL GERAL DO ORÇAMENTO (R$)",null,null,null,{"$f":"SUM(S429:W454)","v":0},null,null,null,null,{"$f":"SUM(X429:Y454)","v":0},null,null,{"$f":"SUM(AA429:AA454)","v":0}]
[null,null,null,null,null,null,null,null,null,null,null,null,null,null,null,null,null,null,{"$f":"$Z$411","v":0},null,null,null,null,{"$f":"$Z$413","v":0},null,null,100]
[null,null,null,null,null,null,null,null,null,null,null,null,null,null,null,null,null,null,"(TOTAL SEM BDI)",null,null,null,null,"(TOTAL COM BDI)",null,null,"(ARRED porcentagem)"]
[null,null,null,null,null,null,null,null,null,null,null,null,null,null,null,null,null,null,{"$f":"IF(AND(S455=S456,S455>0),\"OK\",\"ERRO\")","v":"ERRO"},null,null,null,null,{"$f":"IF(AND(X455=X456,X455>0),\"OK\",\"ERRO\")","v":"ERRO"},null,null,{"$f":"IF(AA455=100,\"OK\",\"ERRO\")","v":"ERRO"}]
[]
[]
[null,null,null,null,null,null,null,null,null,null,null,null,null,null,"RESUMO GERAL DO ORÇAMENTO"]
[null,null,null,null,null,null,null,null,null,null,null,null,null,null,"ITEM","DESCRIÇÃO DOS SERVIÇOS",null,null,"PREÇO SEM BDI",null,null,null,null,"PREÇO COM BDI",null,null,"PARTICIPAÇÃO ( % )"]
[null,null,null,null,null,null,null,null,null,null,null,null,null,null,"1.",{"$f":"IFERROR(VLOOKUP(O463,$O$19:$Y$410,4,FALSE),\"\")","v":"ACESSIBILIDADE"},null,null,{"$f":"IF(P464=\"\",$S$484-SUM(OFFSET($S$462:S462,0,0,COUNTA($S$462:S462),1)),SUMIF($R$19:$R$410,$P463,$Z$19:$Z$410))","v":0},null,null,null,null,{"$f":"IF(P464=\"\",$X$484-SUM(OFFSET($X$462:X462,0,0,COUNTA($X$462:X462),1)),ROUND(S463*(1+BDI.Taxa),2))","v":0},null,null,{"$f":"IF(P464=\"\",$AA$484-SUM(OFFSET($AA$462:AA462,0,0,COUNTA($AA$462:AA462),1)),ROUND(X463*100/ORÇAMENTO.TotalOrçamento,2))","v":{"$error":"#DIV/0!"}}]
[null,null,null,null,null,null,null,null,null,null,null,null,null,null,"2.","COBERTURA ENTRADA",null,null,{"$f":"IF(P465=\"\",$S$484-SUM(OFFSET($S$462:S463,0,0,COUNTA($S$462:S463),1)),SUMIF($R$19:$R$410,$P464,$Z$19:$Z$410))","v":0},null,null,null,null,{"$f":"IF(P465=\"\",$X$484-SUM(OFFSET($X$462:X463,0,0,COUNTA($X$462:X463),1)),ROUND(S464*(1+BDI.Taxa),2))","v":0},null,null,{"$f":"IF(P465=\"\",$AA$484-SUM(OFFSET($AA$462:AA463,0,0,COUNTA($AA$462:AA463),1)),ROUND(X464*100/ORÇAMENTO.TotalOrçamento,2))","v":{"$error":"#DIV/0!"}}]
[null,null,null,null,null,null,null,null,null,null,null,null,null,null,"3.","REFORMA BANHEIRO MASCULINO",null,null,{"$f":"IF(P466=\"\",$S$484-SUM(OFFSET($S$462:S464,0,0,COUNTA($S$462:S464),1)),SUMIF($R$19:$R$410,$P465,$Z$19:$Z$410))","v":0},null,null,null,null,{"$f":"IF(P466=\"\",$X$484-SUM(OFFSET($X$462:X464,0,0,COUNTA($X$462:X464),1)),ROUND(S465*(1+BDI.Taxa),2))","v":0},null,null,{"$f":"IF(P466=\"\",$AA$484-SUM(OFFSET($AA$462:AA464,0,0,COUNTA($AA$462:AA464),1)),ROUND(X465*100/ORÇAMENTO.TotalOrçamento,2))","v":{"$error":"#DIV/0!"}}]
[null,null,null,null,null,null,null,null,null,null,null,null,null,null,"4.","REFORMA BANHEIRO FEMININO",null,null,{"$f":"IF(P467=\"\",$S$484-SUM(OFFSET($S$462:S465,0,0,COUNTA($S$462:S465),1)),SUMIF($R$19:$R$410,$P466,$Z$19:$Z$410))","v":0},null,null,null,null,{"$f":"IF(P467=\"\",$X$484-SUM(OFFSET($X$462:X465,0,0,COUNTA($X$462:X465),1)),ROUND(S466*(1+BDI.Taxa),2))","v":0},null,null,{"$f":"IF(P467=\"\",$AA$484-SUM(OFFSET($AA$462:AA465,0,0,COUNTA($AA$462:AA465),1)),ROUND(X466*100/ORÇAMENTO.TotalOrçamento,2))","v":{"$error":"#DIV/0!"}}]
[null,null,null,null,null,null,null,null,null,null,null,null,null,null,"5.","REFORMA COBERTURA BLOCO A",null,null,{"$f":"IF(P468=\"\",$S$484-SUM(OFFSET($S$462:S466,0,0,COUNTA($S$462:S466),1)),SUMIF($R$19:$R$410,$P467,$Z$19:$Z$410))","v":0},null,null,null,null,{"$f":"IF(P468=\"\",$X$484-SUM(OFFSET($X$462:X466,0,0,COUNTA($X$462:X466),1)),ROUND(S467*(1+BDI.Taxa),2))","v":0},null,null,{"$f":"IF(P468=\"\",$AA$484-SUM(OFFSET($AA$462:AA466,0,0,COUNTA($AA$462:AA466),1)),ROUND(X467*100/ORÇAMENTO.TotalOrçamento,2))","v":{"$error":"#DIV/0!"}}]
[null,null,null,null,null,null,null,null,null,null,null,null,null,null,"6.","REFORMA PÁTIO COBERTO",null,null,{"$f":"IF(P469=\"\",$S$484-SUM(OFFSET($S$462:S467,0,0,COUNTA($S$462:S467),1)),SUMIF($R$19:$R$410,$P468,$Z$19:$Z$410))","v":0},null,null,null,null,{"$f":"IF(P469=\"\",$X$484-SUM(OFFSET($X$462:X467,0,0,COUNTA($X$462:X467),1)),ROUND(S468*(1+BDI.Taxa),2))","v":0},null,null,{"$f":"IF(P469=\"\",$AA$484-SUM(OFFSET($AA$462:AA467,0,0,COUNTA($AA$462:AA467),1)),ROUND(X468*100/ORÇAMENTO.TotalOrçamento,2))","v":{"$error":"#DIV/0!"}}]
[null,null,null,null,null,null,null,null,null,null,null,null,null,null,"7.","ADMINISTRAÇÃO LOCAL",null,null,{"$f":"IF(P470=\"\",$S$484-SUM(OFFSET($S$462:S468,0,0,COUNTA($S$462:S468),1)),SUMIF($R$19:$R$410,$P469,$Z$19:$Z$410))","v":0},null,null,null,null,{"$f":"IF(P470=\"\",$X$484-SUM(OFFSET($X$462:X468,0,0,COUNTA($X$462:X468),1)),ROUND(S469*(1+BDI.Taxa),2))","v":0},null,null,{"$f":"IF(P470=\"\",$AA$484-SUM(OFFSET($AA$462:AA468,0,0,COUNTA($AA$462:AA468),1)),ROUND(X469*100/ORÇAMENTO.TotalOrçamento,2))","v":{"$error":"#DIV/0!"}}]
[null,null,null,null,null,null,null,null,null,null,null,null,null,null,"8.","OBRA",null,null,{"$f":"IF(P471=\"\",$S$484-SUM(OFFSET($S$462:S469,0,0,COUNTA($S$462:S469),1)),SUMIF($R$19:$R$410,$P470,$Z$19:$Z$410))","v":0},null,null,null,null,{"$f":"IF(P471=\"\",$X$484-SUM(OFFSET($X$462:X469,0,0,COUNTA($X$462:X469),1)),ROUND(S470*(1+BDI.Taxa),2))","v":0},null,null,{"$f":"IF(P471=\"\",$AA$484-SUM(OFFSET($AA$462:AA469,0,0,COUNTA($AA$462:AA469),1)),ROUND(X470*100/ORÇAMENTO.TotalOrçamento,2))","v":{"$error":"#DIV/0!"}}]
[null,null,null,null,null,null,null,null,null,null,null,null,null,null,"9.","PROJETO ELÉTRICO",null,null,{"$f":"IF(P472=\"\",$S$484-SUM(OFFSET($S$462:S470,0,0,COUNTA($S$462:S470),1)),SUMIF($R$19:$R$410,$P471,$Z$19:$Z$410))","v":0},null,null,null,null,{"$f":"IF(P472=\"\",$X$484-SUM(OFFSET($X$462:X470,0,0,COUNTA($X$462:X470),1)),ROUND(S471*(1+BDI.Taxa),2))","v":0},null,null,{"$f":"IF(P472=\"\",$AA$484-SUM(OFFSET($AA$462:AA470,0,0,COUNTA($AA$462:AA470),1)),ROUND(X471*100/ORÇAMENTO.TotalOrçamento,2))","v":{"$error":"#DIV/0!"}}]
[null,null,null,null,null,null,null,null,null,null,null,null,null,null,"10.","PROJETO ESTRUTURAL",null,null,{"$f":"IF(P473=\"\",$S$484-SUM(OFFSET($S$462:S471,0,0,COUNTA($S$462:S471),1)),SUMIF($R$19:$R$410,$P472,$Z$19:$Z$410))","v":0},null,null,null,null,{"$f":"IF(P473=\"\",$X$484-SUM(OFFSET($X$462:X471,0,0,COUNTA($X$462:X471),1)),ROUND(S472*(1+BDI.Taxa),2))","v":0},null,null,{"$f":"IF(P473=\"\",$AA$484-SUM(OFFSET($AA$462:AA471,0,0,COUNTA($AA$462:AA471),1)),ROUND(X472*100/ORÇAMENTO.TotalOrçamento,2))","v":{"$error":"#DIV/0!"}}]
[null,null,null,null,null,null,null,null,null,null,null,null,null,null,"11.","PROJETO ESTRUTURAS METÁLICAS",null,null,{"$f":"IF(P474=\"\",$S$484-SUM(OFFSET($S$462:S472,0,0,COUNTA($S$462:S472),1)),SUMIF($R$19:$R$410,$P473,$Z$19:$Z$410))","v":0},null,null,null,null,{"$f":"IF(P474=\"\",$X$484-SUM(OFFSET($X$462:X472,0,0,COUNTA($X$462:X472),1)),ROUND(S473*(1+BDI.Taxa),2))","v":0},null,null,{"$f":"IF(P474=\"\",$AA$484-SUM(OFFSET($AA$462:AA472,0,0,COUNTA($AA$462:AA472),1)),ROUND(X473*100/ORÇAMENTO.TotalOrçamento,2))","v":{"$error":"#DIV/0!"}}]
[null,null,null,null,null,null,null,null,null,null,null,null,null,null,"12.","PROJETO HIDROSSANITÁRIO",null,null,{"$f":"IF(P475=\"\",$S$484-SUM(OFFSET($S$462:S473,0,0,COUNTA($S$462:S473),1)),SUMIF($R$19:$R$410,$P474,$Z$19:$Z$410))","v":0},null,null,null,null,{"$f":"IF(P475=\"\",$X$484-SUM(OFFSET($X$462:X473,0,0,COUNTA($X$462:X473),1)),ROUND(S474*(1+BDI.Taxa),2))","v":0},null,null,{"$f":"IF(P475=\"\",$AA$484-SUM(OFFSET($AA$462:AA473,0,0,COUNTA($AA$462:AA473),1)),ROUND(X474*100/ORÇAMENTO.TotalOrçamento,2))","v":{"$error":"#DIV/0!"}}]
[null,null,null,null,null,null,null,null,null,null,null,null,null,null,"13.","PROJETO DE PREVENÇÃO E COMBATE A INCÊNDIO",null,null,{"$f":"IF(P476=\"\",$S$484-SUM(OFFSET($S$462:S474,0,0,COUNTA($S$462:S474),1)),SUMIF($R$19:$R$410,$P475,$Z$19:$Z$410))","v":0},null,null,null,null,{"$f":"IF(P476=\"\",$X$484-SUM(OFFSET($X$462:X474,0,0,COUNTA($X$462:X474),1)),ROUND(S475*(1+BDI.Taxa),2))","v":0},null,null,{"$f":"IF(P476=\"\",$AA$484-SUM(OFFSET($AA$462:AA474,0,0,COUNTA($AA$462:AA474),1)),ROUND(X475*100/ORÇAMENTO.TotalOrçamento,2))","v":{"$error":"#DIV/0!"}}]
[null,null,null,null,null,null,null,null,null,null,null,null,null,null,"14.","",null,null,{"$f":"IF(P477=\"\",$S$484-SUM(OFFSET($S$462:S475,0,0,COUNTA($S$462:S475),1)),SUMIF($R$19:$R$410,$P476,$Z$19:$Z$410))","v":0},null,null,null,null,{"$f":"IF(P477=\"\",$X$484-SUM(OFFSET($X$462:X475,0,0,COUNTA($X$462:X475),1)),ROUND(S476*(1+BDI.Taxa),2))","v":0},null,null,{"$f":"IF(P477=\"\",$AA$484-SUM(OFFSET($AA$462:AA475,0,0,COUNTA($AA$462:AA475),1)),ROUND(X476*100/ORÇAMENTO.TotalOrçamento,2))","v":{"$error":"#DIV/0!"}}]
[null,null,null,null,null,null,null,null,null,null,null,null,null,null,"15.","",null,null,{"$f":"IF(P478=\"\",$S$484-SUM(OFFSET($S$462:S476,0,0,COUNTA($S$462:S476),1)),SUMIF($R$19:$R$410,$P477,$Z$19:$Z$410))","v":0},null,null,null,null,{"$f":"IF(P478=\"\",$X$484-SUM(OFFSET($X$462:X476,0,0,COUNTA($X$462:X476),1)),ROUND(S477*(1+BDI.Taxa),2))","v":0},null,null,{"$f":"IF(P478=\"\",$AA$484-SUM(OFFSET($AA$462:AA476,0,0,COUNTA($AA$462:AA476),1)),ROUND(X477*100/ORÇAMENTO.TotalOrçamento,2))","v":{"$error":"#DIV/0!"}}]
[null,null,null,null,null,null,null,null,null,null,null,null,null,null,"16.","",null,null,{"$f":"IF(P479=\"\",$S$484-SUM(OFFSET($S$462:S477,0,0,COUNTA($S$462:S477),1)),SUMIF($R$19:$R$410,$P478,$Z$19:$Z$410))","v":0},null,null,null,null,{"$f":"IF(P479=\"\",$X$484-SUM(OFFSET($X$462:X477,0,0,COUNTA($X$462:X477),1)),ROUND(S478*(1+BDI.Taxa),2))","v":0},null,null,{"$f":"IF(P479=\"\",$AA$484-SUM(OFFSET($AA$462:AA477,0,0,COUNTA($AA$462:AA477),1)),ROUND(X478*100/ORÇAMENTO.TotalOrçamento,2))","v":{"$error":"#DIV/0!"}}]
[null,null,null,null,null,null,null,null,null,null,null,null,null,null,"17.","",null,null,{"$f":"IF(P480=\"\",$S$484-SUM(OFFSET($S$462:S478,0,0,COUNTA($S$462:S478),1)),SUMIF($R$19:$R$410,$P479,$Z$19:$Z$410))","v":0},null,null,null,null,{"$f":"IF(P480=\"\",$X$484-SUM(OFFSET($X$462:X478,0,0,COUNTA($X$462:X478),1)),ROUND(S479*(1+BDI.Taxa),2))","v":0},null,null,{"$f":"IF(P480=\"\",$AA$484-SUM(OFFSET($AA$462:AA478,0,0,COUNTA($AA$462:AA478),1)),ROUND(X479*100/ORÇAMENTO.TotalOrçamento,2))","v":{"$error":"#DIV/0!"}}]
[null,null,null,null,null,null,null,null,null,null,null,null,null,null,"18.","",null,null,{"$f":"IF(P481=\"\",$S$484-SUM(OFFSET($S$462:S479,0,0,COUNTA($S$462:S479),1)),SUMIF($R$19:$R$410,$P480,$Z$19:$Z$410))","v":0},null,null,null,null,{"$f":"IF(P481=\"\",$X$484-SUM(OFFSET($X$462:X479,0,0,COUNTA($X$462:X479),1)),ROUND(S480*(1+BDI.Taxa),2))","v":0},null,null,{"$f":"IF(P481=\"\",$AA$484-SUM(OFFSET($AA$462:AA479,0,0,COUNTA($AA$462:AA479),1)),ROUND(X480*100/ORÇAMENTO.TotalOrçamento,2))","v":{"$error":"#DIV/0!"}}]
[null,null,null,null,null,null,null,null,null,null,null,null,null,null,"19.","",null,null,{"$f":"IF(P482=\"\",$S$484-SUM(OFFSET($S$462:S480,0,0,COUNTA($S$462:S480),1)),SUMIF($R$19:$R$410,$P481,$Z$19:$Z$410))","v":0},null,null,null,null,{"$f":"IF(P482=\"\",$X$484-SUM(OFFSET($X$462:X480,0,0,COUNTA($X$462:X480),1)),ROUND(S481*(1+BDI.Taxa),2))","v":0},null,null,{"$f":"IF(P482=\"\",$AA$484-SUM(OFFSET($AA$462:AA480,0,0,COUNTA($AA$462:AA480),1)),ROUND(X481*100/ORÇAMENTO.TotalOrçamento,2))","v":{"$error":"#DIV/0!"}}]
[null,null,null,null,null,null,null,null,null,null,null,null,null,null,"20.","",null,null,{"$f":"IF(P483=\"\",$S$484-SUM(OFFSET($S$462:S481,0,0,COUNTA($S$462:S481),1)),SUMIF($R$19:$R$410,$P482,$Z$19:$Z$410))","v":0},null,null,null,null,{"$f":"IF(P483=\"\",$X$484-SUM(OFFSET($X$462:X481,0,0,COUNTA($X$462:X481),1)),ROUND(S482*(1+BDI.Taxa),2))","v":0},null,null,{"$f":"IF(P483=\"\",$AA$484-SUM(OFFSET($AA$462:AA481,0,0,COUNTA($AA$462:AA481),1)),ROUND(X482*100/ORÇAMENTO.TotalOrçamento,2))","v":{"$error":"#DIV/0!"}}]
[null,null,null,null,null,null,null,null,null,null,null,null,null,null,"TOTAL GERAL DO ORÇAMENTO (R$)",null,null,null,{"$f":"SUM(S463:W482)","v":0},null,null,null,null,{"$f":"SUM(X463:Y482)","v":0},null,null,{"$f":"SUM(AA463:AA482)","v":{"$error":"#DIV/0!"}}]
[null,null,null,null,null,null,null,null,null,null,null,null,null,null,null,null,null,null,{"$f":"$Z$411","v":0},null,null,null,null,{"$f":"$Z$413","v":0},null,null,100]
[null,null,null,null,null,null,null,null,null,null,null,null,null,null,null,null,null,null,"(TOTAL SEM BDI)",null,null,null,null,"(TOTAL COM BDI)",null,null,"(ARRED porcentagem)"]
[null,null,null,null,null,null,null,null,null,null,null,null,null,null,null,null,null,null,{"$f":"IF(AND(S483=S484,S483>0),\"OK\",\"ERRO\")","v":"ERRO"},null,null,null,null,{"$f":"IF(AND(X483=X484,X483>0),\"OK\",\"ERRO\")","v":"ERRO"},null,null,{"$f":"IF(AND(AA483=100,S463<>0),\"OK\",\"ERRO\")","v":{"$error":"#DIV/0!"}}]

{"sheet":"Resumo ","index":1,"n_rows":39,"n_cols":9,"rows_kept":39,"cut":false,"hidden":false,"merged":[[13,0,14,0],[15,2,15,5],[16,2,16,5],[17,2,17,5],[18,2,18,5],[14,1,14,8],[0,1,0,8],[36,1,36,5],[2,1,2,5],[3,1,3,5],[5,1,5,5],[6,1,6,5],[8,1,8,5],[9,1,9,5],[11,3,11,5],[12,3,12,5],[10,1,10,8],[11,6,11,8],[12,6,12,8],[19,2,19,5],[20,2,20,5],[21,2,21,5],[31,2,31,5],[1,1,1,8],[2,6,2,8],[3,6,3,8],[4,1,4,8],[5,6,5,8],[6,6,6,8],[7,1,7,8],[8,6,8,8],[9,6,9,8],[13,1,13,8],[11,1,11,2],[12,1,12,2],[42,3,42,7],[41,3,41,7],[38,1,38,8],[22,2,22,5],[23,2,23,5],[24,2,24,5],[25,2,25,5],[26,2,26,5],[32,2,32,5],[33,2,33,5],[34,2,34,5],[35,2,35,5],[27,2,27,5],[28,2,28,5],[29,2,29,5],[30,2,30,5]]}
[]
[]
[null,"UNIDADE ESCOLAR",null,null,null,null,"CÓDIGO INEP"]
[null,{"$f":"Orçamento!$O$4","v":"CENTRO DE ENSINO EM PERÍODO INTEGRAL VISCONDE DE MAUÁ"},null,null,null,null,{"$f":"Orçamento!X4","v":52035662}]
[]
[null,"OBRA",null,null,null,null,"CIDADE"]
[null,{"$f":"Orçamento!$O$7","v":"AMPLIAÇÃO E REFORMA"},null,null,null,null,{"$f":"Orçamento!$X$7","v":"GOIÂNIA"}]
[]
[null,"ENDEREÇO",null,null,null,null,"CRE"]
[null,{"$f":"Orçamento!$R$10","v":" RUA 1016 COM RUA 1007 S/N , SETOR PEDRO LUDOVICO , CEP:74820-290"},null,null,null,null,{"$f":"Orçamento!$O$10","v":"CRE-GOIÂNIA"}]
[]
[null,"REFERÊNCIA",null,"DATA",null,null,"ÁREA TOTAL CONSTRUÍDA (M²)"]
[null,{"$f":"CONCATENATE(\"AGETOP E SINAPI - \",Orçamento!$T$10)","v":"AGETOP E SINAPI - ONERADA"},null,{"$f":"Orçamento!$S$7","v":"2020-07-28"},null,null,{"$f":"Orçamento!$X$13","v":1828.8}]
["FILTRO"]
[null,"RESUMO GERAL DO ORÇAMENTO"]
["↓","ITEM","DESCRIÇÃO DOS SERVIÇOS",null,null,null,"PREÇO SEM BDI","PREÇO COM BDI","PARTICIP. (%)"]
[{"$f":"IF(G17>0,\"F\",\"\")","v":""},"1.",{"$f":"Orçamento!$P463","v":"ACESSIBILIDADE"},null,null,null,{"$f":"IFERROR(Orçamento!S463,\"-\")","v":0},{"$f":"IFERROR(Orçamento!X463,\"\")","v":0},{"$f":"Orçamento!AA463","v":{"$error":"#DIV/0!"}}]
[{"$f":"IF(G18>0,\"F\",\"\")","v":""},"2.",{"$f":"Orçamento!$P464","v":"COBERTURA ENTRADA"},null,null,null,{"$f":"IFERROR(Orçamento!S464,\"-\")","v":0},{"$f":"IFERROR(Orçamento!X464,\"\")","v":0},{"$f":"Orçamento!AA464","v":{"$error":"#DIV/0!"}}]
["","3.",{"$f":"Orçamento!$P465","v":"REFORMA BANHEIRO MASCULINO"},null,null,null,{"$f":"IFERROR(Orçamento!S465,\"-\")","v":0},{"$f":"IFERROR(Orçamento!X465,\"\")","v":0},{"$f":"Orçamento!AA465","v":{"$error":"#DIV/0!"}}]
["","4.",{"$f":"Orçamento!$P466","v":"REFORMA BANHEIRO FEMININO"},null,null,null,{"$f":"IFERROR(Orçamento!S466,\"-\")","v":0},{"$f":"IFERROR(Orçamento!X466,\"\")","v":0},{"$f":"Orçamento!AA466","v":{"$error":"#DIV/0!"}}]
["","5.",{"$f":"Orçamento!$P467","v":"REFORMA COBERTURA BLOCO A"},null,null,null,{"$f":"IFERROR(Orçamento!S467,\"-\")","v":0},{"$f":"IFERROR(Orçamento!X467,\"\")","v":0},{"$f":"Orçamento!AA467","v":{"$error":"#DIV/0!"}}]
["","6.",{"$f":"Orçamento!$P468","v":"REFORMA PÁTIO COBERTO"},null,null,null,{"$f":"IFERROR(Orçamento!S468,\"-\")","v":0},{"$f":"IFERROR(Orçamento!X468,\"\")","v":0},{"$f":"Orçamento!AA468","v":{"$error":"#DIV/0!"}}]
["","7.",{"$f":"Orçamento!$P469","v":"ADMINISTRAÇÃO LOCAL"},null,null,null,{"$f":"IFERROR(Orçamento!S469,\"-\")","v":0},{"$f":"IFERROR(Orçamento!X469,\"\")","v":0},{"$f":"Orçamento!AA469","v":{"$error":"#DIV/0!"}}]
["","8.",{"$f":"Orçamento!$P470","v":"OBRA"},null,null,null,{"$f":"IFERROR(Orçamento!S470,\"-\")","v":0},{"$f":"IFERROR(Orçamento!X470,\"\")","v":0},{"$f":"Orçamento!AA470","v":{"$error":"#DIV/0!"}}]
["","9.",{"$f":"Orçamento!$P471","v":"PROJETO ELÉTRICO"},null,null,null,{"$f":"IFERROR(Orçamento!S471,\"-\")","v":0},{"$f":"IFERROR(Orçamento!X471,\"\")","v":0},{"$f":"Orçamento!AA471","v":{"$error":"#DIV/0!"}}]
["","10.",{"$f":"Orçamento!$P472","v":"PROJETO ESTRUTURAL"},null,null,null,{"$f":"IFERROR(Orçamento!S472,\"-\")","v":0},{"$f":"IFERROR(Orçamento!X472,\"\")","v":0},{"$f":"Orçamento!AA472","v":{"$error":"#DIV/0!"}}]
["","11.",{"$f":"Orçamento!$P473","v":"PROJETO ESTRUTURAS METÁLICAS"},null,null,null,{"$f":"IFERROR(Orçamento!S473,\"-\")","v":0},{"$f":"IFERROR(Orçamento!X473,\"\")","v":0},{"$f":"Orçamento!AA473","v":{"$error":"#DIV/0!"}}]
["","12.",{"$f":"Orçamento!$P474","v":"PROJETO HIDROSSANITÁRIO"},null,null,null,{"$f":"IFERROR(Orçamento!S474,\"-\")","v":0},{"$f":"IFERROR(Orçamento!X474,\"\")","v":0},{"$f":"Orçamento!AA474","v":{"$error":"#DIV/0!"}}]
["","13.",{"$f":"Orçamento!$P475","v":"PROJETO DE PREVENÇÃO E COMBATE A INCÊNDIO"},null,null,null,{"$f":"IFERROR(Orçamento!S475,\"-\")","v":0},{"$f":"IFERROR(Orçamento!X475,\"\")","v":0},{"$f":"Orçamento!AA475","v":{"$error":"#DIV/0!"}}]
["","14.",{"$f":"Orçamento!$P476","v":""},null,null,null,{"$f":"IFERROR(Orçamento!S476,\"-\")","v":0},{"$f":"IFERROR(Orçamento!X476,\"\")","v":0},{"$f":"Orçamento!AA476","v":{"$error":"#DIV/0!"}}]
["","15.",{"$f":"Orçamento!$P477","v":""},null,null,null,{"$f":"IFERROR(Orçamento!S477,\"-\")","v":0},{"$f":"IFERROR(Orçamento!X477,\"\")","v":0},{"$f":"Orçamento!AA477","v":{"$error":"#DIV/0!"}}]
["","16.",{"$f":"Orçamento!$P478","v":""},null,null,null,{"$f":"IFERROR(Orçamento!S478,\"-\")","v":0},{"$f":"IFERROR(Orçamento!X478,\"\")","v":0},{"$f":"Orçamento!AA478","v":{"$error":"#DIV/0!"}}]
["","17.",{"$f":"Orçamento!$P479","v":""},null,null,null,{"$f":"IFERROR(Orçamento!S479,\"-\")","v":0},{"$f":"IFERROR(Orçamento!X479,\"\")","v":0},{"$f":"Orçamento!AA479","v":{"$error":"#DIV/0!"}}]
["","18.",{"$f":"Orçamento!$P480","v":""},null,null,null,{"$f":"IFERROR(Orçamento!S480,\"-\")","v":0},{"$f":"IFERROR(Orçamento!X480,\"\")","v":0},{"$f":"Orçamento!AA480","v":{"$error":"#DIV/0!"}}]
["","19.",{"$f":"Orçamento!$P481","v":""},null,null,null,{"$f":"IFERROR(Orçamento!S481,\"-\")","v":0},{"$f":"IFERROR(Orçamento!X481,\"\")","v":0},{"$f":"Orçamento!AA481","v":{"$error":"#DIV/0!"}}]
["","20.",{"$f":"Orçamento!$P482","v":""},null,null,null,{"$f":"IFERROR(Orçamento!S482,\"-\")","v":0},{"$f":"IFERROR(Orçamento!X482,\"\")","v":0},{"$f":"Orçamento!AA482","v":{"$error":"#DIV/0!"}}]
["F","TOTAL GERAL DO ORÇAMENTO (R$)",null,null,null,null,{"$f":"SUM(G17:G36)","v":0},{"$f":"SUM(H17:H36)","v":0},{"$f":"SUM(I17:I36)","v":{"$error":"#DIV/0!"}}]
["F"]
["F"]

{"sheet":"Somatório","index":2,"n_rows":45,"n_cols":6,"rows_kept":45,"cut":false,"hidden":false,"merged":[[13,0,14,0],[42,1,42,2],[44,1,44,5],[47,3,47,5],[48,3,48,5],[13,1,13,5],[9,1,9,3],[9,4,9,5],[11,1,11,2],[11,4,11,5],[12,1,12,2],[12,4,12,5],[0,1,0,5],[14,1,14,5],[2,1,2,3],[2,4,2,5],[3,1,3,3],[3,4,3,5],[5,1,5,3],[5,4,5,5],[6,1,6,3],[6,4,6,5],[8,1,8,3],[8,4,8,5],[1,1,1,5],[4,1,4,5],[7,1,7,5],[10,1,10,5]]}
[]
[]
[null,"UNIDADE ESCOLAR",null,null,"CÓDIGO INEP"]
[null,{"$f":"Orçamento!$O$4","v":"CENTRO DE ENSINO EM PERÍODO INTEGRAL VISCONDE DE MAUÁ"},null,null,{"$f":"Orçamento!X4","v":52035662}]
[]
[null,"OBRA",null,null,"CIDADE"]
[null,{"$f":"Orçamento!$O$7","v":"AMPLIAÇÃO E REFORMA"},null,null,{"$f":"Orçamento!$X$7","v":"GOIÂNIA"}]
[]
[null,"ENDEREÇO",null,null,"CRE"]
[null,{"$f":"Orçamento!$R$10","v":" RUA 1016 COM RUA 1007 S/N , SETOR PEDRO LUDOVICO , CEP:74820-290"},null,null,{"$f":"Orçamento!$O$10","v":"CRE-GOIÂNIA"}]
[]
[null,"REFERÊNCIA",null,"DATA","ÁREA TOTAL CONSTRUÍDA (M²)"]
[null,{"$f":"CONCATENATE(\"AGETOP E SINAPI - \",Orçamento!$T$10)","v":"AGETOP E SINAPI - ONERADA"},null,{"$f":"Orçamento!$S$7","v":"2020-07-28"},{"$f":"Orçamento!$X$13","v":1828.8}]
["FILTRO"]
[null,"SOMATÓRIO DE SERVIÇOS"]
["↓","ITEM","DESCRIÇÃO DOS SERVIÇOS","PREÇO SEM BDI (R$)","PREÇO COM BDI (R$)","PARTIC.  ( % )"]
[{"$f":"IF(D17>0,\"F\",\"\")","v":""},"a.",{"$f":"Orçamento!P429","v":"SERVIÇOS PRELIMINARES"},{"$f":"Orçamento!S429","v":0},{"$f":"Orçamento!X429","v":0},{"$f":"Orçamento!AA429","v":0}]
[{"$f":"IF(D18>0,\"F\",\"\")","v":""},"b.",{"$f":"Orçamento!P430","v":"TRANSPORTES"},{"$f":"Orçamento!S430","v":0},{"$f":"Orçamento!X430","v":0},{"$f":"Orçamento!AA430","v":0}]
["","c.",{"$f":"Orçamento!P431","v":"SERVIÇO EM TERRA"},{"$f":"Orçamento!S431","v":0},{"$f":"Orçamento!X431","v":0},{"$f":"Orçamento!AA431","v":0}]
["","d.",{"$f":"Orçamento!P432","v":"FUNDAÇÕES E SONDAGENS"},{"$f":"Orçamento!S432","v":0},{"$f":"Orçamento!X432","v":0},{"$f":"Orçamento!AA432","v":0}]
["","e.",{"$f":"Orçamento!P433","v":"ESTRUTURA"},{"$f":"Orçamento!S433","v":0},{"$f":"Orçamento!X433","v":0},{"$f":"Orçamento!AA433","v":0}]
["","f.",{"$f":"Orçamento!P434","v":"INSTALAÇÕES ELÉTRICAS"},{"$f":"Orçamento!S434","v":0},{"$f":"Orçamento!X434","v":0},{"$f":"Orçamento!AA434","v":0}]
["","g.",{"$f":"Orçamento!P435","v":"INSTALAÇÕES HIDROSSANITÁRIAS"},{"$f":"Orçamento!S435","v":0},{"$f":"Orçamento!X435","v":0},{"$f":"Orçamento!AA435","v":0}]
["","h",{"$f":"Orçamento!P436","v":"INSTALAÇÕES ESPECIAIS"},{"$f":"Orçamento!S436","v":0},{"$f":"Orçamento!X436","v":0},{"$f":"Orçamento!AA436","v":0}]
["","i.",{"$f":"Orçamento!P437","v":"ALVENARIAS E DIVISÓRIAS"},{"$f":"Orçamento!S437","v":0},{"$f":"Orçamento!X437","v":0},{"$f":"Orçamento!AA437","v":0}]
["","j.",{"$f":"Orçamento!P438","v":"ALVENARIA AUTO-PORTANTE"},{"$f":"Orçamento!S438","v":0},{"$f":"Orçamento!X438","v":0},{"$f":"Orçamento!AA438","v":0}]
["","k.",{"$f":"Orçamento!P439","v":"IMPERMEABILIZAÇÃO"},{"$f":"Orçamento!S439","v":0},{"$f":"Orçamento!X439","v":0},{"$f":"Orçamento!AA439","v":0}]
["","l.",{"$f":"Orçamento!P440","v":"ISOLAMENTO TÉRMICO E ACÚSTICO"},{"$f":"Orçamento!S440","v":0},{"$f":"Orçamento!X440","v":0},{"$f":"Orçamento!AA440","v":0}]
["","m.",{"$f":"Orçamento!P441","v":"ESTRUTURA DE MADEIRA"},{"$f":"Orçamento!S441","v":0},{"$f":"Orçamento!X441","v":0},{"$f":"Orçamento!AA441","v":0}]
["","n.",{"$f":"Orçamento!P442","v":"ESTRUTURAS METÁLICAS"},{"$f":"Orçamento!S442","v":0},{"$f":"Orçamento!X442","v":0},{"$f":"Orçamento!AA442","v":0}]
["","o.",{"$f":"Orçamento!P443","v":"COBERTURAS"},{"$f":"Orçamento!S443","v":0},{"$f":"Orçamento!X443","v":0},{"$f":"Orçamento!AA443","v":0}]
["","p.",{"$f":"Orçamento!P444","v":"ESQUADRIAS DE MADEIRA"},{"$f":"Orçamento!S444","v":0},{"$f":"Orçamento!X444","v":0},{"$f":"Orçamento!AA444","v":0}]
["","q.",{"$f":"Orçamento!P445","v":"ESQUADRIAS METÁLICAS"},{"$f":"Orçamento!S445","v":0},{"$f":"Orçamento!X445","v":0},{"$f":"Orçamento!AA445","v":0}]
["","r.",{"$f":"Orçamento!P446","v":"VIDROS"},{"$f":"Orçamento!S446","v":0},{"$f":"Orçamento!X446","v":0},{"$f":"Orçamento!AA446","v":0}]
["","s.",{"$f":"Orçamento!P447","v":"REVESTIMENTO DE PAREDE"},{"$f":"Orçamento!S447","v":0},{"$f":"Orçamento!X447","v":0},{"$f":"Orçamento!AA447","v":0}]
["","t.",{"$f":"Orçamento!P448","v":"FORROS"},{"$f":"Orçamento!S448","v":0},{"$f":"Orçamento!X448","v":0},{"$f":"Orçamento!AA448","v":0}]
["","u.",{"$f":"Orçamento!P449","v":"REVESTIMENTO DE PISO"},{"$f":"Orçamento!S449","v":0},{"$f":"Orçamento!X449","v":0},{"$f":"Orçamento!AA449","v":0}]
["","v.",{"$f":"Orçamento!P450","v":"FERRAGENS"},{"$f":"Orçamento!S450","v":0},{"$f":"Orçamento!X450","v":0},{"$f":"Orçamento!AA450","v":0}]
["","w.",{"$f":"Orçamento!P451","v":"MARCENARIA"},{"$f":"Orçamento!S451","v":0},{"$f":"Orçamento!X451","v":0},{"$f":"Orçamento!AA451","v":0}]
["","x.",{"$f":"Orçamento!P452","v":"ADMINISTRAÇÃO"},{"$f":"Orçamento!S452","v":0},{"$f":"Orçamento!X452","v":0},{"$f":"Orçamento!AA452","v":0}]
["","y.",{"$f":"Orçamento!P453","v":"PINTURA"},{"$f":"Orçamento!S453","v":0},{"$f":"Orçamento!X453","v":0},{"$f":"Orçamento!AA453","v":0}]
["","z.",{"$f":"Orçamento!P454","v":"DIVERSOS"},{"$f":"Orçamento!S454","v":0},{"$f":"Orçamento!X454","v":0},{"$f":"Orçamento!AA454","v":0}]
["F","TOTAL GERAL DO ORÇAMENTO",null,{"$f":"SUM(D17:D42)","v":0},{"$f":"SUM(E17:E42)","v":0},{"$f":"SUM(F17:F42)","v":0}]
[]
[null,"(*) Para itens da AGETOP, os vidros não estão inclusos nas esquadrias e já foram considerados os custos de contramarco para as esquadrias de alumínio;"]

{"sheet":"Cronog_90_Dias","index":3,"n_rows":99,"n_cols":20,"rows_kept":99,"cut":false,"hidden":false,"merged":[[0,1,0,17],[1,1,1,17],[2,1,2,7],[2,8,2,17],[3,1,3,7],[3,8,3,17],[8,1,8,7],[8,8,8,17],[9,0,11,0],[9,1,9,7],[9,8,9,17],[10,1,10,17],[11,1,11,17],[4,1,4,17],[5,1,5,7],[5,8,5,17],[6,1,6,7],[6,8,6,17],[7,1,7,17],[12,0,13,0],[12,3,13,3],[12,5,12,8],[12,9,12,12],[12,13,12,16],[12,17,13,17],[13,1,13,2],[13,5,13,8],[13,9,13,12],[13,13,13,16],[14,1,16,2],[14,3,16,3],[14,4,16,4],[14,5,14,8],[14,9,14,12],[14,13,14,16],[16,5,16,8],[16,9,16,12],[16,13,16,16],[17,1,19,2],[17,3,19,3],[17,4,19,4],[17,5,17,8],[17,9,17,12],[17,13,17,16],[19,5,19,8],[19,9,19,12],[19,13,19,16],[20,1,22,2],[20,3,22,3],[20,4,22,4],[20,5,20,8],[20,9,20,12],[20,13,20,16],[22,5,22,8],[22,9,22,12],[22,13,22,16],[23,1,25,2],[23,3,25,3],[23,4,25,4],[23,5,23,8],[23,9,23,12],[23,13,23,16],[25,5,25,8],[25,9,25,12],[25,13,25,16],[26,1,28,2],[26,3,28,3],[26,4,28,4],[26,5,26,8],[26,9,26,12],[26,13,26,16],[28,5,28,8],[28,9,28,12],[28,13,28,16],[29,1,31,2],[29,3,31,3],[29,4,31,4],[29,5,29,8],[29,9,29,12],[29,13,29,16],[31,5,31,8],[31,9,31,12],[31,13,31,16],[32,1,34,2],[32,3,34,3],[32,4,34,4],[32,5,32,8],[32,9,32,12],[32,13,32,16],[34,5,34,8],[34,9,34,12],[34,13,34,16],[35,1,37,2],[35,3,37,3],[35,4,37,4],[35,5,35,8],[35,9,35,12],[35,13,35,16],[37,5,37,8],[37,9,37,12],[37,13,37,16],[38,1,40,2],[38,3,40,3],[38,4,40,4],[38,5,38,8],[38,9,38,12],[38,13,38,16],[40,5,40,8],[40,9,40,12],[40,13,40,16],[41,1,43,2],[41,3,43,3],[41,4,43,4],[41,5,41,8],[41,9,41,12],[41,13,41,16],[43,5,43,8],[43,9,43,12],[43,13,43,16],[44,1,46,2],[44,3,46,3],[44,4,46,4],[44,5,44,8],[44,9,44,12],[44,13,44,16],[46,5,46,8],[46,9,46,12],[46,13,46,16],[47,1,49,2],[47,3,49,3],[47,4,49,4],[47,5,47,8],[47,9,47,12],[47,13,47,16],[49,5,49,8],[49,9,49,12],[49,13,49,16],[50,1,52,2],[50,3,52,3],[50,4,52,4],[50,5,50,8],[50,9,50,12],[50,13,50,16],[52,5,52,8],[52,9,52,12],[52,13,52,16],[53,1,55,2],[53,3,55,3],[53,4,55,4],[53,5,53,8],[53,9,53,12],[53,13,53,16],[55,5,55,8],[55,9,55,12],[55,13,55,16],[56,1,58,2],[56,3,58,3],[56,4,58,4],[56,5,56,8],[56,9,56,12],[56,13,56,16],[58,5,58,8],[58,9,58,12],[58,13,58,16],[59,1,61,2],[59,3,61,3],[59,4,61,4],[59,5,59,8],[59,9,59,12],[59,13,59,16],[61,5,61,8],[61,9,61,12],[61,13,61,16],[62,1,64,2],[62,3,64,3],[62,4,64,4],[62,5,62,8],[62,9,62,12],[62,13,62,16],[64,5,64,8],[64,9,64,12],[64,13,64,16],[65,1,67,2],[65,3,67,3],[65,4,67,4],[65,5,65,8],[65,9,65,12],[65,13,65,16],[67,5,67,8],[67,9,67,12],[67,13,67,16],[68,1,70,2],[68,3,70,3],[68,4,70,4],[68,5,68,8],[68,9,68,12],[68,13,68,16],[70,5,70,8],[70,9,70,12],[70,13,70,16],[71,1,73,2],[71,3,73,3],[71,4,73,4],[71,5,71,8],[71,9,71,12],[71,13,71,16],[73,5,73,8],[73,9,73,12],[73,13,73,16],[74,1,76,2],[74,3,76,3],[74,4,76,4],[74,5,74,8],[74,9,74,12],[74,13,74,16],[76,5,76,8],[76,9,76,12],[76,13,76,16],[77,1,79,2],[77,3,79,3],[77,4,79,4],[77,5,77,8],[77,9,77,12],[77,13,77,16],[79,5,79,8],[79,9,79,12],[79,13,79,16],[80,1,82,2],[80,3,82,3],[80,4,82,4],[80,5,80,8],[80,9,80,12],[80,13,80,16],[82,5,82,8],[82,9,82,12],[82,13,82,16],[83,1,85,2],[83,3,85,3],[83,4,85,4],[83,5,83,8],[83,9,83,12],[83,13,83,16],[85,5,85,8],[85,9,85,12],[85,13,85,16],[86,1,88,2],[86,3,88,3],[86,4,88,4],[86,5,86,8],[86,9,86,12],[86,13,86,16],[88,5,88,8],[88,9,88,12],[88,13,88,16],[92,1,92,2],[92,5,92,8],[92,9,92,12],[92,13,92,16],[93,1,93,2],[93,5,93,8],[93,9,93,12],[93,13,93,16],[89,1,91,2],[89,3,91,3],[89,4,91,4],[89,5,89,8],[89,9,89,12],[89,13,89,16],[91,5,91,8],[91,9,91,12],[91,13,91,16],[97,1,97,4],[98,1,98,17],[94,1,94,2],[94,5,94,8],[94,9,94,12],[94,13,94,16],[95,1,95,2],[95,5,95,8],[95,9,95,12],[95,13,95,16]]}
[]
[]
[null,"UNIDADE ESCOLAR",null,null,null,null,null,null,"PRAZO"]
[null,{"$f":"Orçamento!O4","v":"CENTRO DE ENSINO EM PERÍODO INTEGRAL VISCONDE DE MAUÁ"},null,null,null,null,null,null,"90 DIAS CORRIDOS"]
[]
[null,"OBRA",null,null,null,null,null,null,"DATA"]
[null,{"$f":"Orçamento!O7","v":"AMPLIAÇÃO E REFORMA"},null,null,null,null,null,null,{"$f":"Orçamento!S7","v":"2020-07-28"}]
[]
[null,"LOCAL",null,null,null,null,null,null,"ÁREA TOTAL CONSTRUÍDA (M²)"]
["FILTRO",{"$f":"Orçamento!X7","v":"GOIÂNIA"},null,null,null,null,null,null,{"$f":"Orçamento!X13","v":1828.8}]
[]
[null,"CRONOGRAMA - FÍSICO FINANCEIRO"]
["↓","CUSTO TOTAL:",{"$f":"D93","v":0},"VALOR","Dias:",30,null,null,null,60,null,null,null,90,null,null,null,"TOTAL"]
[null,"DESCRIÇÃO DOS SERVIÇOS",null,null,"%","1ª PARCELA",null,null,null,"2ª PARCELA",null,null,null,"3ª PARCELA"]
[{"$f":"IF(D15>0,\"F\",\"\")","v":""},"SERVIÇOS PRELIMINARES",null,{"$f":"Orçamento!X429","v":0},{"$f":"Orçamento!AA429","v":0},{"$f":"ROUND(F17*$D$15,2)","v":0},null,null,null,{"$f":"ROUND(J17*$D$15,2)","v":0},null,null,null,{"$f":"ROUND(N17*$D$15,2)","v":0},null,null,null,{"$f":"SUM(F15:Q15)","v":0},null,{"$f":"IF(D15=R15,\"OK\",\"ERRO\")","v":"OK"}]
[{"$f":"IF(A15=\"F\",A15,\"\")","v":""}]
[{"$f":"IF(A16=\"F\",A16,\"\")","v":""},null,null,null,null,1,null,null,null,0,null,null,null,{"$f":"1-F17-J17","v":0},null,null,null,{"$f":"IFERROR(E15/100,\"\")","v":0},null,{"$f":"IF(E15=R17*100,\"OK\",\"ERRO\")","v":"OK"}]
[{"$f":"IF(D18>0,\"F\",\"\")","v":""},"TRANSPORTES",null,{"$f":"Orçamento!X430","v":0},{"$f":"Orçamento!AA430","v":0},{"$f":"ROUND(F20*$D$18,2)","v":0},null,null,null,{"$f":"ROUND(J20*$D$18,2)","v":0},null,null,null,{"$f":"ROUND(N20*$D$18,2)","v":0},null,null,null,{"$f":"SUM(F18:Q18)","v":0},null,{"$f":"IF(D18=R18,\"OK\",\"ERRO\")","v":"OK"}]
[{"$f":"IF(A18=\"F\",A18,\"\")","v":""}]
[{"$f":"IF(A19=\"F\",A19,\"\")","v":""},null,null,null,null,0.32650000000000001,null,null,null,0.3,null,null,null,{"$f":"1-F20-J20","v":0.3735},null,null,null,{"$f":"IFERROR(E18/100,\"\")","v":0},null,{"$f":"IF(E18=R20*100,\"OK\",\"ERRO\")","v":"OK"}]
[{"$f":"IF(D21>0,\"F\",\"\")","v":""},"SERVIÇO EM TERRA",null,{"$f":"Orçamento!X431","v":0},{"$f":"Orçamento!AA431","v":0},{"$f":"ROUND(F23*$D$21,2)","v":0},null,null,null,{"$f":"ROUND(J23*$D$21,2)","v":0},null,null,null,{"$f":"ROUND(N23*$D$21,2)","v":0},null,null,null,{"$f":"SUM(F21:Q21)","v":0},null,{"$f":"IF(D21=R21,\"OK\",\"ERRO\")","v":"OK"}]
[{"$f":"IF(A21=\"F\",A21,\"\")","v":""}]
[{"$f":"IF(A22=\"F\",A22,\"\")","v":""},null,null,null,null,1,null,null,null,0,null,null,null,{"$f":"1-F23-J23","v":0},null,null,null,{"$f":"IFERROR(E21/100,\"\")","v":0},null,{"$f":"IF(E21=R23*100,\"OK\",\"ERRO\")","v":"OK"}]
[{"$f":"IF(D24>0,\"F\",\"\")","v":""},"FUNDAÇÕES E SONDAGENS",null,{"$f":"Orçamento!X432","v":0},{"$f":"Orçamento!AA432","v":0},{"$f":"ROUND(F26*$D$24,2)","v":0},null,null,null,{"$f":"ROUND(J26*$D$24,2)","v":0},null,null,null,{"$f":"ROUND(N26*$D$24,2)","v":0},null,null,null,{"$f":"SUM(F24:Q24)","v":0},null,{"$f":"IF(D24=R24,\"OK\",\"ERRO\")","v":"OK"}]
[{"$f":"IF(A24=\"F\",A24,\"\")","v":""}]
[{"$f":"IF(A25=\"F\",A25,\"\")","v":""},null,null,null,null,1,null,null,null,0,null,null,null,{"$f":"1-F26-J26","v":0},null,null,null,{"$f":"IFERROR(E24/100,\"\")","v":0},null,{"$f":"IF(E24=R26*100,\"OK\",\"ERRO\")","v":"OK"}]
[{"$f":"IF(D27>0,\"F\",\"\")","v":""},"ESTRUTURA",null,{"$f":"Orçamento!X433","v":0},{"$f":"Orçamento!AA433","v":0},{"$f":"ROUND(F29*$D$27,2)","v":0},null,null,null,{"$f":"ROUND(J29*$D$27,2)","v":0},null,null,null,{"$f":"ROUND(N29*$D$27,2)","v":0},null,null,null,{"$f":"SUM(F27:Q27)","v":0},null,{"$f":"IF(D27=R27,\"OK\",\"ERRO\")","v":"OK"}]
[{"$f":"IF(A27=\"F\",A27,\"\")","v":""}]
[{"$f":"IF(A28=\"F\",A28,\"\")","v":""},null,null,null,null,0.54,null,null,null,0.46,null,null,null,{"$f":"1-F29-J29","v":0},null,null,null,{"$f":"IFERROR(E27/100,\"\")","v":0},null,{"$f":"IF(E27=R29*100,\"OK\",\"ERRO\")","v":"OK"}]
[{"$f":"IF(D30>0,\"F\",\"\")","v":""},"INST.ELET/TELEFÔNICA/CABEAMENTO ESTRUTURADO",null,{"$f":"Orçamento!X434","v":0},{"$f":"Orçamento!AA434","v":0},{"$f":"ROUND(F32*$D$30,2)","v":0},null,null,null,{"$f":"ROUND(J32*$D$30,2)","v":0},null,null,null,{"$f":"ROUND(N32*$D$30,2)","v":0},null,null,null,{"$f":"SUM(F30:Q30)","v":0},null,{"$f":"IF(D30=R30,\"OK\",\"ERRO\")","v":"OK"}]
[{"$f":"IF(A30=\"F\",A30,\"\")","v":""}]
[{"$f":"IF(A31=\"F\",A31,\"\")","v":""},null,null,null,null,0,null,null,null,{"$f":"1-B32","v":1},null,null,null,{"$f":"1-F32-J32","v":0},null,null,null,{"$f":"IFERROR(E30/100,\"\")","v":0},null,{"$f":"IF(E30=R32*100,\"OK\",\"ERRO\")","v":"OK"}]
[{"$f":"IF(D33>0,\"F\",\"\")","v":""},"INSTALAÇÕES HIDROSSANITÁRIAS",null,{"$f":"Orçamento!X435","v":0},{"$f":"Orçamento!AA435","v":0},{"$f":"ROUND(F35*$D$33,2)","v":0},null,null,null,{"$f":"ROUND(J35*$D$33,2)","v":0},null,null,null,{"$f":"ROUND(N35*$D$33,2)","v":0},null,null,null,{"$f":"SUM(F33:Q33)","v":0},null,{"$f":"IF(D33=R33,\"OK\",\"ERRO\")","v":"OK"}]
[{"$f":"IF(A33=\"F\",A33,\"\")","v":""}]
[{"$f":"IF(A34=\"F\",A34,\"\")","v":""},null,null,null,null,0,null,null,null,{"$f":"1-B35","v":1},null,null,null,{"$f":"1-F35-J35","v":0},null,null,null,{"$f":"IFERROR(E33/100,\"\")","v":0},null,{"$f":"IF(E33=R35*100,\"OK\",\"ERRO\")","v":"OK"}]
[{"$f":"IF(D36>0,\"F\",\"\")","v":""},"INSTALAÇÕES ESPECIAIS",null,{"$f":"Orçamento!X436","v":0},{"$f":"Orçamento!AA436","v":0},{"$f":"ROUND(F38*$D$36,2)","v":0},null,null,null,{"$f":"ROUND(J38*$D$36,2)","v":0},null,null,null,{"$f":"ROUND(N38*$D$36,2)","v":0},null,null,null,{"$f":"SUM(F36:Q36)","v":0},null,{"$f":"IF(D36=R36,\"OK\",\"ERRO\")","v":"OK"}]
[{"$f":"IF(A36=\"F\",A36,\"\")","v":""}]
[{"$f":"IF(A37=\"F\",A37,\"\")","v":""},null,null,null,null,0,null,null,null,{"$f":"1-B38","v":1},null,null,null,{"$f":"1-F38-J38","v":0},null,null,null,{"$f":"IFERROR(E36/100,\"\")","v":0},null,{"$f":"IF(E36=R38*100,\"OK\",\"ERRO\")","v":"OK"}]
[{"$f":"IF(D39>0,\"F\",\"\")","v":""},"ALVENARIA E DIVISÓRIAS",null,{"$f":"Orçamento!X437","v":0},{"$f":"Orçamento!AA437","v":0},{"$f":"ROUND(F41*$D$39,2)","v":0},null,null,null,{"$f":"ROUND(J41*$D$39,2)","v":0},null,null,null,{"$f":"ROUND(N41*$D$39,2)","v":0},null,null,null,{"$f":"SUM(F39:Q39)","v":0},null,{"$f":"IF(D39=R39,\"OK\",\"ERRO\")","v":"OK"}]
[{"$f":"IF(A39=\"F\",A39,\"\")","v":""}]
[{"$f":"IF(A40=\"F\",A40,\"\")","v":""},null,null,null,null,0,null,null,null,{"$f":"1-B41","v":1},null,null,null,{"$f":"1-F41-J41","v":0},null,null,null,{"$f":"IFERROR(E39/100,\"\")","v":0},null,{"$f":"IF(E39=R41*100,\"OK\",\"ERRO\")","v":"OK"}]
[{"$f":"IF(D42>0,\"F\",\"\")","v":""},"ALVENARIA AUTO-PORTANTE",null,{"$f":"Orçamento!X438","v":0},{"$f":"Orçamento!AA438","v":0},{"$f":"ROUND(F44*$D$42,2)","v":0},null,null,null,{"$f":"ROUND(J44*$D$42,2)","v":0},null,null,null,{"$f":"ROUND(N44*$D$42,2)","v":0},null,null,null,{"$f":"SUM(F42:Q42)","v":0},null,{"$f":"IF(D42=R42,\"OK\",\"ERRO\")","v":"OK"}]
[{"$f":"IF(A42=\"F\",A42,\"\")","v":""}]
[{"$f":"IF(A43=\"F\",A43,\"\")","v":""},null,null,null,null,0,null,null,null,{"$f":"1-B44","v":1},null,null,null,{"$f":"1-F44-J44","v":0},null,null,null,{"$f":"IFERROR(E42/100,\"\")","v":0},null,{"$f":"IF(E42=R44*100,\"OK\",\"ERRO\")","v":"OK"}]
[{"$f":"IF(D45>0,\"F\",\"\")","v":""},"IMPERMEABILIZAÇÃO",null,{"$f":"Orçamento!X439","v":0},{"$f":"Orçamento!AA439","v":0},{"$f":"ROUND(F47*$D$45,2)","v":0},null,null,null,{"$f":"ROUND(J47*$D$45,2)","v":0},null,null,null,{"$f":"ROUND(N47*$D$45,2)","v":0},null,null,null,{"$f":"SUM(F45:Q45)","v":0},null,{"$f":"IF(D45=R45,\"OK\",\"ERRO\")","v":"OK"}]
[{"$f":"IF(A45=\"F\",A45,\"\")","v":""}]
[{"$f":"IF(A46=\"F\",A46,\"\")","v":""},null,null,null,null,0.85,null,null,null,0.15,null,null,null,{"$f":"1-F47-J47","v":0},null,null,null,{"$f":"IFERROR(E45/100,\"\")","v":0},null,{"$f":"IF(E45=R47*100,\"OK\",\"ERRO\")","v":"OK"}]
[{"$f":"IF(D48>0,\"F\",\"\")","v":""},"ISOLAMENTO TÉRMICO E ACÚSTICO",null,{"$f":"Orçamento!X440","v":0},{"$f":"Orçamento!AA440","v":0},{"$f":"ROUND(F50*$D$48,2)","v":0},null,null,null,{"$f":"ROUND(J50*$D$48,2)","v":0},null,null,null,{"$f":"ROUND(N50*$D$48,2)","v":0},null,null,null,{"$f":"SUM(F48:Q48)","v":0},null,{"$f":"IF(D48=R48,\"OK\",\"ERRO\")","v":"OK"}]
[{"$f":"IF(A48=\"F\",A48,\"\")","v":""}]
[{"$f":"IF(A49=\"F\",A49,\"\")","v":""},null,null,null,null,0,null,null,null,{"$f":"1-B50","v":1},null,null,null,{"$f":"1-F50-J50","v":0},null,null,null,{"$f":"IFERROR(E48/100,\"\")","v":0},null,{"$f":"IF(E48=R50*100,\"OK\",\"ERRO\")","v":"OK"}]
[{"$f":"IF(D51>0,\"F\",\"\")","v":""},"ESTRUTURA DE MADEIRA",null,{"$f":"Orçamento!X441","v":0},{"$f":"Orçamento!AA441","v":0},{"$f":"ROUND(F53*$D$51,2)","v":0},null,null,null,{"$f":"ROUND(J53*$D$51,2)","v":0},null,null,null,{"$f":"ROUND(N53*$D$51,2)","v":0},null,null,null,{"$f":"SUM(F51:Q51)","v":0},null,{"$f":"IF(D51=R51,\"OK\",\"ERRO\")","v":"OK"}]
[{"$f":"IF(A51=\"F\",A51,\"\")","v":""}]
[{"$f":"IF(A52=\"F\",A52,\"\")","v":""},null,null,null,null,0,null,null,null,0.57999999999999996,null,null,null,{"$f":"1-F53-J53","v":0.42000000000000004},null,null,null,{"$f":"IFERROR(E51/100,\"\")","v":0},null,{"$f":"IF(E51=R53*100,\"OK\",\"ERRO\")","v":"OK"}]
[{"$f":"IF(D54>0,\"F\",\"\")","v":""},"ESTRUTURA METÁLICA",null,{"$f":"Orçamento!X442","v":0},{"$f":"Orçamento!AA442","v":0},{"$f":"ROUND(F56*$D$54,2)","v":0},null,null,null,{"$f":"ROUND(J56*$D$54,2)","v":0},null,null,null,{"$f":"ROUND(N56*$D$54,2)","v":0},null,null,null,{"$f":"SUM(F54:Q54)","v":0},null,{"$f":"IF(D54=R54,\"OK\",\"ERRO\")","v":"OK"}]
[{"$f":"IF(A54=\"F\",A54,\"\")","v":""}]
[{"$f":"IF(A55=\"F\",A55,\"\")","v":""},null,null,null,null,0,null,null,null,0.57999999999999996,null,null,null,{"$f":"1-F56-J56","v":0.42000000000000004},null,null,null,{"$f":"IFERROR(E54/100,\"\")","v":0},null,{"$f":"IF(E54=R56*100,\"OK\",\"ERRO\")","v":"OK"}]
[{"$f":"IF(D57>0,\"F\",\"\")","v":""},"COBERTURAS",null,{"$f":"Orçamento!X443","v":0},{"$f":"Orçamento!AA443","v":0},{"$f":"ROUND(F59*$D$57,2)","v":0},null,null,null,{"$f":"ROUND(J59*$D$57,2)","v":0},null,null,null,{"$f":"ROUND(N59*$D$57,2)","v":0},null,null,null,{"$f":"SUM(F57:Q57)","v":0},null,{"$f":"IF(D57=R57,\"OK\",\"ERRO\")","v":"OK"}]
[{"$f":"IF(A57=\"F\",A57,\"\")","v":""}]
[{"$f":"IF(A58=\"F\",A58,\"\")","v":""},null,null,null,null,0,null,null,null,0,null,null,null,{"$f":"1-F59-J59","v":1},null,null,null,{"$f":"IFERROR(E57/100,\"\")","v":0},null,{"$f":"IF(E57=R59*100,\"OK\",\"ERRO\")","v":"OK"}]
[{"$f":"IF(D60>0,\"F\",\"\")","v":""},"ESQUADRIAS DE MADEIRA",null,{"$f":"Orçamento!X444","v":0},{"$f":"Orçamento!AA444","v":0},{"$f":"ROUND(F62*$D$60,2)","v":0},null,null,null,{"$f":"ROUND(J62*$D$60,2)","v":0},null,null,null,{"$f":"ROUND(N62*$D$60,2)","v":0},null,null,null,{"$f":"SUM(F60:Q60)","v":0},null,{"$f":"IF(D60=R60,\"OK\",\"ERRO\")","v":"OK"}]
[{"$f":"IF(A60=\"F\",A60,\"\")","v":""}]
[{"$f":"IF(A61=\"F\",A61,\"\")","v":""},null,null,null,null,0,null,null,null,0.4,null,null,null,{"$f":"1-F62-J62","v":0.6},null,null,null,{"$f":"IFERROR(E60/100,\"\")","v":0},null,{"$f":"IF(E60=R62*100,\"OK\",\"ERRO\")","v":"OK"}]
[{"$f":"IF(D63>0,\"F\",\"\")","v":""},"ESQUADRIAS METÁLICAS",null,{"$f":"Orçamento!X445","v":0},{"$f":"Orçamento!AA445","v":0},{"$f":"ROUND(F65*$D$63,2)","v":0},null,null,null,{"$f":"ROUND(J65*$D$63,2)","v":0},null,null,null,{"$f":"ROUND(N65*$D$63,2)","v":0},null,null,null,{"$f":"SUM(F63:Q63)","v":0},null,{"$f":"IF(D63=R63,\"OK\",\"ERRO\")","v":"OK"}]
[{"$f":"IF(A63=\"F\",A63,\"\")","v":""}]
[{"$f":"IF(A64=\"F\",A64,\"\")","v":""},null,null,null,null,0,null,null,null,0.45,null,null,null,{"$f":"1-F65-J65","v":0.55000000000000004},null,null,null,{"$f":"IFERROR(E63/100,\"\")","v":0},null,{"$f":"IF(E63=R65*100,\"OK\",\"ERRO\")","v":"OK"}]
[{"$f":"IF(D66>0,\"F\",\"\")","v":""},"VIDROS",null,{"$f":"Orçamento!X446","v":0},{"$f":"Orçamento!AA446","v":0},{"$f":"ROUND(F68*$D$66,2)","v":0},null,null,null,{"$f":"ROUND(J68*$D$66,2)","v":0},null,null,null,{"$f":"ROUND(N68*$D$66,2)","v":0},null,null,null,{"$f":"SUM(F66:Q66)","v":0},null,{"$f":"IF(D66=R66,\"OK\",\"ERRO\")","v":"OK"}]
[{"$f":"IF(A66=\"F\",A66,\"\")","v":""}]
[{"$f":"IF(A67=\"F\",A67,\"\")","v":""},null,null,null,null,0,null,null,null,0,null,null,null,{"$f":"1-F68-J68","v":1},null,null,null,{"$f":"IFERROR(E66/100,\"\")","v":0},null,{"$f":"IF(E66=R68*100,\"OK\",\"ERRO\")","v":"OK"}]
[{"$f":"IF(D69>0,\"F\",\"\")","v":""},"REVESTIMENTO DE PAREDE",null,{"$f":"Orçamento!X447","v":0},{"$f":"Orçamento!AA447","v":0},{"$f":"ROUND(F71*$D$69,2)","v":0},null,null,null,{"$f":"ROUND(J71*$D$69,2)","v":0},null,null,null,{"$f":"ROUND(N71*$D$69,2)","v":0},null,null,null,{"$f":"SUM(F69:Q69)","v":0},null,{"$f":"IF(D69=R69,\"OK\",\"ERRO\")","v":"OK"}]
[{"$f":"IF(A69=\"F\",A69,\"\")","v":""}]
[{"$f":"IF(A70=\"F\",A70,\"\")","v":""},null,null,null,null,0,null,null,null,0.4,null,null,null,{"$f":"1-F71-J71","v":0.6},null,null,null,{"$f":"IFERROR(E69/100,\"\")","v":0},null,{"$f":"IF(E69=R71*100,\"OK\",\"ERRO\")","v":"OK"}]
[{"$f":"IF(D72>0,\"F\",\"\")","v":""},"FORROS",null,{"$f":"Orçamento!X448","v":0},{"$f":"Orçamento!AA448","v":0},{"$f":"ROUND(F74*$D$72,2)","v":0},null,null,null,{"$f":"ROUND(J74*$D$72,2)","v":0},null,null,null,{"$f":"ROUND(N74*$D$72,2)","v":0},null,null,null,{"$f":"SUM(F72:Q72)","v":0},null,{"$f":"IF(D72=R72,\"OK\",\"ERRO\")","v":"OK"}]
[{"$f":"IF(A72=\"F\",A72,\"\")","v":""}]
[{"$f":"IF(A73=\"F\",A73,\"\")","v":""},null,null,null,null,0,null,null,null,0.4,null,null,null,{"$f":"1-F74-J74","v":0.6},null,null,null,{"$f":"IFERROR(E72/100,\"\")","v":0},null,{"$f":"IF(E72=R74*100,\"OK\",\"ERRO\")","v":"OK"}]
[{"$f":"IF(D75>0,\"F\",\"\")","v":""},"REVESTIMENTO DE PISO",null,{"$f":"Orçamento!X449","v":0},{"$f":"Orçamento!AA449","v":0},{"$f":"ROUND(F77*$D$75,2)","v":0},null,null,null,{"$f":"ROUND(J77*$D$75,2)","v":0},null,null,null,{"$f":"ROUND(N77*$D$75,2)","v":0},null,null,null,{"$f":"SUM(F75:Q75)","v":0},null,{"$f":"IF(D75=R75,\"OK\",\"ERRO\")","v":"OK"}]
[{"$f":"IF(A75=\"F\",A75,\"\")","v":""}]
[{"$f":"IF(A76=\"F\",A76,\"\")","v":""},null,null,null,null,0,null,null,null,0.4,null,null,null,{"$f":"1-F77-J77","v":0.6},null,null,null,{"$f":"IFERROR(E75/100,\"\")","v":0},null,{"$f":"IF(E75=R77*100,\"OK\",\"ERRO\")","v":"OK"}]
[{"$f":"IF(D78>0,\"F\",\"\")","v":""},"FERRAGENS",null,{"$f":"Orçamento!X450","v":0},{"$f":"Orçamento!AA450","v":0},{"$f":"ROUND(F80*$D$78,2)","v":0},null,null,null,{"$f":"ROUND(J80*$D$78,2)","v":0},null,null,null,{"$f":"ROUND(N80*$D$78,2)","v":0},null,null,null,{"$f":"SUM(F78:Q78)","v":0},null,{"$f":"IF(D78=R78,\"OK\",\"ERRO\")","v":"OK"}]
[{"$f":"IF(A78=\"F\",A78,\"\")","v":""}]
[{"$f":"IF(A79=\"F\",A79,\"\")","v":""},null,null,null,null,0,null,null,null,0,null,null,null,{"$f":"1-F80-J80","v":1},null,null,null,{"$f":"IFERROR(E78/100,\"\")","v":0},null,{"$f":"IF(E78=R80*100,\"OK\",\"ERRO\")","v":"OK"}]
[{"$f":"IF(D81>0,\"F\",\"\")","v":""},"MARCENARIA",null,{"$f":"Orçamento!X451","v":0},{"$f":"Orçamento!AA451","v":0},{"$f":"ROUND(F83*$D$81,2)","v":0},null,null,null,{"$f":"ROUND(J83*$D$81,2)","v":0},null,null,null,{"$f":"ROUND(N83*$D$81,2)","v":0},null,null,null,{"$f":"SUM(F81:Q81)","v":0},null,{"$f":"IF(D81=R81,\"OK\",\"ERRO\")","v":"OK"}]
[{"$f":"IF(A81=\"F\",A81,\"\")","v":""}]
[{"$f":"IF(A82=\"F\",A82,\"\")","v":""},null,null,null,null,0,null,null,null,0,null,null,null,{"$f":"1-F83-J83","v":1},null,null,null,{"$f":"IFERROR(E81/100,\"\")","v":0},null,{"$f":"IF(E81=R83*100,\"OK\",\"ERRO\")","v":"OK"}]
[{"$f":"IF(D84>0,\"F\",\"\")","v":""},"ADMINISTRAÇÃO - MENSALISTAS",null,{"$f":"Orçamento!X452","v":0},{"$f":"Orçamento!AA452","v":0},{"$f":"ROUND(F86*$D$84,2)","v":0},null,null,null,{"$f":"ROUND(J86*$D$84,2)","v":0},null,null,null,{"$f":"ROUND(N86*$D$84,2)","v":0},null,null,null,{"$f":"SUM(F84:Q84)","v":0},null,{"$f":"IF(D84=R84,\"OK\",\"ERRO\")","v":"OK"}]
[{"$f":"IF(A84=\"F\",A84,\"\")","v":""}]
[{"$f":"IF(A85=\"F\",A85,\"\")","v":""},null,null,null,null,0.34,null,null,null,0.33,null,null,null,0.33,null,null,null,{"$f":"IFERROR(E84/100,\"\")","v":0},null,{"$f":"IF(E84=R86*100,\"OK\",\"ERRO\")","v":"OK"}]
[{"$f":"IF(D87>0,\"F\",\"\")","v":""},"PINTURA",null,{"$f":"Orçamento!X453","v":0},{"$f":"Orçamento!AA453","v":0},{"$f":"ROUND(F89*$D$87,2)","v":0},null,null,null,{"$f":"ROUND(J89*$D$87,2)","v":0},null,null,null,{"$f":"ROUND(N89*$D$87,2)","v":0},null,null,null,{"$f":"SUM(F87:Q87)","v":0},null,{"$f":"IF(D87=R87,\"OK\",\"ERRO\")","v":"OK"}]
[{"$f":"IF(A87=\"F\",A87,\"\")","v":""}]
[{"$f":"IF(A88=\"F\",A88,\"\")","v":""},null,null,null,null,0,null,null,null,0,null,null,null,{"$f":"1-F89-J89","v":1},null,null,null,{"$f":"IFERROR(E87/100,\"\")","v":0},null,{"$f":"IF(E87=R89*100,\"OK\",\"ERRO\")","v":"OK"}]
[{"$f":"IF(D90>0,\"F\",\"\")","v":""},"DIVERSOS",null,{"$f":"Orçamento!X454","v":0},{"$f":"Orçamento!AA454","v":0},{"$f":"ROUND(F92*$D$90,2)","v":0},null,null,null,{"$f":"ROUND(J92*$D$90,2)","v":0},null,null,null,{"$f":"ROUND(N92*$D$90,2)","v":0},null,null,null,{"$f":"SUM(F90:Q90)","v":0},null,{"$f":"IF(D90=R90,\"OK\",\"ERRO\")","v":"OK"}]
[{"$f":"IF(A90=\"F\",A90,\"\")","v":""}]
[{"$f":"IF(A91=\"F\",A91,\"\")","v":""},null,null,null,null,0,null,null,null,0,null,null,null,{"$f":"1-F92-J92","v":1},null,null,null,{"$f":"IFERROR(E90/100,\"\")","v":0},null,{"$f":"IF(E90=R92*100,\"OK\",\"ERRO\")","v":"OK"}]
["F","CUSTO DO ORÇAMENTO",null,{"$f":"SUM(D15:D92)","v":0},{"$f":"SUM(E15:E92)","v":0},{"$f":"F15+F18+F21+F24+F27+F30+F33+F36+F39+F42+F45+F48+F51+F54+F57+F60+F63+F66+F69+F72+F75+F78+F81+F84+F87+F90","v":0},null,null,null,{"$f":"J15+J18+J21+J24+J27+J30+J33+J36+J39+J42+J45+J48+J51+J54+J57+J60+J63+J66+J69+J72+J75+J78+J81+J84+J87+J90","v":0},null,null,null,{"$f":"N15+N18+N21+N24+N27+N30+N33+N36+N39+N42+N45+N48+N51+N54+N57+N60+N63+N66+N69+N72+N75+N78+N81+N84+N87+N90","v":0},null,null,null,{"$f":"R15+R18+R21+R24+R27+R30+R33+R36+R39+R42+R45+R48+R51+R54+R57+R60+R63+R66+R69+R72+R75+R78+R81+R84+R87+R90","v":0}]
["F","PERCENTUAIS:",null,null,null,{"$f":"IFERROR(F93/D93,\"\")","v":""},null,null,null,{"$f":"IFERROR(J93/D93,\"\")","v":""},null,null,null,{"$f":"IFERROR(N93/D93,\"\")","v":""},null,null,null,{"$f":"SUM(F94:Q94)","v":0}]
["F","TOTAIS ACUMULADOS:",null,null,null,{"$f":"F93","v":0},null,null,null,{"$f":"F95+J93","v":0},null,null,null,{"$f":"J95+N93","v":0}]
["F","PERCENTUAIS  ACUMULADOS:",null,null,null,{"$f":"F94","v":""},null,null,null,{"$f":"J94+F96","v":{"$error":"#VALUE!"}},null,null,null,{"$f":"IFERROR(J96+N94,\"\")","v":""}]
["F"]
["F","OBSERVAÇÕES:"]
["F","Os pagamentos somente poderão ser efetuados mediante medição e atesto pelos técnicos da Secretaria da Educação. "]

{"sheet":"Composição BDI","index":4,"n_rows":45,"n_cols":9,"rows_kept":45,"cut":false,"hidden":false,"merged":[[18,5,18,8],[17,0,17,3],[16,0,16,3],[44,0,44,3],[42,0,42,3],[43,0,43,3],[18,0,18,3],[36,0,36,3],[39,0,39,3],[38,0,38,3],[40,0,40,3],[29,0,29,2],[32,0,32,3],[33,0,33,3],[34,0,34,3],[35,0,35,3],[0,0,0,3],[2,0,2,3],[3,0,3,3],[1,0,1,3],[5,0,5,3],[4,0,4,3],[12,0,12,3],[13,0,13,3],[14,0,14,3],[15,0,15,3],[6,0,6,3],[8,0,8,3],[7,0,7,3],[9,0,9,3],[11,0,11,3],[10,0,10,3]]}
[]
[]
["UNIDADE ESCOLAR"]
[{"$f":"Orçamento!$O$4","v":"CENTRO DE ENSINO EM PERÍODO INTEGRAL VISCONDE DE MAUÁ"}]
[]
["OBRA"]
[{"$f":"Orçamento!$O$7","v":"AMPLIAÇÃO E REFORMA"}]
[]
["ENDEREÇO"]
[{"$f":"Orçamento!$R$10","v":" RUA 1016 COM RUA 1007 S/N , SETOR PEDRO LUDOVICO , CEP:74820-290"}]
[]
["CIDADE"]
[{"$f":"Orçamento!$X$7","v":"GOIÂNIA"}]
[]
["CRE"]
[{"$f":"Orçamento!$O$10","v":"CRE-GOIÂNIA"}]
[]
["DETALHAMENTO DA COMPOSIÇÃO DE BDI"]
["COMPOSIÇÃO BDI PARA OBRAS CIVIS",null,null,null,null,"BDI CONSTRUÇÃO E REFORMA"]
["DESCRIÇÃO","COEF.","TAXA % (a.m)","% no preço de venda",null,"Situação","1º Quartil","Médio","3º Quartil"]
["1) COFINS",1,0.03,{"$f":"C21","v":0.03},null,{"$f":"IF(OR(C21<G21,C21>I21),\"FORA DO INTERVALO\",\"OK\")","v":"OK"},0.03,0.03,0.03]
["2) PIS",1,6.4999999999999997E-3,{"$f":"C22","v":6.4999999999999997E-3},null,{"$f":"IF(OR(C22<G22,C22>I22),\"FORA DO INTERVALO\",\"OK\")","v":"OK"},6.4999999999999997E-3,6.4999999999999997E-3,6.4999999999999997E-3]
["3) ISSQN",1,0.03,{"$f":"C23*B23","v":0.03},null,"OK",0.02,3.5000000000000003E-2,0.05]
["4) CPRB",1,0,{"$f":"C24","v":0},null,"FORA DO INTERVALO",4.4999999999999998E-2,4.4999999999999998E-2,4.4999999999999998E-2]
["5) Administração Central",1,0.04,0.04,null,"OK",0.03,0.04,5.5E-2]
["6) Despesas Financeiras",1,5.5999999999999999E-3,5.5999999999999999E-3,null,"FORA DO INTERVALO",5.8999999999999999E-3,1.23E-2,1.3899999999999999E-2]
["7) Seguros + Garantias",1,1.1999999999999999E-3,1.1999999999999999E-3,null,"FORA DO INTERVALO",8.0000000000000002E-3,8.0000000000000002E-3,0.01]
["8) Risco",1,9.7000000000000003E-3,9.7000000000000003E-3,null,"OK",9.7000000000000003E-3,1.2699999999999999E-2,1.2699999999999999E-2]
["9) Lucro",1,6.3E-2,6.3E-2,null,"OK",6.1600000000000002E-2,7.3999999999999996E-2,8.9599999999999999E-2]
["BDI - FINAL",null,null,{"$f":"(((1+D25+D27+D28)*(1+D26)*(1+D29))/(1-(D21+D22+D23+D24))-1)","v":0.20338778523835055},null,{"$f":"IF(OR(D30<G30,D30>I30),\"FORA DO INTERVALO\",\"OK\")","v":"FORA DO INTERVALO"},0.2034,0.22120000000000001,0.25]
[]
["Notas:"]
["(1) e (2) Alíquota definida por lei."]
["(3) Alíquota e base de cálculo definidas pela legislação municipal."]
["(4) Alíquota definida pelas leis 12.546/11, 12844/13 e 13.161/15 (CPRB – contribuição previdenciária sobre a receita bruta)."]
["(5) Valores definidos a partir dos limites no Acórdão nº 2.622/2013 - TCU – Plenário. Valores entre o 1º e 3º quartis."]
["(6) Valor calculado pela expressão matemática do acórdão 2.369/2011 – TCU – Plenário e disponibilizado pela AGETOP em dezembro de 2018. (Foi utilizado para o cálculo a média da Taxa SELIC no período de 11/2017 a 10/2018)"]
[]
["(7) Valores definidos pela AGETOP a partir dos limites no Acórdão nº 2.622/2013 - TCU – Plenário. Valores médios. \n\nObservação da AGETOP: (Seguros contra erros de execução, incêndio e explosão, danos da natureza (vendaval, destelhamento, alagamento, inundação, desmoronamento, geadas etc.), emprego de material defeituoso ou inadequado, roubo e/ou furto qualificado, quebra de equipamentos, desmoronamento de estrutura, nas modalidades de Obras Civis em Construção (OCC); Instalação e Montagem (IM); e Obras Civis em Construção e Instalação e Montagem (OCC/IM). Bem como coberturas adicionais para ampliação dessas coberturas básicas, como: cobertura de responsabilidade civil geral, cobertura de responsabilidade civil cruzada, cobertura de despesas extraordinárias, cobertura de tumultos, cobertura de desentulho do local, cobertura de riscos do fabricante, dentre outras, incluindo o seguro de vida em grupo regido pela convenção coletiva dos trabalhadores na indústria da construção civil). A partir de 24/02/2015 por intermédio da Portaria 449/2015 a Presidência da AGETOP, na pessoa do Senhor Jayme Eduardo Rincon, determinou a exclusão dos valores referentes aos Seguros de Risco de Engenharia e Responsabilidade Civil do Profissional na composição do cálculo do B.D.I.."]
["(8) Valores definidos a partir dos limites no Acórdão nº 2.622/2013 - TCU – Plenário. Valores entre 1º e 3° quartis."]
["(9) Valores definidos a partir dos limites definidos no Acórdão nº 2.622/2013 - TCU – Plenário. Valores adotados e praticados no mercado ( “ ex ante ” ) ou aqueles entre os 1º e 3º quartis."]
[]
["(*) A fórmula para estipulação da taxa de BDI estimado adotado é a mesma que foi aplicada para a obtenção das tabelas contidas no Acórdão n. 2.622/2013 – TCUPlenário"]
[]
["Obs.: Para obras com valores superiores a R$ 20.000.000,00 sugere-se recalcular o BDI, dimensionando as taxas de administração central e lucro para patamares inferiores ao estipulado acima."]

{"sheet":"Relatório CENTRAL","index":5,"n_rows":40,"n_cols":5,"rows_kept":40,"cut":false,"hidden":false,"merged":[[0,1,0,4],[6,3,6,4],[9,3,9,4],[1,1,1,4],[2,1,2,2],[2,3,2,4],[3,1,3,2],[3,3,3,4],[4,1,4,4],[5,1,5,2],[5,3,5,4],[6,1,6,2],[7,1,7,4],[8,1,8,2],[8,3,8,4],[9,1,9,2],[10,1,10,4],[11,1,11,4],[39,1,39,2],[9,0,11,0]]}
[]
[]
[null,"UNIDADE ESCOLAR",null,"CIDADE"]
[null,{"$f":"Orçamento!$O$4","v":"CENTRO DE ENSINO EM PERÍODO INTEGRAL VISCONDE DE MAUÁ"},null,{"$f":"Orçamento!$X$7","v":"GOIÂNIA"}]
[]
[null,"OBRA",null,"CRE"]
[null,{"$f":"Orçamento!$O$7","v":"AMPLIAÇÃO E REFORMA"},null,{"$f":"Orçamento!$O$10","v":"CRE-GOIÂNIA"}]
[]
[null,"ENDEREÇO",null,"DATA"]
["FILTRO",{"$f":"Orçamento!$R$10","v":" RUA 1016 COM RUA 1007 S/N , SETOR PEDRO LUDOVICO , CEP:74820-290"},null,{"$f":"Orçamento!$S$7","v":"2020-07-28"}]
[]
[null,"RELATÓRIO CENTRAL"]
["↓","CÓDIGO","ETAPA","PREÇO  (R$) C/ BDI","PARTIC  ( % )"]
[{"$f":"IF(D14>0,\"F\",\"\")","v":""},{"$f":"Orçamento!O429","v":"a."},{"$f":"Orçamento!P429","v":"SERVIÇOS PRELIMINARES"},{"$f":"Orçamento!X429","v":0},{"$f":"Orçamento!AA429","v":0}]
[{"$f":"IF(D15>0,\"F\",\"\")","v":""},{"$f":"Orçamento!O430","v":"b."},{"$f":"Orçamento!P430","v":"TRANSPORTES"},{"$f":"Orçamento!X430","v":0},{"$f":"Orçamento!AA430","v":0}]
["",{"$f":"Orçamento!O431","v":"c."},{"$f":"Orçamento!P431","v":"SERVIÇO EM TERRA"},{"$f":"Orçamento!X431","v":0},{"$f":"Orçamento!AA431","v":0}]
["",{"$f":"Orçamento!O432","v":"d."},{"$f":"Orçamento!P432","v":"FUNDAÇÕES E SONDAGENS"},{"$f":"Orçamento!X432","v":0},{"$f":"Orçamento!AA432","v":0}]
["",{"$f":"Orçamento!O433","v":"e."},{"$f":"Orçamento!P433","v":"ESTRUTURA"},{"$f":"Orçamento!X433","v":0},{"$f":"Orçamento!AA433","v":0}]
["",{"$f":"Orçamento!O434","v":"f."},{"$f":"Orçamento!P434","v":"INSTALAÇÕES ELÉTRICAS"},{"$f":"Orçamento!X434","v":0},{"$f":"Orçamento!AA434","v":0}]
["",{"$f":"Orçamento!O435","v":"g."},{"$f":"Orçamento!P435","v":"INSTALAÇÕES HIDROSSANITÁRIAS"},{"$f":"Orçamento!X435","v":0},{"$f":"Orçamento!AA435","v":0}]
["",{"$f":"Orçamento!O436","v":"h"},{"$f":"Orçamento!P436","v":"INSTALAÇÕES ESPECIAIS"},{"$f":"Orçamento!X436","v":0},{"$f":"Orçamento!AA436","v":0}]
["",{"$f":"Orçamento!O437","v":"i."},{"$f":"Orçamento!P437","v":"ALVENARIAS E DIVISÓRIAS"},{"$f":"Orçamento!X437","v":0},{"$f":"Orçamento!AA437","v":0}]
["",{"$f":"Orçamento!O438","v":"j."},{"$f":"Orçamento!P438","v":"ALVENARIA AUTO-PORTANTE"},{"$f":"Orçamento!X438","v":0},{"$f":"Orçamento!AA438","v":0}]
["",{"$f":"Orçamento!O439","v":"k."},{"$f":"Orçamento!P439","v":"IMPERMEABILIZAÇÃO"},{"$f":"Orçamento!X439","v":0},{"$f":"Orçamento!AA439","v":0}]
["",{"$f":"Orçamento!O440","v":"l."},{"$f":"Orçamento!P440","v":"ISOLAMENTO TÉRMICO E ACÚSTICO"},{"$f":"Orçamento!X440","v":0},{"$f":"Orçamento!AA440","v":0}]
["",{"$f":"Orçamento!O441","v":"m."},{"$f":"Orçamento!P441","v":"ESTRUTURA DE MADEIRA"},{"$f":"Orçamento!X441","v":0},{"$f":"Orçamento!AA441","v":0}]
["",{"$f":"Orçamento!O442","v":"n."},{"$f":"Orçamento!P442","v":"ESTRUTURAS METÁLICAS"},{"$f":"Orçamento!X442","v":0},{"$f":"Orçamento!AA442","v":0}]
["",{"$f":"Orçamento!O443","v":"o."},{"$f":"Orçamento!P443","v":"COBERTURAS"},{"$f":"Orçamento!X443","v":0},{"$f":"Orçamento!AA443","v":0}]
["",{"$f":"Orçamento!O444","v":"p."},{"$f":"Orçamento!P444","v":"ESQUADRIAS DE MADEIRA"},{"$f":"Orçamento!X444","v":0},{"$f":"Orçamento!AA444","v":0}]
["",{"$f":"Orçamento!O445","v":"q."},{"$f":"Orçamento!P445","v":"ESQUADRIAS METÁLICAS"},{"$f":"Orçamento!X445","v":0},{"$f":"Orçamento!AA445","v":0}]
["",{"$f":"Orçamento!O446","v":"r."},{"$f":"Orçamento!P446","v":"VIDROS"},{"$f":"Orçamento!X446","v":0},{"$f":"Orçamento!AA446","v":0}]
["",{"$f":"Orçamento!O447","v":"s."},{"$f":"Orçamento!P447","v":"REVESTIMENTO DE PAREDE"},{"$f":"Orçamento!X447","v":0},{"$f":"Orçamento!AA447","v":0}]
["",{"$f":"Orçamento!O448","v":"t."},{"$f":"Orçamento!P448","v":"FORROS"},{"$f":"Orçamento!X448","v":0},{"$f":"Orçamento!AA448","v":0}]
["",{"$f":"Orçamento!O449","v":"u."},{"$f":"Orçamento!P449","v":"REVESTIMENTO DE PISO"},{"$f":"Orçamento!X449","v":0},{"$f":"Orçamento!AA449","v":0}]
["",{"$f":"Orçamento!O450","v":"v."},{"$f":"Orçamento!P450","v":"FERRAGENS"},{"$f":"Orçamento!X450","v":0},{"$f":"Orçamento!AA450","v":0}]
["",{"$f":"Orçamento!O451","v":"w."},{"$f":"Orçamento!P451","v":"MARCENARIA"},{"$f":"Orçamento!X451","v":0},{"$f":"Orçamento!AA451","v":0}]
["",{"$f":"Orçamento!O452","v":"x."},{"$f":"Orçamento!P452","v":"ADMINISTRAÇÃO"},{"$f":"Orçamento!X452","v":0},{"$f":"Orçamento!AA452","v":0}]
["",{"$f":"Orçamento!O453","v":"y."},{"$f":"Orçamento!P453","v":"PINTURA"},{"$f":"Orçamento!X453","v":0},{"$f":"Orçamento!AA453","v":0}]
["",{"$f":"Orçamento!O454","v":"z."},{"$f":"Orçamento!P454","v":"DIVERSOS"},{"$f":"Orçamento!X454","v":0},{"$f":"Orçamento!AA454","v":0}]
["F","TOTAL GERAL DO ORÇAMENTO (R$) C/BDI",null,{"$f":"SUM(D14:D39)","v":0},{"$f":"SUM(E14:E39)","v":0}]

{"sheet":"Parc Maior Relev","index":6,"n_rows":33,"n_cols":7,"rows_kept":33,"cut":false,"hidden":false,"merged":[[10,1,10,6],[6,1,6,3],[6,4,6,6],[7,1,7,6],[8,1,8,3],[8,4,8,6],[33,3,33,7],[31,1,31,6],[0,1,0,6],[11,1,11,6],[1,1,1,6],[2,1,2,3],[2,4,2,6],[3,1,3,3],[3,4,3,6],[4,1,4,6],[5,1,5,3],[5,4,5,6],[9,1,9,3],[9,4,9,6]]}
[]
[]
[null,"UNIDADE ESCOLAR",null,null,"CÓDIGO INEP"]
[null,{"$f":"Orçamento!$O$4","v":"CENTRO DE ENSINO EM PERÍODO INTEGRAL VISCONDE DE MAUÁ"},null,null,{"$f":"Orçamento!$X$4","v":52035662}]
[]
[null,"OBRA",null,null,"CIDADE"]
[null,{"$f":"Orçamento!$O$7","v":"AMPLIAÇÃO E REFORMA"},null,null,{"$f":"Orçamento!$X$7","v":"GOIÂNIA"}]
[]
[null,"CRE",null,null,"ÁREA TOTAL CONSTRUÍDA (M²)"]
[null,{"$f":"Orçamento!$O$10","v":"CRE-GOIÂNIA"},null,null,{"$f":"Orçamento!$X$13","v":1828.8}]
[]
["FILTRO","PARCELA DE MAIOR RELEVÂNCIA"]
[{"$f":"IF(G14>0,\"F\",\"\")","v":""},"CÓDIGO","SERVIÇO","DESCRIÇÃO","UNID","QUANT","PARC. MAIOR RELEV (100%)"]
[{"$f":"IF(G14>0,\"F\",\"\")","v":""},"f.","INSTALAÇÕES ELÉTRICAS","SUBESTAÇÃO","KVA",{"$f":"SUMIF(Orçamento!$R$20:$R$410,'Parc Maior Relev'!D14,Orçamento!$T$20:$T$410)","v":0},{"$f":"F14","v":0}]
[{"$f":"IF(SUM(G16:G30)>0,\"F\",\"\")","v":"F"},"CÓDIGO","SERVIÇO","DESCRIÇÃO","UNID","QUANT","PARC. MAIOR RELEV (50%)"]
[{"$f":"IF(G16>0,\"F\",\"\")","v":""},"e.","ESTRUTURA","CONCRETO","M3",{"$f":"SUMIF(Orçamento!$R$20:$R$410,'Parc Maior Relev'!D16,Orçamento!$T$20:$T$410)","v":0},{"$f":"F16*0.5","v":0}]
[{"$f":"IF(G17>0,\"F\",\"\")","v":""},"f.","INSTALAÇÕES ELÉTRICAS","INSTALAÇÕES ELÉTRICAS","KVA",{"$f":"SUMIF(Orçamento!$R$20:$R$410,'Parc Maior Relev'!D17,Orçamento!$T$20:$T$410)","v":0},{"$f":"F17*0.5","v":0}]
[{"$f":"IF(G18>0,\"F\",\"\")","v":""},"o.","COBERTURAS","COBERTURA CERÂMICA","M2",{"$f":"SUMIF(Orçamento!$R$20:$R$410,'Parc Maior Relev'!D18,Orçamento!$T$20:$T$410)","v":0},0]
["","o.","COBERTURAS","COBERTURA COM TELHA METÁLICA","M2",{"$f":"SUMIF(Orçamento!$R$20:$R$410,'Parc Maior Relev'!D19,Orçamento!$T$20:$T$410)","v":0},0]
["","s.","REVESTIMENTO DE PAREDE","CHAPISCO","M2",{"$f":"SUMIF(Orçamento!$R$20:$R$410,'Parc Maior Relev'!D20,Orçamento!$T$20:$T$410)","v":0},0]
["","s.","REVESTIMENTO DE PAREDE","REBOCO","M2",{"$f":"SUMIF(Orçamento!$R$20:$R$410,'Parc Maior Relev'!D21,Orçamento!$T$20:$T$410)","v":0},0]
["F","s.","REVESTIMENTO DE PAREDE","REVESTIMENTO CERÂMICO","M2",135.63,67.814999999999998]
["","t.","FORROS","FORRO DE GESSO","M2",{"$f":"SUMIF(Orçamento!$R$20:$R$410,'Parc Maior Relev'!D23,Orçamento!$T$20:$T$410)","v":0},0]
["","t.","FORROS","FORRO DE PVC","M2",{"$f":"SUMIF(Orçamento!$R$20:$R$410,'Parc Maior Relev'!D24,Orçamento!$T$20:$T$410)","v":0},0]
["","t.","FORROS","FORRO DE GESSO ACARTONADO","M2",{"$f":"SUMIF(Orçamento!$R$20:$R$410,'Parc Maior Relev'!D25,Orçamento!$T$20:$T$410)","v":0},0]
["","u.","REVESTIMENTO DE PISO","PISO DE GRANITINA","M2",{"$f":"SUMIF(Orçamento!$R$20:$R$410,'Parc Maior Relev'!D26,Orçamento!$T$20:$T$410)","v":0},0]
["","u.","REVESTIMENTO DE PISO","PISO LAMINADO","M2",{"$f":"SUMIF(Orçamento!$R$20:$R$410,'Parc Maior Relev'!D27,Orçamento!$T$20:$T$410)","v":0},0]
["","u.","REVESTIMENTO DE PISO","PISO DE CONCRETO DESEMPENADO","M2",{"$f":"SUMIF(Orçamento!$R$20:$R$410,'Parc Maior Relev'!D28,Orçamento!$T$20:$T$410)","v":0},0]
["","u.","REVESTIMENTO DE PISO","PISO CERÂMICO","M2",{"$f":"SUMIF(Orçamento!$R$20:$R$410,'Parc Maior Relev'!D29,Orçamento!$T$20:$T$410)","v":0},0]
["","y.","PINTURA","PINTURA","M2",{"$f":"SUMIF(Orçamento!$R$20:$R$410,'Parc Maior Relev'!D30,Orçamento!$T$20:$T$410)","v":0},0]
["F"]
["F","(*) Para os fins do inciso I dp § 1º do Art. 30 da Lei Federal 8.666/93, são consideradas parcelas de maior relevância técnica as execuções apresentadas"]
["F"]

{"sheet":"Composições","index":7,"n_rows":224,"n_cols":10,"rows_kept":224,"cut":false,"hidden":false,"merged":[[215,5,216,5],[215,6,215,7],[215,8,215,9],[219,1,219,7],[223,1,223,7],[215,0,216,0],[215,1,216,1],[215,2,216,2],[215,3,216,3],[215,4,216,4],[205,5,206,5],[205,6,205,7],[205,8,205,9],[209,1,209,7],[213,1,213,7],[205,0,206,0],[205,1,206,1],[205,2,206,2],[205,3,206,3],[205,4,206,4],[192,5,193,5],[192,6,192,7],[192,8,192,9],[196,1,196,7],[203,1,203,7],[192,0,193,0],[192,1,193,1],[192,2,193,2],[192,3,193,3],[192,4,193,4],[182,5,183,5],[182,6,182,7],[182,8,182,9],[186,1,186,7],[190,1,190,7],[182,0,183,0],[182,1,183,1],[182,2,183,2],[182,3,183,3],[182,4,183,4],[172,5,173,5],[172,6,172,7],[172,8,172,9],[176,1,176,7],[180,1,180,7],[172,0,173,0],[172,1,173,1],[172,2,173,2],[172,3,173,3],[172,4,173,4],[163,5,164,5],[163,6,163,7],[163,8,163,9],[168,1,168,7],[170,1,170,7],[163,0,164,0],[163,1,164,1],[163,2,164,2],[163,3,164,3],[163,4,164,4],[154,5,155,5],[154,6,154,7],[154,8,154,9],[159,1,159,7],[161,1,161,7],[154,0,155,0],[154,1,155,1],[154,2,155,2],[154,3,155,3],[154,4,155,4],[145,5,146,5],[145,6,145,7],[145,8,145,9],[150,1,150,7],[152,1,152,7],[145,0,146,0],[145,1,146,1],[145,2,146,2],[145,3,146,3],[145,4,146,4],[136,5,137,5],[136,6,136,7],[136,8,136,9],[141,1,141,7],[143,1,143,7],[136,0,137,0],[136,1,137,1],[136,2,137,2],[136,3,137,3],[136,4,137,4],[128,5,129,5],[128,6,128,7],[128,8,128,9],[132,1,132,7],[134,1,134,7],[128,0,129,0],[128,1,129,1],[128,2,129,2],[128,3,129,3],[128,4,129,4],[118,5,119,5],[118,6,118,7],[118,8,118,9],[123,1,123,7],[126,1,126,7],[118,0,119,0],[118,1,119,1],[118,2,119,2],[118,3,119,3],[118,4,119,4],[108,5,109,5],[108,6,108,7],[108,8,108,9],[113,1,113,7],[116,1,116,7],[108,0,109,0],[108,1,109,1],[108,2,109,2],[108,3,109,3],[108,4,109,4],[98,5,99,5],[98,6,98,7],[98,8,98,9],[103,1,103,7],[106,1,106,7],[98,0,99,0],[98,1,99,1],[98,2,99,2],[98,3,99,3],[98,4,99,4],[88,5,89,5],[88,6,88,7],[88,8,88,9],[93,1,93,7],[96,1,96,7],[88,0,89,0],[88,1,89,1],[88,2,89,2],[88,3,89,3],[88,4,89,4],[80,5,81,5],[80,6,80,7],[80,8,80,9],[84,1,84,7],[86,1,86,7],[80,0,81,0],[80,1,81,1],[80,2,81,2],[80,3,81,3],[80,4,81,4],[71,5,72,5],[71,6,71,7],[71,8,71,9],[76,1,76,7],[78,1,78,7],[71,0,72,0],[71,1,72,1],[71,2,72,2],[71,3,72,3],[71,4,72,4],[63,5,64,5],[63,6,63,7],[63,8,63,9],[67,1,67,7],[69,1,69,7],[63,0,64,0],[63,1,64,1],[63,2,64,2],[63,3,64,3],[63,4,64,4],[54,5,55,5],[54,6,54,7],[54,8,54,9],[59,1,59,7],[61,1,61,7],[54,0,55,0],[54,1,55,1],[54,2,55,2],[54,3,55,3],[54,4,55,4],[45,5,46,5],[45,6,45,7],[45,8,45,9],[50,1,50,7],[52,1,52,7],[45,0,46,0],[45,1,46,1],[45,2,46,2],[45,3,46,3],[45,4,46,4],[23,5,24,5],[23,6,23,7],[23,8,23,9],[28,1,28,7],[43,1,43,7],[23,0,24,0],[23,1,24,1],[23,2,24,2],[23,3,24,3],[23,4,24,4],[16,5,17,5],[16,6,16,7],[16,8,16,9],[19,1,19,7],[21,1,21,7],[16,0,17,0],[16,1,17,1],[16,2,17,2],[16,3,17,3],[16,4,17,4],[15,0,15,9],[13,0,13,2],[13,3,13,6],[1,0,1,9],[3,7,3,9],[4,7,4,9],[6,7,6,9],[7,7,7,9],[6,0,6,6],[10,8,10,9],[13,8,13,9],[14,0,14,9],[8,0,8,9],[5,0,5,9],[2,0,2,9],[0,0,0,8],[10,0,10,2],[10,3,10,6],[11,0,11,9],[12,0,12,2],[12,3,12,6],[12,7,12,8],[7,0,7,6],[9,0,9,2],[9,3,9,6],[9,7,9,8],[3,0,3,6],[4,0,4,6]]}
[]
[]
[]
["UNIDADE ESCOLAR",null,null,null,null,null,null,"CÓDIGO INEP"]
[{"$f":"Orçamento!$O$4","v":"CENTRO DE ENSINO EM PERÍODO INTEGRAL VISCONDE DE MAUÁ"},null,null,null,null,null,null,{"$f":"Orçamento!$X$4","v":52035662}]
[]
["OBRA",null,null,null,null,null,null,"CIDADE"]
[{"$f":"Orçamento!$O$7","v":"AMPLIAÇÃO E REFORMA"},null,null,null,null,null,null,{"$f":"Orçamento!$X$7","v":"GOIÂNIA"}]
[]
["CRE",null,null,"ENDEREÇO",null,null,null,"REFERÊNCIA AGETOP"]
[{"$f":"Orçamento!$O$10","v":"CRE-GOIÂNIA"},null,null,{"$f":"Orçamento!$R$10","v":" RUA 1016 COM RUA 1007 S/N , SETOR PEDRO LUDOVICO , CEP:74820-290"},null,null,null,{"$f":"Orçamento!$S$10","v":"ABR/19"},{"$f":"Orçamento!$T$10","v":"ONERADA"}]
[]
["DATA",null,null,"ÁREA TOTAL CONSTRUÍDA (M²)",null,null,null,"REFERÊNCIA SINAPI"]
[{"$f":"Orçamento!$S$7","v":"2020-07-28"},null,null,{"$f":"Orçamento!$X$13","v":1828.8},null,null,null,{"$f":"Orçamento!$X$10","v":"ABR/20"},{"$f":"Orçamento!$Y$10","v":"ONERADA"}]
[]
["COMPOSIÇÕES DE CUSTOS UNITÁRIOS - SEE-GO"]
[10,"FONTE","CÓDIGO","DESCRIÇÃO","UNIDADE","COEFIC.","CUSTO UNITÁRIO",null,"CUSTO  TOTAL (A) + (B) + (C) + (D) + (E)"]
[null,null,null,null,null,null,"DESONERADO","NÃO DESONER.","DESONERADO","NÃO DESONER."]
[null,"COMPOSIÇÃO","COMP 010_SEE","DEMOLIÇÃO DE GRADE/GRELHA/CORRIMÃO/GUARDA CORPO - METÁLICO","M2",null,"-","-",4.0599999999999996,4.71]
[null,"MÃO DE OBRA (B) - TOTAL",null,null,null,null,null,null,0,0]
[null,"AGETOP",20106,"RETIRADA DE JANELAS OU PORTAIS C/ TRANSP. ATÉ CB. E CARGA","m2    ",1,4.0599999999999996,4.71,4.0599999999999996,4.71]
[null,"MATERIAL (C) - TOTAL",null,null,null,null,null,null,4.0599999999999996,4.71]
[]
[84,"FONTE","CÓDIGO","DESCRIÇÃO","UNIDADE","COEFIC.","CUSTO UNITÁRIO",null,"CUSTO  TOTAL (A) + (B) + (C) + (D) + (E)"]
[null,null,null,null,null,null,"DESONERADO","NÃO DESONER.","DESONERADO","NÃO DESONER."]
[null,"COMPOSIÇÃO","COMP 084_SEE","GUARDA-CORPO COM CORRIMÃO - SEDUC","M",null,null,null,206.14000000000001,211.22000000000003]
[null,"AGETOP_I",25,"OFICIAL \"B\"","h     ",1.1000000000000001,13.95,16.16,15.35,17.78]
[null,"AGETOP_I",8,"AJUDANTE","h     ",1.1000000000000001,8.75,10.14,9.6300000000000008,11.15]
[null,"MÃO DE OBRA (B) - TOTAL",null,null,null,null,null,null,24.98,28.93]
[null,"AGETOP_I",2376,"TUBO INDUSTRIAL 2\" CHAPA 13 ","Kg",7.7778,5.23,5.23,40.68,40.68]
[null,"AGETOP_I",2504,"TUBO INDUSTRIAL D=25 MM CHAPA 13 ","Kg",4.6319999999999997,5.07,5.07,23.48,23.48]
[null,"AGETOP_I",2377,"TUBO INDUSTRIAL 40X40 CH.13","Kg",6.3419999999999996,5.07,5.07,32.15,32.15]
[null,"AGETOP_I",2421,"TUBO INDUSTRIAL 1.1/2\" CHAPA 13 ","Kg",1.4862,5.07,5.07,7.54,7.54]
[null,"AGETOP_I",2417,"MASSA PLASTICA","Kg",0.2041,10.58,10.58,2.16,2.16]
[null,"AGETOP_I",2246,"ELETRODO 2.5 OK","Kg",0.11459999999999999,8.6999999999999993,8.6999999999999993,1,1]
[null,"AGETOP_I",1672,"LIXA PARA FERRO ( NÚMERO 100 )","un",0.25509999999999999,2.12,2.12,0.54,0.54]
[null,"AGETOP_I",1264,"DISCO DE DESBASTE 7/8\" P/ CONC./FERRO (1/4\" X 7\")","un",5.0999999999999997E-2,7,7,0.36,0.36]
[null,"AGETOP_I",1334,"DISCO DE CORTE DIAM. 5/8\"- 10\"","un",0.373,5.5,5.5,2.0499999999999998,2.0499999999999998]
[null,"AGETOP_I",2902,"FABRICAÇÃO / MONTAGEM","un",1,50.44,50.44,50.44,50.44]
[null,"AGETOP_I",2150,"CHAPA DE FERRO DOBRADA No.13","Kg",0.43519999999999998,5.28,5.28,2.2999999999999998,2.2999999999999998]
[null,"AGETOP_I",2719,"CHAPA PERFILADA 3/16\"","Kg",1.0979999999999999,5.04,5.04,5.53,5.53]
[null,"AGETOP_I",2436,"ACO CA-25 - 6,3 MM (1/4\") - BARRA LISA A-36","Kg",0.38124999999999998,5.13,5.13,1.96,1.96]
[null,"AGETOP",261602,"PINT.ESMALTE/ESQUAD.FERRO C/FUNDO ANTICOR.","m2    ",0.78,14.07,15.51,10.97,12.1]
[null,"MATERIAL (C) - TOTAL",null,null,null,null,null,null,181.16000000000003,182.29000000000002]
[]
[375,"FONTE","CÓDIGO","DESCRIÇÃO","UNIDADE","COEFIC.","CUSTO UNITÁRIO",null,"CUSTO  TOTAL (A) + (B) + (C) + (D) + (E)"]
[null,null,null,null,null,null,"DESONERADO","NÃO DESONER.","DESONERADO","NÃO DESONER."]
[null,"COMPOSIÇÃO","COMP 375_SEE","REFLETOR DE LED HOLOFORTE 50W","UN ",null,null,null,82.16,83.32]
[null,"AGETOP_I",12,"ELETRICISTA","h     ",0.41649999999999998,13.95,16.16,5.81,6.73]
[null,"AGETOP_I",8,"AJUDANTE","h     ",0.17349999999999999,8.75,10.14,1.52,1.76]
[null,"MÃO DE OBRA (B) - TOTAL",null,null,null,null,null,null,7.33,8.49]
[null,"COTAÇÃO","COT 190_SEE","REFLETOR DE LED HOLOFORTE 50W","UN",1,74.830000000000013,74.830000000000013,74.83,74.83]
[null,"MATERIAL (C) - TOTAL",null,null,null,null,null,null,74.83,74.83]
[]
[40,"FONTE","CÓDIGO","DESCRIÇÃO","UNIDADE","COEFIC.","CUSTO UNITÁRIO",null,"CUSTO  TOTAL (A) + (B) + (C) + (D) + (E)"]
[null,null,null,null,null,null,"DESONERADO","NÃO DESONER.","DESONERADO","NÃO DESONER."]
[null,"COMPOSIÇÃO","COMP 040_SEE","CONJUNTO MOTOR-BOMBA ELÉTRICA TRIFÁSICO 380/220 V PARA VZ= 24,33 M³/H, HM= 46,24 M POTÊNCIA= 7,5 CV","UN ",null,null,null,3974.27,4003.07]
[null,"AGETOP_I",8,"AJUDANTE","h     ",8,8.75,10.14,70,81.12]
[null,"AGETOP_I",11,"ENCANADOR","h     ",8,13.95,16.16,111.6,129.28]
[null,"MÃO DE OBRA (B) - TOTAL",null,null,null,null,null,null,181.6,210.4]
[null,"COTAÇÃO","COT 008_SEE","CONJUNTO MOTOR-BOMBA ELÉTRICA TRIFÁSICO 380/220 V PARA VZ= 24,33 M³/H, HM= 46,24 M POTÊNCIA= 7,5 CV","UN ",1,3792.6666666666665,3792.6666666666665,3792.67,3792.67]
[null,"MATERIAL (C) - TOTAL",null,null,null,null,null,null,3792.67,3792.67]
[]
[78,"FONTE","CÓDIGO","DESCRIÇÃO","UNIDADE","COEFIC.","CUSTO UNITÁRIO",null,"CUSTO  TOTAL (A) + (B) + (C) + (D) + (E)"]
[null,null,null,null,null,null,"DESONERADO","NÃO DESONER.","DESONERADO","NÃO DESONER."]
[null,"COMPOSIÇÃO","COMP 078_SEE","TAMPÃO CEGO COM CORRENTE 1 1/2\"","UN ",null,null,null,61.3,61.91]
[null,"AGETOP_I",11,"ENCANADOR","h     ",0.28000000000000003,13.95,16.16,3.91,4.5199999999999996]
[null,"MÃO DE OBRA (B) - TOTAL",null,null,null,null,null,null,3.91,4.5199999999999996]
[null,"SINAPI_I",20964,"TAMPAO COM CORRENTE, EM LATAO, ENGATE RAPIDO 1 1/2\", PARA INSTALACAO PREDIAL DE COMBATE A INCENDIO","UN    ",1,57.39,57.39,57.39,57.39]
[null,"MATERIAL (C) - TOTAL",null,null,null,null,null,null,57.39,57.39]
[]
[17,"FONTE","CÓDIGO","DESCRIÇÃO","UNIDADE","COEFIC.","CUSTO UNITÁRIO",null,"CUSTO  TOTAL (A) + (B) + (C) + (D) + (E)"]
[null,null,null,null,null,null,"DESONERADO","NÃO DESONER.","DESONERADO","NÃO DESONER."]
[null,"COMPOSIÇÃO","COMP 017_SEE","REDUCAO GIRATÓRIA TIPO STORZ LATAO P/ INST. PREDIAL COMBATE A INCENDIO ENGATE RAPIDO 2.1/2\" X 1.1/2\"","UN ",null,"-","-",108.61999999999999,109.19999999999999]
[null,"AGETOP_I",8,"AJUDANTE","h     ",0.16,8.75,10.14,1.4,1.62]
[null,"AGETOP_I",11,"ENCANADOR","h     ",0.16,13.95,16.16,2.23,2.59]
[null,"MÃO DE OBRA (B) - TOTAL",null,null,null,null,null,null,3.63,4.21]
[null,"SINAPI_I",20972,"REDUCAO FIXA TIPO STORZ, ENGATE RAPIDO 2.1/2\" X 1.1/2\", EM LATAO, PARA INSTALACAO PREDIAL COMBATE A INCENDIO PREDIAL","UN    ",1,104.99,104.99,104.99,104.99]
[null,"MATERIAL (C) - TOTAL",null,null,null,null,null,null,104.99,104.99]
[]
[18,"FONTE","CÓDIGO","DESCRIÇÃO","UNIDADE","COEFIC.","CUSTO UNITÁRIO",null,"CUSTO  TOTAL (A) + (B) + (C) + (D) + (E)"]
[null,null,null,null,null,null,"DESONERADO","NÃO DESONER.","DESONERADO","NÃO DESONER."]
[null,"COMPOSIÇÃO","COMP 018_SEE","CHAVE DUPLA P/ CONEXÕES TIPO STORZ EM LATÃO ENGATE RÁPIDO 1 1/2\" X 2 1/2\"","UN ",null,"-","-",16.079999999999998,16.41]
[null,"AGETOP_I",11,"ENCANADOR","h     ",0.15,13.95,16.16,2.09,2.42]
[null,"MÃO DE OBRA (B) - TOTAL",null,null,null,null,null,null,2.09,2.42]
[null,"SINAPI_I",20971,"CHAVE DUPLA PARA CONEXOES TIPO STORZ, ENGATE RAPIDO 1 1/2\" X 2 1/2\", EM LATAO, PARA INSTALACAO PREDIAL COMBATE A INCENDIO","UN    ",1,13.99,13.99,13.99,13.99]
[null,"MATERIAL (C) - TOTAL",null,null,null,null,null,null,13.99,13.99]
[]
[87,"FONTE","CÓDIGO","DESCRIÇÃO","UNIDADE","COEFIC.","CUSTO UNITÁRIO",null,"CUSTO  TOTAL (A) + (B) + (C) + (D) + (E)"]
[null,null,null,null,null,null,"DESONERADO","NÃO DESONER.","DESONERADO","NÃO DESONER."]
[null,"COMPOSIÇÃO","COMP 087_SEE","REGISTRO DE GAVETA COM HASTE ASCENDENTE DE BRONZE 2 1/2\"","UN ",null,null,null,258.56,262.7]
[null,"AGETOP_I",8,"AJUDANTE","h     ",1.1499999999999999,8.75,10.14,10.06,11.66]
[null,"AGETOP_I",11,"ENCANADOR","h     ",1.1499999999999999,13.95,16.16,16.04,18.579999999999998]
[null,"MÃO DE OBRA (B) - TOTAL",null,null,null,null,null,null,26.1,30.24]
[null,"AGETOP_I","H689","FITA VEDAROSCA 12 MM","m",2.82,0.28000000000000003,0.28000000000000003,0.79,0.79]
[null,"COTAÇÃO","COT 017_SEE","REGISTRO DE GAVETA COM HASTE ASCENDENTE DE BRONZE 2 1/2\"","UN ",1,231.66666666666666,231.66666666666666,231.67,231.67]
[null,"MATERIAL (C) - TOTAL",null,null,null,null,null,null,232.45999999999998,232.45999999999998]
[]
[30,"FONTE","CÓDIGO","DESCRIÇÃO","UNIDADE","COEFIC.","CUSTO UNITÁRIO",null,"CUSTO  TOTAL (A) + (B) + (C) + (D) + (E)"]
[null,null,null,null,null,null,"DESONERADO","NÃO DESONER.","DESONERADO","NÃO DESONER."]
[null,"COMPOSIÇÃO","COMP 030_SEE","COTOVELO DE FERRO GALV. 90° X 2 1/2\"","UN ",null,null,null,80.16,83.48]
[null,"AGETOP_I",8,"AJUDANTE","h     ",0.92,8.75,10.14,8.0500000000000007,9.33]
[null,"AGETOP_I",11,"ENCANADOR","h     ",0.92,13.95,16.16,12.83,14.87]
[null,"MÃO DE OBRA (B) - TOTAL",null,null,null,null,null,null,20.880000000000003,24.2]
[null,"SINAPI_I",3470,"COTOVELO 90 GRAUS DE FERRO GALVANIZADO, COM ROSCA BSP, DE 2 1/2\"","UN    ",1,58.72,58.72,58.72,58.72]
[null,"AGETOP_I","H689","FITA VEDAROSCA 12 MM","m",2,0.28000000000000003,0.28000000000000003,0.56000000000000005,0.56000000000000005]
[null,"MATERIAL (C) - TOTAL",null,null,null,null,null,null,59.28,59.28]
[]
[77,"FONTE","CÓDIGO","DESCRIÇÃO","UNIDADE","COEFIC.","CUSTO UNITÁRIO",null,"CUSTO  TOTAL (A) + (B) + (C) + (D) + (E)"]
[null,null,null,null,null,null,"DESONERADO","NÃO DESONER.","DESONERADO","NÃO DESONER."]
[null,"COMPOSIÇÃO","COMP 077_SEE","UNIAO FERRO GALV C/ASSENTO CONICO BRONZE 2 1/2\"","UN ",null,null,null,177.21,178.65]
[null,"AGETOP_I",8,"AJUDANTE","h     ",0.4,8.75,10.14,3.5,4.0599999999999996]
[null,"AGETOP_I",11,"ENCANADOR","h     ",0.4,13.95,16.16,5.58,6.46]
[null,"MÃO DE OBRA (B) - TOTAL",null,null,null,null,null,null,9.08,10.52]
[null,"AGETOP_I","H689","FITA VEDAROSCA 12 MM","m",2.4,0.28000000000000003,0.28000000000000003,0.67,0.67]
[null,"SINAPI_I",12427,"UNIAO COM ASSENTO CONICO DE BRONZE, DIAMETRO 2 1/2\"","UN    ",1,167.46,167.46,167.46,167.46]
[null,"MATERIAL (C) - TOTAL",null,null,null,null,null,null,168.13,168.13]
[]
[347,"FONTE","CÓDIGO","DESCRIÇÃO","UNIDADE","COEFIC.","CUSTO UNITÁRIO",null,"CUSTO  TOTAL (A) + (B) + (C) + (D) + (E)"]
[null,null,null,null,null,null,"DESONERADO","NÃO DESONER.","DESONERADO","NÃO DESONER."]
[null,"COMPOSIÇÃO","COMP 347_SEE","ADAPTADOR PVC SOLDAVEL, COM FLANGES LIVRES, 75 MM X 2 1/2\", PARA CAIXA D' AGUA","UN ",null,null,null,121.25,121.75]
[null,"AGETOP_I",11,"ENCANADOR","h     ",0.14000000000000001,13.95,16.16,1.95,2.2599999999999998]
[null,"AGETOP_I",8,"AJUDANTE","h     ",0.14000000000000001,8.75,10.14,1.23,1.42]
[null,"MÃO DE OBRA (B) - TOTAL",null,null,null,null,null,null,3.1799999999999997,3.6799999999999997]
[null,"SINAPI_I",83,"ADAPTADOR PVC SOLDAVEL, COM FLANGES LIVRES, 75 MM X 2  1/2\", PARA CAIXA D' AGUA","UN    ",1,117.54,117.54,117.54,117.54]
[null,"AGETOP_I","H689","FITA VEDAROSCA 12 MM","m",1.88,0.28000000000000003,0.28000000000000003,0.53,0.53]
[null,"MATERIAL (C) - TOTAL",null,null,null,null,null,null,118.07000000000001,118.07000000000001]
[]
[22,"FONTE","CÓDIGO","DESCRIÇÃO","UNIDADE","COEFIC.","CUSTO UNITÁRIO",null,"CUSTO  TOTAL (A) + (B) + (C) + (D) + (E)"]
[null,null,null,null,null,null,"DESONERADO","NÃO DESONER.","DESONERADO","NÃO DESONER."]
[null,"COMPOSIÇÃO","COMP 022_SEE","TAMPÃO FOFO 40X50CM C/INSCRIÇÃO ","UN ",null,"-","-",254.15,254.48]
[null,"AGETOP_I",11,"ENCANADOR","h     ",0.15,13.95,16.16,2.09,2.42]
[null,"MÃO DE OBRA (B) - TOTAL",null,null,null,null,null,null,2.09,2.42]
[null,"SINAPI_I",11293,"TAMPAO FOFO SIMPLES COM BASE, CLASSE A15 CARGA MAX 1,5 T, 400 X 500 MM, COM INSCRICAO INCENDIO","UN    ",1,252.06,252.06,252.06,252.06]
[null,"MATERIAL (C) - TOTAL",null,null,null,null,null,null,252.06,252.06]
[]
[546,"FONTE","CÓDIGO","DESCRIÇÃO","UNID ","COEFIC.","CUSTO UNITÁRIO",null,"CUSTO  TOTAL (A) + (B) + (C) + (D) + (E)"]
[null,null,null,null,null,null,"DESONERADO","NÃO DESONER.","DESONERADO","NÃO DESONER."]
[null,"COMPOSIÇÃO","COMP 546_SEE","BUJÃO DE REBORDO 2.1/2\"","UN ","-","-","-",21.09,21.34]
[null,"AGETOP_I",8,"AJUDANTE","h     ",7.0000000000000007E-2,8.75,10.14,0.61,0.71]
[null,"AGETOP_I",11,"ENCANADOR","h     ",7.0000000000000007E-2,13.95,16.16,0.98,1.1299999999999999]
[null,"MÃO DE OBRA (B) - TOTAL",null,null,null,null,null,null,1.5899999999999999,1.8399999999999999]
[null,"COTAÇÃO","COT 286_SEE","BUJÃO DE REBORDO 2.1/2\"","UN ",1,19.5,19.5,19.5,19.5]
[null,"MATERIAL (C) - TOTAL",null,null,null,null,null,null,19.5,19.5]
[]
[186,"FONTE","CÓDIGO","DESCRIÇÃO","UNIDADE","COEFIC.","CUSTO UNITÁRIO",null,"CUSTO  TOTAL (A) + (B) + (C) + (D) + (E)"]
[null,null,null,null,null,null,"DESONERADO","NÃO DESONER.","DESONERADO","NÃO DESONER."]
[null,"COMPOSIÇÃO","COMP 186_SEE","BOTOEIRA BOMBA DE INCÊNDIO C/ MARTELO CONVENCIONAL/ ANALÓGICA","UN ",null,null,null,86.2,89.8]
[null,"AGETOP_I",8,"AJUDANTE","h     ",1,8.75,10.14,8.75,10.14]
[null,"AGETOP_I",12,"ELETRICISTA","h     ",1,13.95,16.16,13.95,16.16]
[null,"MÃO DE OBRA (B) - TOTAL",null,null,null,null,null,null,22.7,26.3]
[null,"COTAÇÃO","COT 088_SEE","BOTOEIRA BOMBA DE INCÊNDIO C/ MARTELO CONVENCIONAL/ ANALÓGICA","UN",1,63.5,63.5,63.5,63.5]
[null,"MATERIAL (C) - TOTAL",null,null,null,null,null,null,63.5,63.5]
[]
[188,"FONTE","CÓDIGO","DESCRIÇÃO","UNIDADE","COEFIC.","CUSTO UNITÁRIO",null,"CUSTO  TOTAL (A) + (B) + (C) + (D) + (E)"]
[null,null,null,null,null,null,"DESONERADO","NÃO DESONER.","DESONERADO","NÃO DESONER."]
[null,"COMPOSIÇÃO","COMP 188_SEE","ACIONADOR MANUAL DE ALARME","UN ",null,null,null,101.49,104.37]
[null,"AGETOP_I",8,"AJUDANTE","h     ",0.8,8.75,10.14,7,8.11]
[null,"AGETOP_I",12,"ELETRICISTA","h     ",0.8,13.95,16.16,11.16,12.93]
[null,"MÃO DE OBRA (B) - TOTAL",null,null,null,null,null,null,18.16,21.04]
[null,"COTAÇÃO","COT 090_SEE","ACIONADOR MANUAL DE ALARME","UN",1,83.333333333333329,83.333333333333329,83.33,83.33]
[null,"MATERIAL (C) - TOTAL",null,null,null,null,null,null,83.33,83.33]
[]
[190,"FONTE","CÓDIGO","DESCRIÇÃO","UNIDADE","COEFIC.","CUSTO UNITÁRIO",null,"CUSTO  TOTAL (A) + (B) + (C) + (D) + (E)"]
[null,null,null,null,null,null,"DESONERADO","NÃO DESONER.","DESONERADO","NÃO DESONER."]
[null,"COMPOSIÇÃO","COMP 190_SEE","CENTRAL DE DETECÇÃO E ALARME DE 40 SETORES COM BATERIA","UN ",null,null,null,1144.93,1173.73]
[null,"AGETOP_I",8,"AJUDANTE","h     ",8,8.75,10.14,70,81.12]
[null,"AGETOP_I",12,"ELETRICISTA","h     ",8,13.95,16.16,111.6,129.28]
[null,"MÃO DE OBRA (B) - TOTAL",null,null,null,null,null,null,181.6,210.4]
[null,"COTAÇÃO","COT 092_SEE","CENTRAL DE DETECÇÃO E ALARME DE 40 SETORES COM BATERIA (PREÇO MÉDIO)","UN",1,963.33333333333337,963.33333333333337,963.33,963.33]
[null,"MATERIAL (C) - TOTAL",null,null,null,null,null,null,963.33,963.33]
[]
[24,"FONTE","CÓDIGO","DESCRIÇÃO","UNIDADE","COEFIC.","CUSTO UNITÁRIO",null,"CUSTO  TOTAL (A) + (B) + (C) + (D) + (E)"]
[null,null,null,null,null,null,"DESONERADO","NÃO DESONER.","DESONERADO","NÃO DESONER."]
[null,"COMPOSIÇÃO","COMP 024_SEE","SINALIZADOR FOTOLUMINESCENTE PARA EXTINTOR","UN ",null,"-","-",25.319999999999997,25.439999999999998]
[null,"AGETOP_I",5,"SERVENTE","h     ",0.09,8.75,10.14,0.79,0.91]
[null,"MÃO DE OBRA (B) - TOTAL",null,null,null,null,null,null,0.79,0.91]
[null,"AGETOP_I",3070,"BUCHA DE NYLON S-6","un",2,0.04,0.04,0.08,0.08]
[null,"AGETOP_I",3393,"PARAFUSO P/BUCHA S-6","un",2,0.08,0.08,0.16,0.16]
[null,"SINAPI_I",37556,"PLACA DE SINALIZACAO DE SEGURANCA CONTRA INCENDIO, FOTOLUMINESCENTE, QUADRADA, *20 X 20* CM, EM PVC *2* MM ANTI-CHAMAS (SIMBOLOS, CORES E PICTOGRAMAS CONFORME NBR 13434)","UN    ",1,24.29,24.29,24.29,24.29]
[null,"MATERIAL (C) - TOTAL",null,null,null,null,null,null,24.529999999999998,24.529999999999998]
[]
[25,"FONTE","CÓDIGO","DESCRIÇÃO","UNIDADE","COEFIC.","CUSTO UNITÁRIO",null,"CUSTO  TOTAL (A) + (B) + (C) + (D) + (E)"]
[null,null,null,null,null,null,"DESONERADO","NÃO DESONER.","DESONERADO","NÃO DESONER."]
[null,"COMPOSIÇÃO","COMP 025_SEE","SINALIZADOR FOTOLUMINESCENTE DE EMERGÊNCIA","UN ",null,"-","-",25.319999999999997,25.439999999999998]
[null,"AGETOP_I",5,"SERVENTE","h     ",0.09,8.75,10.14,0.79,0.91]
[null,"MÃO DE OBRA (B) - TOTAL",null,null,null,null,null,null,0.79,0.91]
[null,"AGETOP_I",3070,"BUCHA DE NYLON S-6","un",2,0.04,0.04,0.08,0.08]
[null,"AGETOP_I",3393,"PARAFUSO P/BUCHA S-6","un",2,0.08,0.08,0.16,0.16]
[null,"SINAPI_I",37556,"PLACA DE SINALIZACAO DE SEGURANCA CONTRA INCENDIO, FOTOLUMINESCENTE, QUADRADA, *20 X 20* CM, EM PVC *2* MM ANTI-CHAMAS (SIMBOLOS, CORES E PICTOGRAMAS CONFORME NBR 13434)","UN    ",1,24.29,24.29,24.29,24.29]
[null,"MATERIAL (C) - TOTAL",null,null,null,null,null,null,24.529999999999998,24.529999999999998]
[]
[277,"FONTE","CÓDIGO","DESCRIÇÃO","UNIDADE","COEFIC.","CUSTO UNITÁRIO",null,"CUSTO  TOTAL (A) + (B) + (C) + (D) + (E)"]
[null,null,null,null,null,null,"DESONERADO","NÃO DESONER.","DESONERADO","NÃO DESONER."]
[null,"COMPOSIÇÃO","COMP 277_SEE","MARCAÇÃO NO PISO - 1X1 M PARA EXTINTOR","M2",null,null,null,29.69,29.76]
[null,"AGETOP_I",5,"SERVENTE","h     ",3.3300000000000003E-2,8.75,10.14,0.28999999999999998,0.34]
[null,"MÃO DE OBRA (B) - TOTAL",null,null,null,null,null,null,0.28999999999999998,0.34]
[null,"SINAPI_I",5318,"SOLVENTE DILUENTE A BASE DE AGUARRAS","L     ",0.13,11.98,11.98,1.56,1.56]
[null,"SINAPI",5824,"CAMINHÃO TOCO, PBT 16.000 KG, CARGA ÚTIL MÁX. 10.685 KG, DIST. ENTRE EIXOS 4,8 M, POTÊNCIA 189 CV, INCLUSIVE CARROCERIA FIXA ABERTA DE MADEIRA P/ TRANSPORTE GERAL DE CARGA SECA, DIMEN. APROX. 2,5 X 7,00 X 0,50 M - CHP DIURNO. AF_06/2014","CHP",3.3E-3,115.5,118.69,0.38,0.39]
[null,"SINAPI_I",7343,"TINTA A BASE DE RESINA ACRILICA, PARA SINALIZACAO HORIZONTAL VIARIA (NBR 11862)","L     ",0.6,12.82,12.82,7.69,7.69]
[null,"SINAPI_I",7348,"TINTA ACRILICA PREMIUM PARA PISO","L     ",0.03,13.96,13.96,0.42,0.42]
[null,"SINAPI_I",25972,"MICROESFERAS DE VIDRO PARA SINALIZACAO HORIZONTAL VIARIA, TIPO I-B (PREMIX) - NBR 16184","KG    ",2.14,8.8800000000000008,8.8800000000000008,19,19]
[null,"SINAPI",95133,"MÁQUINA DEMARCADORA DE FAIXA DE TRÁFEGO À FRIO, AUTOPROPELIDA, POTÊNCIA 38 HP - CHP DIURNO. AF_07/2016","CHP",3.3E-3,105.93,109.48,0.35,0.36]
[null,"MATERIAL (C) - TOTAL",null,null,null,null,null,null,29.400000000000002,29.42]
[]
[235,"FONTE","CÓDIGO","DESCRIÇÃO","UNIDADE","COEFIC.","CUSTO UNITÁRIO",null,"CUSTO  TOTAL (A) + (B) + (C) + (D) + (E)"]
[null,null,null,null,null,null,"DESONERADO","NÃO DESONER.","DESONERADO","NÃO DESONER."]
[null,"COMPOSIÇÃO","COMP 235_SEE","PLACA DE SINALIZAÇÃO EM PVC COD 01 - (300X300) PROIBIDO FUMAR","UN ",null,null,null,25.319999999999997,25.439999999999998]
[null,"AGETOP_I",5,"SERVENTE","h     ",0.09,8.75,10.14,0.79,0.91]
[null,"MÃO DE OBRA (B) - TOTAL",null,null,null,null,null,null,0.79,0.91]
[null,"AGETOP_I",3070,"BUCHA DE NYLON S-6","un",2,0.04,0.04,0.08,0.08]
[null,"AGETOP_I",3393,"PARAFUSO P/BUCHA S-6","un",2,0.08,0.08,0.16,0.16]
[null,"SINAPI_I",37556,"PLACA DE SINALIZACAO DE SEGURANCA CONTRA INCENDIO, FOTOLUMINESCENTE, QUADRADA, *20 X 20* CM, EM PVC *2* MM ANTI-CHAMAS (SIMBOLOS, CORES E PICTOGRAMAS CONFORME NBR 13434)","UN    ",1,24.29,24.29,24.29,24.29]
[null,"MATERIAL (C) - TOTAL",null,null,null,null,null,null,24.529999999999998,24.529999999999998]
[]
[236,"FONTE","CÓDIGO","DESCRIÇÃO","UNIDADE","COEFIC.","CUSTO UNITÁRIO",null,"CUSTO  TOTAL (A) + (B) + (C) + (D) + (E)"]
[null,null,null,null,null,null,"DESONERADO","NÃO DESONER.","DESONERADO","NÃO DESONER."]
[null,"COMPOSIÇÃO","COMP 236_SEE","PLACA DE SINALIZAÇÃO EM PVC COD 06 - (300X300) PERIGO INFLAMÁVEL","UN ",null,null,null,25.319999999999997,25.439999999999998]
[null,"AGETOP_I",5,"SERVENTE","h     ",0.09,8.75,10.14,0.79,0.91]
[null,"MÃO DE OBRA (B) - TOTAL",null,null,null,null,null,null,0.79,0.91]
[null,"AGETOP_I",3070,"BUCHA DE NYLON S-6","un",2,0.04,0.04,0.08,0.08]
[null,"AGETOP_I",3393,"PARAFUSO P/BUCHA S-6","un",2,0.08,0.08,0.16,0.16]
[null,"SINAPI_I",37556,"PLACA DE SINALIZACAO DE SEGURANCA CONTRA INCENDIO, FOTOLUMINESCENTE, QUADRADA, *20 X 20* CM, EM PVC *2* MM ANTI-CHAMAS (SIMBOLOS, CORES E PICTOGRAMAS CONFORME NBR 13434)","UN    ",1,24.29,24.29,24.29,24.29]
[null,"MATERIAL (C) - TOTAL",null,null,null,null,null,null,24.529999999999998,24.529999999999998]